##TITLE=$$ Begin of the data block
##JCAMP-DX=5.00 $$ ACD/SpecManager v 10.08
##SPECTROMETER/DATA SYSTEM=Alpha
##DATE=09 Apr 2014 11:14:46
##DATA TYPE=INFRARED SPECTRUM
##DATA CLASS=XYDATA
##ORIGIN=
##OWNER=
##NPOINTS=1765
##FIRSTX=399.75695801
##LASTX=3997.56933594
##MAXX=3997.56933594
##MINX=399.75695801
##MAXY=0.86488479
##MINY=0.39373845
##XFACTOR=1.0000000000
##YFACTOR=1.000000000000000e-9
##FIRSTY=0.71806020
##DELTAX=2.03957629
##XUNITS=1/CM
##YUNITS=ARBITRARY UNITS
##XYDATA=(X++(Y..Y))
399.8 718060195 717602670 716366529 714847207 714430571 714596570 714272380 713710189 713402033 712905705
418.1 712905705 712099075 711829484 711994052 711951435 711552203 711255789 711310089 711007655 710024774 709595263
438.5 709595263 710225821 710639834 710077047 709700763 709953785 709806144 709346175 709468246 709481955 708582222
458.9 708582222 707796097 707608879 707466781 706942022 706376016 706117094 705487430 704436481 703907430 703917027
479.3 703917027 703635395 702957630 702607095 702478290 701891184 701276720 701267898 701135099 700211644 699262679
499.7 699262679 698969245 698591590 697647214 697028220 697046876 696559489 695271194 694391429 694028139 693090618
520.1 693090618 691841304 691139340 690610468 689417660 688054562 687445760 687105715 686226666 685306966
538.4 685306966 684924603 684412599 683195889 682179809 681963861 681479275 680218518 679159701 678557575
556.8 678557575 677543640 676118076 675181806 674626410 673431218 671770751 670632541 669773638 668394208
575.2 668394208 666841805 665799379 664772213 663267016 661957681 661415637 660914660 659817874 658849359
593.5 658849359 658416390 657571673 655843556 653971016 652235389 650275052 648410618 647398531 646952987
611.9 646952987 646168828 645441711 646148741 648302197 650676012 653084278 656165361 659553349 662357271
630.2 662357271 664878905 667728543 670414209 672279596 673791945 675510705 677109241 678469062
646.5 678469062 680178761 682255864 683641315 684221268 685518265 688290834 691393018 693846345 695627391
664.9 695627391 697211683 699569523 702149332 704587638 707044542 709036469 710748136 712782502
681.2 712782502 714823842 716303229 717555106 718999326 720292807 721145511 721945226 723001540 724017143
699.6 724017143 724772930 725750089 727236748 728669047 729807258 731229424 733050883 734710753 736158490
717.9 736158490 737806380 739627600 741214812 742639542 744285882 745969474 747271776 748368561
734.2 748368561 749656856 751003325 752071977 753079772 754422128 755960584 757406712 758739293
750.6 758739293 760128796 761590898 762983859 764330566 765698850 766968787 767924607 768708050 769587755
768.9 769587755 770451546 770974874 771125317 771187544 771152079 770800054 770348966 770208955 770329952 770549595
789.3 770549595 771219552 772792637 775052369 777550578 780372500 783663392 786993563 789842129 792365432
807.7 792365432 794879556 797011912 798350990 799327254 800344050 800916016 800630569 799841106 798784912
826 798784912 797195375 795113146 793064356 791296244 789455712 787434638 785751224 784402788 782852292
844.4 782852292 781411946 780930042 781586111 783184111 785881281 789754808 794250071 798764765 803286433
862.7 803286433 807875097 812005758 815222263 817887723 820449293 822578073 823943615 825005591
879.1 825005591 825993359 826359391 825934172 825307608 824749649 823905170 822849393 822303534 822499335 822911382
899.4 822911382 823368371 824235499 825349212 825995564 826037765 825920939 825500250 824221909 822324514
917.8 822324514 820503473 818822443 817105293 815842807 815573514 815920055 816240311 816578031 817138195
936.2 817138195 817531645 817401946 817105353 816949129 816509783 815388739 813858330 812116742 809737563
954.5 809737563 806511581 802831650 798782647 793858171 787903488 781353176 774295628 766489089
970.8 766489089 758406878 751032710 744669020 738921165 733707488 729295790 725466907 721791148
987.1 721791148 718470216 715936601 714033723 712363482 711045206 710289896 709721208 708866000 707707047
1005.5 707707047 706252635 704137266 701165855 697747111 694289386 690763712 687192619 683860779
1021.8 683860779 680771947 677587688 674277186 671158612 668300092 665512800 662842035 660501182
1038.1 660501182 658439040 656374574 654236674 652162671 650103688 647969961 646073341 644863904
1054.5 644863904 644391656 644423366 644777119 645223558 645251870 644409418 642684460 640318394 637497902
1072.8 637497902 634386301 631258190 628308356 625472367 622548878 619485438 616335452 613082528
1089.1 613082528 609892190 607185781 605186045 603723705 602563560 601608932 600794792 599946380 598936200
1107.5 598936200 597831488 596676350 595390081 593874097 591925740 589342654 586358190 583710968
1123.8 583710968 581849992 580873668 581393600 583267987 585214853 586879969 588726461 590849459 593047619
1142.2 593047619 595083475 596827030 598381162 599935174 601562142 603258014 605112433 607276022
1158.5 607276022 609820426 612852156 616556108 621022761 626156747 631743371 637566388 643477023
1174.8 643477023 649338543 655039370 660531163 665739894 670501113 674614906 677966595 680557907
1191.1 680557907 682456493 683785260 684802234 685856640 687202215 688931763 691025138 693362653
1207.4 693362653 695704222 697781622 699472010 700869203 702132285 703319728 704423189 705514729
1223.7 705514729 706729591 708067596 709460676 710946262 712556005 714234412 715920269 717594326
1240.1 717594326 719175994 720496237 721518874 722341716 722949743 723279178 723458767 723721802 724179626
1258.4 724179626 724894702 726028681 727715373 729834974 732144892 734649658 737426281 740268946
1274.7 740268946 743006825 745763242 748672962 751674473 754655361 757684350 760802507 763788223
1291 763788223 766499996 769042492 771430790 773510993 775266111 776855946 778288126 779363155 780102193
1309.4 780102193 780809700 781533837 782061100 782505274 783147871 783942461 784707129 785491943 786420405 787286699
1329.8 787286699 787753403 787861705 787963808 788157582 788185179 788068235 788166761 788477063 788666964 788686931
1350.2 788686931 788702905 788614333 788191557 787599623 787108779 786426127 785175443 783785284 782644033
1368.5 782644033 781585991 780386806 779034317 777510703 775186539 771193385 766645193 764675677
1384.9 764675677 766275406 768478274 769234776 769206285 768579662 767222106 765492737 763669968 761655033
1403.2 761655033 759364367 757268190 755547106 753836155 752223969 751116633 750317514 749204040
1419.5 749204040 748021305 747314870 746812820 746223152 745787621 745764613 745984316 746368885 746971369 747685790
1439.9 747685790 748523951 749394834 750623226 752546787 754554152 756318510 758494914 762460768 767514110
1458.3 767514110 770596325 773255527 777092934 781061172 784143686 787744522 792960584 797591686
1474.6 797591686 800474942 802866995 805013657 806544125 807550192 808583021 809352934 808988154 808056772
1493 808056772 807396114 806591034 804927886 803056359 801645219 800304651 797682226 794461846 791833520
1511.3 791833520 789429605 787177444 785286129 783818424 782162070 780160427 778429866 776855052
1527.6 776855052 775231004 773697495 772356272 771202147 770264506 769610822 768887997 767860055 766775727
1546 766775727 766090393 766011238 766173780 766237080 766369939 767031193 767089307 765914798 764687479 763639450
1566.4 763639450 762316465 760267496 757997334 755630016 752319157 748481810 744814694 740988374
1582.7 740988374 736790955 732154012 727272272 722273529 717070758 711529195 705897391 700383246
1599 700383246 694796264 689089954 683509171 678011835 672259450 666447878 661060333 655557871 649375439
1617.4 649375439 644314647 640220463 635859787 631628513 627880752 624645412 622288108 620821059
1633.7 620821059 620228350 620300412 620807827 622022986 624099553 627920270 632817030 636119127 640448272
1652 640448272 648149014 653125763 656545997 660861611 666512012 672326207 677028418 682392240 689027190
1670.4 689027190 694515705 699946880 706085026 711359560 716142356 722021878 730177939 736540318
1686.7 736540318 741097033 745995641 750572205 755988002 762444735 768689990 775808930 781280816
1703 781280816 785636842 790230572 794038594 797331095 800558031 803948998 807814538 810811758 812567830
1721.4 812567830 814288795 816335857 818435311 820568025 822584331 825106740 827485979 828843832
1737.7 828843832 830449104 832435608 834245026 835958779 837728560 839588881 841184437 842258811
1754 842258811 843346596 844561994 845630527 846698761 847530961 848224342 849105239 850083828 851064384
1772.4 851064384 851735532 852077186 852506757 853073299 853579521 854072750 854544699 854923427 855498672 856314957
1792.8 856314957 856742561 856890082 857220113 857744873 858112931 858269393 858481169 858858883 859251916 859452724
1813.2 859452724 859616339 859894514 860159099 860347450 860665441 861126423 861429751 861652970 861848712 861894429
1833.6 861894429 861942589 862103999 862302959 862550080 862923563 863175094 863184690 863183498 863188803 863232613 863414943
1856 863414943 863626361 863713026 863746583 863894641 864135802 864371955 864481807 864458561 864408433 864344656 864337146
1878.4 864337146 864456356 864572287 864555299 864537597 864708841 864856243 864782870 864752650 864829004 864818513 864741266
1900.9 864741266 864747524 864842951 864884794 864856839 864854515 864821255 864690840 864661098 864794075 864853263 864758492
1923.3 864758492 864570975 864452422 864400923 864274442 864167988 864166915 864119470 863970220 863935232 864013314 863914132
1945.7 863914132 863645017 863458633 863425910 863344312 863134503 862968087 862897754 862757146 862565100 862521529
1966.1 862521529 862535059 862340271 862018645 861838222 861783624 861655593 861462414 861379981 861369371 861263931
1986.5 861263931 861099541 861019671 860938787 860691726 860440731 860341489 860260904 860070407 859858036 859724998
2006.9 859724998 859595299 859399199 859236896 859180391 859103322 858905792 858709097 858608246 858480394 858286083
2027.3 858286083 858167112 858120084 857990861 857799053 857686043 857631743 857511997 857306898 857154071 857091784
2047.7 857091784 857014358 856916308 856864274 856820464 856712818 856590688 856543303 856541216 856473804 856356859 856275737
2070.2 856275737 856215298 856142402 856087983 856075644 856076658 856050968 856013715 856001377 855988622 855945706 855906725 855918527
2094.6 855918527 855936885 855911911 855891168 855914295 855927765 855894029 855876446 855890512 855896115 855905175 855922818 855931282
2119.1 855931282 855938017 855951130 855980456 856032908 856074214 856072009 856077254 856145442 856222451 856252313 856271625 856318772
2143.6 856318772 856352329 856369376 856442034 856537819 856584072 856612086 856662929 856729269 856797993 856865287 856947958
2166 856947958 857018948 857046485 857072294 857126951 857195377 857248306 857297421 857371271 857435346 857452691 857473016 857536793
2190.5 857536793 857586443 857591450 857581615 857576668 857590556 857624471 857671380 857707202 857704699 857683837 857697964 857736886
2215 857736886 857736528 857720733 857737303 857733190 857697070 857705116 857751667 857791543 857820928 857819438 857797861 857779682 857726276
2241.5 857726276 857644796 857598305 857579291 857563555 857555985 857530951 857485533 857441127 857385695 857327461 857293487 857290924
2265.9 857290924 857297122 857294977 857307434 857330501 857347429 857373774 857413173 857433498 857406378 857350469 857283056 857174695
2290.4 857174695 857038021 856951833 856912971 856834352 856692731 856536329 856351435 856080174 855777562 855540633
2310.8 855540633 855390787 855232656 854883313 854382157 854011178 853838921 853647411 853338718 853046119 852874756
2331.2 852874756 852706134 852389574 852009892 851758599 851800621 852416575 853578269 854211628 853706717 852641225
2351.6 852641225 851756930 851227760 850924373 850889444 851255476 851894617 852579534 853343129 854206383 855084121
2372 855084121 855938315 856726587 857367814 857884943 858337641 858662784 858808517 858842075 858881891 858980179
2392.4 858980179 859042704 859013736 858995020 859029889 859005451 858928740 858938336 858994603 858970284 858923674 858966410 859021246
2416.9 859021246 858964086 858837187 858758628 858714461 858636498 858598471 858659625 858714998 858670473 858578503 858531177
2439.3 858531177 858488500 858370304 858294368 858369708 858441412 858386040 858296812 858231843 858128607 857975900 857880771
2461.7 857880771 857900620 857894421 857775807 857686460 857656538 857538581 857383192 857350767 857373238 857308507 857187748
2484.2 857187748 857122600 857090652 856991112 856860697 856783211 856705129 856574655 856478512 856458843 856401384 856240153
2506.6 856240153 856095433 856047928 856008291 855924547 855865002 855828762 855710030 855536997 855459332 855461419 855404258
2529 855404258 855281770 855185866 855125844 855031013 854902744 854821086 854767263 854644239 854481399 854380846 854317486
2551.5 854317486 854209006 854098856 854060888 854019165 853892326 853749156 853648663 853536487 853375733 853222966
2571.9 853222966 853133798 853036046 852845550 852643609 852539420 852464557 852291107 852076948 851927340 851767480
2592.3 851767480 851568699 851404846 851225376 850990474 850775540 850612342 850454092 850238621 849980354 849757612
2612.7 849757612 849549055 849276841 848966837 848713994 848534942 848329186 848052919 847809315 847637475 847432613
2633.1 847432613 847173154 846951604 846773744 846530080 846218169 845976949 845781565 845510662 845220745 845007062
2653.5 845007062 844800711 844542205 844314098 844129443 843907416 843633413 843374074 843172073 842975259 842723668
2673.9 842723668 842484415 842317879 842116535 841819227 841518760 841271043 841014266 840724885 840453744 840195775
2694.3 840195775 839916646 839614630 839326024 839066684 838788807 838509917 838282347 838034570 837707102 837364197
2714.6 837364197 837050259 836759269 836510062 836304426 836076438 835737050 835310757 834957182 834717572 834506512
2735 834506512 834271550 833975673 833644509 833343148 833076000 832822680 832545877 832210362 831870258 831565857
2755.4 831565857 831248164 830869913 830465674 830135643 829870701 829573989 829247117 828939319 828634083 828259408
2775.8 828259408 827785313 827301383 826884866 826489687 826100290 825742900 825348020 824854791 824328363 823842943
2796.2 823842943 823342562 822751582 822155535 821623147 821082413 820486546 819838583 819167137 818505526 817853451
2816.6 817853451 817198992 816518247 815792561 815029621 814251900 813451171 812600851 811682403 810697377 809632242
2837 809632242 808321714 806611180 804575026 802326322 799978018 797797382 796079636 794876397 794059634
2855.4 794059634 793551624 793172479 792604506 791736960 790679336 789513588 788317323 787188113 786110401
2873.7 786110401 785067320 784177065 783461452 782762706 781963348 781056941 780089557 779111922 778140187
2892.1 778140187 777140200 776041806 774820089 773554444 772337556 771152020 769870520 768397152
2908.4 768397152 766731560 764877915 762825131 760667324 758637249 756946743 755697787 754872084
2924.7 754872084 754440248 754331946 754336953 754449189 754869878 755647361 756670475 757854581 759138763
2943.1 759138763 760310352 761105001 761507928 761694372 761669397 761420429 761206150 761222720 761387825 761590302
2963.5 761590302 761871159 762287438 762780130 763309300 763876855 764402628 764895558 765391767 765739501 765905201
2983.9 765905201 766074479 766353130 766725123 767021298 767018795 766768634 766376257 765849948 765297651 764719248
3004.3 764719248 764080286 763536394 763138950 762697339 762045443 761189938 760217369 759220004 758278131 757336617
3024.7 757336617 756287396 755246103 754369318 753535211 752485871 751244009 750090539 749050677 747891009
3043 747891009 746547520 745171726 743898690 742640376 741274238 739882410 738498986 737078011 735706270
3061.4 735706270 734485865 733368039 732131779 730658531 729156554 727829754 726677358 725575387
3077.7 725575387 724341035 722969532 721529603 719985783 718435109 716958225 715445042 713881493
3094 713881493 712361038 710925996 709503889 707953691 706330597 704809904 703319073 701631963 699863613
3112.4 699863613 698318899 696890891 695249915 693304479 691174567 689070821 687154353 685340822
3128.7 685340822 683435142 681408525 679387510 677493393 675632417 673561275 671284735 669024408
3145 669024408 666884542 664855003 662861705 660709679 658304930 655825078 653416276 651032686 648648798
3163.4 648648798 646325409 644030690 641659498 639209807 636721015 634220123 631742775 629304051
3179.7 629304051 626870990 624393106 621859550 619290233 616706312 614111841 611513197 608947694
3196 608947694 606432974 603938162 601440549 598915577 596349299 593803883 591343760 588925242 586482882
3214.3 586482882 584051251 581643581 579199731 576745272 574363291 572021842 569702506 567535043
3230.7 567535043 565486848 563276350 560903609 558655083 556582749 554619014 552765071 550910354
3247 550910354 548960209 546989083 545099795 543304622 541493654 539627373 537807345 536067426 534368336
3265.3 534368336 532720447 531116843 529420316 527578235 525693059 523823023 521976590 520127833
3281.6 520127833 518259943 516386926 514548957 512793958 511021137 509079397 506972611 504775822
3298 504775822 502616465 500605643 498692930 496686101 494419485 491965592 489502192 487091929 484720021
3316.3 484720021 482365936 480006665 477636784 475237995 472729504 470135391 467574984 465079963
3332.6 465079963 462689430 460394531 457986593 455385655 452753097 450142980 447618484 445254534
3348.9 445254534 442800790 440061390 437273681 434718579 432378143 430034250 427634150 425426304
3365.3 425426304 423418611 421249479 418773592 416319460 414201081 412305355 410480410 408701360
3381.6 408701360 407020807 405561388 404410392 403578937 402734846 401522696 400271952 399485886 398980170
3399.9 398980170 398188472 397073358 396160603 395636141 395265043 394894391 394441038 393965334 393738449
3418.3 393738449 393785149 393867761 394028485 394474059 395153165 395853400 396640390 397581041 398397207 398958147
3438.7 398958147 399577349 400527626 401806653 403297037 404729575 406104386 407658547 409431636 411375642
3457 411375642 413440794 415474683 417524457 419906169 422513098 424735636 426436275 428225130 430415928
3475.4 430415928 432852358 435317308 437640637 439930826 442384481 444882780 447271794 449737817
3491.7 449737817 452480823 455402225 458139330 460709125 463520885 466313094 468635499 471056104
3508 471056104 474034280 477185994 480122387 482862860 485682845 488735855 492100924 495464206 498511434
3526.4 498511434 501586854 504821599 508072138 511525035 515136838 518532276 521872044 525532067
3542.7 525532067 529559672 533488214 536886454 540286481 544142544 547987759 551671147 555557787
3559 555557787 559523344 563123643 567105055 572703123 578097045 581883252 585563660 589962482 594665825
3577.4 594665825 599471688 604215980 608566761 613313079 619473040 625200033 629340708 633778989
3593.7 633778989 639163911 644526958 649794459 654962540 659404278 663657188 668972075 674646914
3610 674646914 679869711 684892654 689322650 694438875 700637996 705074131 707487047 710090339 716125906
3628.4 716125906 723522425 727521181 730501890 733902931 737327635 740755081 743644774 745715737
3644.7 745715737 748560011 754538596 760418534 762091100 763032794 766051590 768908679 770510733
3661 770510733 771848857 772798955 773644030 776121199 778986216 779920340 782349169 785590470 786333799
3679.4 786333799 786428452 786524653 786451817 787703872 790987015 793265283 793687761 793871224 794209421 794912577
3699.8 794912577 796529710 797792077 797588587 797214448 798414886 801184416 802427530 801711142 801085651
3718.1 801085651 801312327 801983893 802683115 803283036 803059280 802197933 802410185 804592073 807036817
3736.5 807036817 807168365 805097401 803786874 805718601 806917131 806308627 808035553 809968352 809188187
3754.8 809188187 808060825 808385313 808940947 808477640 808193207 808477163 809159756 809994280 809829414
3773.2 809829414 809051216 808938026 809874296 810420096 810114503 810154378 810323775 810209334 809910774 809466124
3793.6 809466124 809549510 809709787 809782803 811199725 811723590 811294198 812046170 811902881 810305059 809371471
3814 809371471 810320377 810930789 811276674 812806427 812716722 811742663 811213732 810715020 810561121 810479403
3834.4 810479403 810807168 812181711 813051701 812983692 812698245 811703622 809697449 807845354 809730172
3852.7 809730172 814163506 814197719 811985075 810599327 810767889 811423481 810985684 811035872 812304854
3871.1 812304854 812674284 812190652 811076045 810577810 811329305 811551750 812042892 812181473 811248004
3889.4 811248004 811558604 812123597 810977817 809768319 809968889 811037898 812304318 812915683 812275827
3907.8 812275827 811349154 810696959 810128987 810163260 810909629 811232209 810898542 810795009 810853004 810469866
3928.2 810469866 810364366 811061203 811454654 811027169 810455441 810259819 810606003 810848415 810655534 810762703
3948.6 810762703 811039984 810941875 810722470 810598612 810513198 810581744 810774148 810792208 810665965 810611606
3969 810611606 810643077 810722768 810825169 810839832 810811818 810917735 811061442 811024964 810864449 810747921 810699761
3991.4 810699761 810716033 810793042 810851991
3997.5 810851991
##END=$$ End of the data block
