##TITLE=$$ Begin of the data block
##JCAMP-DX=5.00 $$ ACD/SpecManager v 10.08
##SPECTROMETER/DATA SYSTEM=Alpha
##DATE=09 Apr 2014 11:14:46
##DATA TYPE=INFRARED SPECTRUM
##DATA CLASS=XYDATA
##ORIGIN=
##OWNER=
##NPOINTS=1765
##FIRSTX=399.75695801
##LASTX=3997.56933594
##MAXX=3997.56933594
##MINX=399.75695801
##MAXY=0.86511463
##MINY=0.39397034
##XFACTOR=1.0000000000
##YFACTOR=1.000000000000000e-9
##FIRSTY=0.71744889
##DELTAX=2.03957629
##XUNITS=1/CM
##YUNITS=ARBITRARY UNITS
##XYDATA=(X++(Y..Y))
399.8G17448890q21888q04246q75473n15222k25246l30806n82755n57005n47767q77440
$$ 717448890 716627002 715822756 714947283 714432061 714206815 713876009 713293254 712736249 712188482 711311042
420.2G11311042o32286L0458J82390j57117j11998K0028o06001q78155Q6486N96106
$$ 711311042 710678756 710709214 710891604 710734487 710622489 710642517 710036516 709158361 709244847 709840953
440.5G09840953j36912o74426j99974K62916M2320k61069L7849M4167p33733p35998
$$ 709840953 709704041 709029615 708829641 709092557 709134877 708873808 708911657 708955824 708222091 707486093
460.9G07486093k77758m11987p74324p15732l72231n48125p79509j95802K54095l15547
$$ 707486093 707208335 706796348 706022024 705306292 704934061 704385936 703606427 703410625 703664720 703349173
481.3G03349173r33528n23925j0073l67582o11245k29776k66373p71285p20083j68681
$$ 703349173 702415645 701891720 701881647 701514065 700902820 700673044 700406671 699635386 698915303 698746622
501.7F98746622j88828p86602p55370l16382p93635j358390p49111k36154q78870j230181
$$ 698746622 698557794 697771192 697015822 696699440 695905805 694547415 693798304 693562150 692683280 691453099
522.1F91453099o95050n55276j163662j281023n84841l56257r72807j058340m70460
$$ 691453099 690758049 690202773 689039111 687758088 687173247 686816990 685844183 684785843 684315383
540.5F84315383n57303j153469q53300j34468m97699j245379j037598o57559j121461
$$ 684315383 683758080 682604611 681751311 681616843 681119144 679873765 678836167 678178608 677057147
558.8F77057147j449645q06152m46499j255750j698435j045823q65340j499534j632631
$$ 677057147 675607502 674801350 674354851 673099101 671400666 670354843 669489503 667989969 666357338
577.2F66357338j040935q31425j192868j154602o30200p01606j167655q82864l94523
$$ 666357338 665316403 664484978 663292110 662137508 661507308 660805702 659638047 658755183 658360660
595.6F58360660q59797j738071j872898j676619j963913k001822j137793m57764o19828
$$ 658360660 657500863 655762792 653889894 652213275 650249362 648247540 647109747 646651983 646032155
613.9F46032155m72844Q02517J992106K186656K427876L152252L347277K728403K441525
$$ 646032155 645559311 646361828 648353934 650540590 652968466 656120718 659467995 662196398 664637923
632.3F64637923K796650K743960J988411J619875J813591J597702J287758J733542
$$ 664637923 667434573 670178533 672166944 673786819 675600410 677198112 678485870 680219412
648.6F80219412K097845J337767N89311J336276K763152L053546K428949J824320J640677
$$ 680219412 682317257 683655024 684244335 685580611 688343763 691397309 693826258 695650578 697291255
666.9F97291255K304852K521992K471268K473473J905919J656532K139449K156317
$$ 697291255 699596107 702118099 704589367 707062840 708968759 710625291 712764740 714921057
683.3G14921057J495242J224935J437009J335740Q91924Q37266J098752R81331O82771
$$ 714921057 716416299 717641234 719078243 720413983 721305907 722143173 723241925 724223256 724906027
701.6G24906027R60887J499414J473785J235962J453638J774072J650274J409769J588524
$$ 724906027 725866914 727366328 728840113 730076075 731529713 733303785 734954059 736363828 737952352
720G37952352J820921J586199J398981J622856J713752J372934J177728J353562J310587
$$ 737952352 739773273 741359472 742758453 744381309 746095061 747467995 748645723 749999285 751309872
738.3G51309872R98258R91583J361728J553893J407802J293540J404822J467526J363575
$$ 751309872 752308130 753299713 754661441 756215334 757623136 758916676 760321498 761789024 763152599
756.7G63152599J353085J384378J233339R37045P79688Q15690P72059N36501K90573
$$ 763152599 764505684 765890062 767123401 768060446 768840134 769655824 770427883 770964384 771254957
775G71254957J26302p4863l66390m70698j81496J14321K57135P22945J573681K189339
$$ 771254957 771381259 771306396 770940006 770469308 770287812 770402133 770659268 771382213 772955894 775145233
795.4G75145233K461493K832234L277301L329635K942562K660930K513349J995027
$$ 775145233 777606726 780438960 783716261 787045896 789988458 792649388 795162737 797157764
811.7G97157764J277924J015186J031578N65767k64644p18475r78172j625120k209962
$$ 797157764 798435688 799450874 800482452 801048219 800783575 800065100 799086928 797461808 795251846
830.1G95251846k098918j767456j880765j975894j563788j283884j540720j484871
$$ 795251846 793152928 791385472 789504707 787528813 785965025 784681141 783140421 781655550
846.4G81655550n46277O44982J612664K668023L855347M526198M506171M481792M599810
$$ 781655550 781109273 781754255 783366919 786034942 789890289 794416487 798922658 803404450 808004260
864.8H08004260M150927L170073K583742K494037K113939J421869J103043R69827L42846
$$ 808004260 812155187 815325260 817909002 820403039 822516978 823938847 825041890 826011717 826354563
883.1H26354563m31120o23346n58316q49307j052081n30601K09987M27664M44233Q08001
$$ 826354563 825923443 825300097 824741781 823892474 822840393 822309792 822519779 822947443 823391676 824199677
903.5H24199677J072943O62029Q2850j26660m76718j275182j821637j780748j715481
$$ 824199677 825272620 825934649 826017499 825890839 825414121 824138939 822317302 820536554 818821073
921.9H18821073j737416j234651k55585L32475L25740L50892N47171L86357j02997
$$ 818821073 817083657 815849006 815593421 815925896 816251636 816602528 817149699 817536056 817433059
940.2H17433059k64823j71066m85599j128017j506389j736343k381622l241897l725827
$$ 817433059 817168236 816997170 816511571 815383554 813877165 812140822 809759200 806517303 802791476
958.6H02791476m099846m945337n946041o572306p054031p691562p988810p398367
$$ 802791476 798691630 793746293 787800252 781227946 774173915 766482353 758493543 751095176
974.9G51095176o431699n785346n209386m408360l807843l617763l287673k539933
$$ 751095176 744663477 738878131 733668745 729260385 725452542 721834779 718547106 716007173
991.2G16007173j920402j687586j353324q04603n78642q24809j139164j492917k201736
$$ 716007173 714086771 712399185 711045861 710241258 709662616 708837807 707698643 706205726 704003990
1009.6G04003990l020346l399909l399074l446281l526509l355145l154457l248513
$$ 704003990 700983644 697583735 694184661 690738380 687211871 683856726 680702269 677453756
1025.9F77453756l334224l092408k798319k734065k656698k340734k037525k035976
$$ 677453756 674119532 671027124 668228805 665494740 662838042 660497308 658459783 656423807
1042.2F56423807k129376k078235k074182k144814j912236j226127m70519K6584L54051
$$ 656423807 654294431 652216196 650142014 647997200 646084964 644858837 644388318 644414902 644768953
1060.6F44768953M64022K3962q69632j732409k346814k808154l111660l111303k909481
$$ 644768953 645232975 645256937 644387305 642654896 640308082 637499928 634388268 631276965 628367484
1078.9F28367484k813101k928972l069222l134311l213882l193736k746344j977324
$$ 628367484 625554383 622625411 619556189 616421878 613207996 610014260 607267916 605290592
1095.2F05290592j396954j127959r40263q04782q76665j041651j105487j149952j318634
$$ 605290592 603893638 602765679 601825416 601020634 600143969 599102318 597996831 596846879 595528245
1113.6E95528245j572192j944959k542257k978206k683759j924634j013994N53250
$$ 595528245 593956053 592011094 589468837 586490631 583806872 581882238 580868244 581421494
1129.9E81421494J951457J972734J614213J797379K101600K187192K046943J768112
$$ 581421494 583372951 585345685 586959898 588757277 590858877 593046069 595093012 596861124
1146.2E96861124J554489J528204J616776J720190J881301K169967K552271L041327
$$ 596861124 598415613 599943817 601560593 603280783 605162084 607332051 609884322 612925649
1162.6F12925649L686070M446805N130767N568624N790412N895436N868554N692423
$$ 612925649 616611719 621058524 626189291 631757915 637548327 643443763 649312317 655004740
1178.9F55004740N451917N173624M763424M133523L348172K563834J875937J329958
$$ 655004740 660456657 665630281 670393705 674527228 677875400 680439234 682315171 683645129
1195.2F83645129J032770J072109J371681J744330K077461K334177K355099K054453
$$ 683645129 684677899 685750008 687121689 688866019 690943480 693277657 695632756 697687209
1211.5F97687209J652777J400053J287341J197160J130044J144588J221478J307786
$$ 697687209 699339986 700740039 702027380 703224540 704354584 705499172 706720650 708028436
1227.8G08028436J412093J533687J632631J675785J668751J644135J564800J345814
$$ 708028436 709440529 710974216 712606847 714282632 715951383 717595518 719160318 720506132
1244.1G20506132J049757Q23378O07610L42429J96933K72453M63665P05361J100958
$$ 720506132 721555889 722379267 722986877 723329306 723526239 723798692 724262357 724967718 726068676
1262.5G26068676J658499K108514K288342K472102K758980K846420K756357K779186
$$ 726068676 727727175 729835689 732124031 734596133 737355113 740201533 742957890 745737076
1278.8G45737076K930879L003240K967477L030479L144026L013432K705633K527297
$$ 745737076 748667955 751671195 754638672 757669151 760813177 763826609 766532242 769059539
1295.1G69059539K408922K102792J729131J552343J452208J133680P69675O97553P06970
$$ 769059539 771468461 773571253 775300384 776852727 778304935 779438615 780208290 780905843 781612813
1313.5G81612813N13375M40538O74427Q19146P37727P40469Q94188Q44539M63545J39177
$$ 781612813 782126188 782566726 783241153 784060299 784798026 785538495 786432683 787277222 787740767 787879944
1333.9G87879944J63317K33709J8001j29581R9779K93672J76787K7955J6153p7725
$$ 787879944 788043261 788276970 788294971 788165390 788265169 788558841 788735628 788763583 788779736 788702011
1354.3G88702011l91245n75363m93110o91056j249671j377463j137912j065553j213729
$$ 788702011 788310766 787735403 787242293 786551237 785301566 783924103 782786191 781720638 780506909
1372.6G80506909j375258j525164k304613l984809m553497j975834J580894K174913
$$ 780506909 779131651 777606487 775301874 771317065 766763568 764787734 766368628 768543541
1388.9G68543541P43807k8789o15001j333117j704813j794755j981020k271950k106965
$$ 768543541 769287348 769258559 768643558 767310441 765605628 763810873 761829853 759557903 757450938
1407.3G57450938j736521j723171j631140j103282p68364j106083j200140p25806n19931
$$ 757450938 755714417 753991246 752360106 751256824 750488460 749382377 748182237 747456431 746936500
1425.7G46936500o02066m44413k2888K21968L80039O12676P21932Q19385Q67486J241266
$$ 746936500 746334434 745890021 745867133 746089101 746469140 747081816 747803748 748623133 749490619 750731885
1446G50731885J893342J969695J775861K202630L932536M981160L089428K681434L835320
$$ 750731885 752625227 754594922 756370783 758573413 762505949 767487109 770576537 773257971 777093291
1464.4G77093291L980160L096819L583908N193591M660428K933323K417565K161145
$$ 777093291 781073451 784170270 787754178 792947769 797608197 800541520 802959085 805120230
1480.7H05120230J557946J024187J028597P61509l70801r21666o58810q46804j704692
$$ 805120230 806678176 807702363 808730960 809492469 809121668 808200002 807541192 806694388 804989696
1499.1H04989696j878560j423895j387716k637326l159881k578080k357662k232015
$$ 804989696 803111136 801687241 800299525 797662199 794502318 791924238 789566576 787334561
1515.4G87334561j936018j517952j661717j992643j725197j551628j585842j491725
$$ 787334561 785398543 783880591 782218874 780226231 778501034 776949406 775363564 773871839
1531.7G73871839j292348j110256r30428p22528p71224j004756j056373o38783l2663
$$ 773871839 772579491 771469235 770538807 769816279 769045055 768040299 766983926 766345143 766312480
1550.1G66312480J48654j2279N3406O07491Q4340j111209j184344j008153j301051
$$ 766312480 766461134 766448855 766502261 767109752 767194092 766082883 764898539 763890386 762589335
1568.4G62589335k083838k310812k373457l311634l836691l632605l774763m174709
$$ 762589335 760505497 758194685 755821228 752509594 748672903 745040298 741265535 737090826
1584.7G37090826m638791m890382n038143n260825n571007n640507n522013n597234
$$ 737090826 732452035 727561653 722523510 717262685 711691678 706051171 700529158 694931924
1601.1F94931924n737245n603909n489826n751908n811811n378663n538464o253481
$$ 694931924 689194679 683590770 678100944 672349036 666537225 661158562 655620098 649366617
1617.4F49366617n066991m059076m345536m256845l804445l276110k351761j465559
$$ 649366617 644299626 640240550 635895014 631638169 627833724 624557614 622205853 620740294
1633.7F20740294o22212Q4400N57780J258135K103507L825128M884005L301680M354835
$$ 620740294 620118082 620202482 620760262 622018397 624121904 627947032 632831037 636132717 640487552
1652F40487552P766008N020976L435731M336000N684554N836845M685878N321741O622732
$$ 640487552 648253560 653274536 656710267 661046267 666730821 672567666 677253544 682575285 689198017
1670.4F89198017N502403N446672O182611N304695M758358N805552Q087813O399930
$$ 689198017 694700420 700147092 706329703 711634398 716392756 722198308 730286121 736686051
1686.7G36686051M627049M932999M575253N393982O457269O263733P073522N412280
$$ 736686051 741313100 746246099 750821352 756215334 762672603 768936336 776009858 781422138
1703G81422138M333914M601359L844798L327727L235042L377199L841877L001094J791954
$$ 781422138 785756052 790357411 794202209 797529936 800764978 804142177 807984054 810985148 812777102
1721.4H12777102J759768K050399K052725K077520J989901K527892K420366J397789
$$ 812777102 814536870 816587269 818639994 820717514 822707415 825235307 827655673 829053462
1737.7H29053462J598775J960158J814664J728058J770436J863182J610160J080811
$$ 829053462 830652237 832612395 834427059 836155117 837925553 839788735 841398895 842479706
1754H42479706J068055J192511J084625J093626Q27730O85990Q79288R70244R78231
$$ 842479706 843547761 844740272 845824897 846918523 847746253 848432243 849311531 850281775 851260006
1772.4H51260006O76394L31700M12404N69821N28931M97103M66049L81172N45620P81775
$$ 851260006 851936400 852268100 852680504 853250325 853779256 854276359 854742408 855123580 855669200 856450975
1792.8H56450975M45783J74284L39508N22077L55959J61529K48432M01378L85642K10583
$$ 856450975 856896758 857071042 857410550 857932627 858288586 858450115 858698547 859099925 859485567 859696150
1813.2H59696150J91092K72334K13623J38819K96056M53055L12627K51710K25961Q0347
$$ 859696150 859887242 860159576 860373199 860512018 860808074 861261129 861573756 861825466 862051427 862131774
1833.6H62131774Q1003J55151J65939K18034L45171K54213M4167K1756k265J8954J65701
$$ 862131774 862212777 862367928 862533867 862751901 863097072 863351285 863395452 863417208 863414943 863433897 863599598
1856H63599598K09690R9718N4956J49786K08497J98364J10746J1742k0325n0426P272
$$ 863599598 863809288 863909006 863963962 864113748 864322245 864520609 864631355 864643097 864622772 864572346 864579618
1878.4H64579618J17838O6638n0664K6822K21968J52409q4519l8326P0036l3498r5547
$$ 864579618 864697456 864764094 864713430 864740252 864962220 865114629 865030110 864991784 865061820 865028322 864932775
1900.9H64932775J8001R3043J3590k5630K8908j6689j25110k8491J39653P3850r7692
$$ 864932775 864950776 865043819 865057409 865031779 865060687 865043998 864918888 864890397 865030050 865103900 865006208
1923.3H65006208j93178j14322o1154j45674j11222Q166l9042j49905l7790Q0884j01507
$$ 865006208 864813030 864698708 864637554 864491880 864380658 864388824 864349782 864199877 864162087 864242971 864141464
1945.7H64141464k66552j61469j7285r8527k25782j57177o4016j61171k33769p8380
$$ 864141464 863874912 863713443 863696158 863597631 863371849 863214672 863150656 862989485 862755716 862677336
1966.1H62677336J0133j57893k57850j31070m5658j61767k43246r6381O139j14977
$$ 862677336 862687469 862529576 862271726 862140656 862094998 861933231 861689985 861593604 861599743 861484766
1986.5H61484766j76549m0591m1961k59221k76685r7513o1750j87457k25544j37210
$$ 861484766 861308217 861267626 861225665 860966444 860689759 860592246 860530496 860343039 860117495 859980285
2006.9H59980285j19090j88112j63555n7519p7426k07365k17140j20460j35303j85013
$$ 859980285 859861195 859673083 859509528 859452009 859374583 859167218 858950078 858829618 858694315 858509302
2027.3H58509302r0599j8418j29342k14755j35363p4923j41859j92046r9480k5213
$$ 858509302 858418703 858400285 858270943 858056188 857920825 857845902 857704043 857511997 857412517 857387304
2047.7H57387304r4175j47581q0645l1054p6890j05798n3704j1385o7889j12296p7009
$$ 857387304 857293129 857145548 857064903 857033849 856956959 856851161 856797457 856786072 856718183 856605887 856528878
2070.2H56528878o8843q6725m2319J7643M530n2870m8577P271j0848p7963o8903O438
$$ 856528878 856460035 856373310 856330991 856348634 856353164 856300294 856251717 856258988 856248140 856170177 856101274 856107712
2094.6H56107712L1352J0848K2173L9339M411m8161l5822J371m113j4782O616M0054
$$ 856107712 856139064 856149912 856172085 856211424 856215835 856167674 856131852 856133223 856129110 856114328 856120944 856160998
2119.1H56160998M0233M173J4067N1259M0234L814O616O1155O2167Q822K0921P9632
$$ 856160998 856201231 856205404 856219471 856270730 856310964 856314778 856321394 856382549 856444716 856453538 856474459 856554091
2143.6H56554091O9559K8610O0499R0301L2544j6988M1008J13666R3461M5418N4002
$$ 856554091 856623650 856652260 856712759 856803060 856835604 856818616 856859624 856973290 857066751 857112169 857166171
2166H57166171P5758O4730N1797P4505P6890J8418J3113P7844Q2254J8537q34L9458
$$ 857166171 857241929 857306659 857358456 857432961 857509851 857528269 857541382 857619226 857701480 857720017 857719183 857758641
2190.5H57758641N1320L9697M7445L9458P749p153k026P867K3187J2397j6272k6643
$$ 857758641 857809961 857849658 857897103 857936561 857944310 857937157 857935131 857942998 857966185 857978582 857962310 857935667
2215H57935667k9027J2338N7459J5974k2471J7941N5313N6386L2186j4066j7345n901
$$ 857935667 857906640 857918978 857976437 857992411 857969940 857987881 858043194 858099580 858131766 858117700 858100355 858094454
2239.4H58094454o0320r5785l8504N722n603m947k6763o6340n9485n5969n0306Q285
$$ 858094454 858034134 857938349 857899845 857905567 857899964 857895017 857868254 857801914 857742429 857686460 857636154 857644439
2263.9H57644439L9220p034l7610j2160o377k2769J3470P6175Q4519L875r3281j20938
$$ 857644439 857683659 857676625 857639015 857626855 857620478 857597709 857611179 857687354 857771873 857775748 857682467 857561529
2288.4H57561529j29521j12355k3961J3113p6056j88529k07782j79767k41995l06726
$$ 857561529 857432008 857319653 857295692 857308805 857232749 857044220 856836438 856656671 856414676 856107950
2308.8H56107950k33829j23977j48476l39627m91321l97801j93239j84297l27349l07739
$$ 856107950 855874121 855750144 855601668 855262041 854770720 854372919 854179680 853995383 853668034 853360295
2329.2H53360295j37090j32084l40939m15206k02000J37270O53803J116455N78999
$$ 853360295 853223205 853091121 852750182 852334976 852132976 852270246 852924049 854040504 854619503
2347.5H54619503n08547j035154q65996n58614l69072n7996M21823P27295P51496P59244
$$ 854619503 854110956 853075802 852209806 851651192 851282120 851224124 851645947 852373242 853124738 853883982
2367.9H53883982Q20577Q65280Q53718P66754O22570M93467M05431K97725J60814M1067
$$ 853883982 854704559 855569839 856423557 857190311 857812881 858306348 858711779 859009504 859170318 859211385
2388.3H59211385j1265L7670P5162L0934L219J3292o855n722N1737M6134m9293q9467
$$ 859211385 859200120 859237790 859312952 859343886 859347105 859360397 859353542 859347820 859399557 859445691 859396398 859306931
2412.8H59306931k0921J2696m2677p1227k7001k7657q3923m3154L7551J2934o8664
$$ 859306931 859286010 859298706 859256029 859184802 859157801 859130144 859046221 859003067 859040618 859053552 858984888
2435.2H58984888o7294P987j5199j13070q7500J1504L338n6982n6386m1068p4446j21236
$$ 858984888 858917594 858925581 858910382 858797312 858709812 858721316 858724654 858667672 858611286 858570218 858495772 858374536
2459.7H58374536q8692k1636n4062j02281m4108m887r0003j49250p1049j8775r1613
$$ 858374536 858285844 858264208 858210146 858107865 858063757 858058870 857968867 857819617 857748568 857729793 857638180
2482.1H57638180j35541p2479l4034q9050j17182o4791o3240j29461j14739k5273j3590
$$ 857638180 857502639 857430160 857396126 857307076 857189894 857125103 857061863 856932402 856817663 856792390 856778800
2504.6H56778800j00016j23322o5804r0897j49607q0526j0729p3135j22368r3997q5592
$$ 856778800 856678784 856555462 856489658 856398761 856249154 856168628 856157899 856084764 855962396 855868399 855782807
2527H55782807j00732q5533m5001l5584r3222j35839q8513n9843j18077j35481q4281
$$ 855782807 855682075 855596542 855551541 855515957 855422735 855286896 855198383 855138540 855020463 854884982 854800701
2549.4H54800701r5904j46568j08659k4378k3246j18732j75000j05142o4731j43766
$$ 854800701 854704797 854558229 854449570 854425192 854401946 854283214 854108214 854003072 853938341 853794575
2569.8H53794575j71721j22845j21475j53839j31607q3149j38640k27869j86741j14381
$$ 853794575 853622854 853500009 853378534 853224695 853093088 853009939 852871299 852643430 852456689 852342308
2590.2H52342308j63436k40803k18570j45853j44482k31504k56002j78039j82092k59161
$$ 852342308 852178872 851938069 851719499 851573646 851429164 851197660 850941658 850763619 850581527 850322366
2610.6H50322366k19882j71721k61128l17156k35081j60753k02775k66314k36452j81079
$$ 850322366 850102484 849930763 849669635 849352479 849117398 848956645 848753870 848487556 848251104 848070025
2631H48070025k10344k57135k46525k27034k36392k51591k15351j86623k46822k92004
$$ 848070025 847859681 847602546 847356021 847128987 846892595 846641004 846425653 846239030 845992208 845700204
2651.4H45700204k46107k27392k64466k47478j92702j94967k40266k45094k11716k14756
$$ 845700204 845454097 845226705 844962239 844714761 844522059 844327092 844086826 843841732 843630016 843415260
2671.8H43415260k63691k53141j86026k09331l02613l26514k90275l00467l00705k17736
$$ 843415260 843151569 842898428 842712402 842503071 842200458 841873944 841583669 841283202 840982497 840764761
2692.2H40764761j81496k55466l14533k81454k35617k51710k74062k75731l04342l28898
$$ 840764761 840583265 840327799 840013266 839731812 839496195 839244485 838970423 838694692 838390350 838061452
2712.6H38061452l07202k82169k89261k88487k49385k38598l09646l84986l68715l00646
$$ 838061452 837754250 837472081 837182820 836894333 836644948 836406350 836096704 835711718 835343003 835042357
2733H35042357k45750k25603k53558k72453k67506k82228k59161k44975l25262l58880
$$ 835042357 834796607 834571004 834317446 834044993 833777487 833495259 833236098 832991123 832665861 832306981
2753.4H32306981l12924l17991l70085l78371l05533k53618l02017l51667l49998l45707
$$ 832306981 831994057 831676066 831305981 830927610 830622077 830368459 830066442 829714775 829364777 829019070
2773.8H29019070l82126m47809m52698m18842m32133m13716l39806l42488m39883n12600
$$ 829019070 828636944 828189135 827736437 827317595 826885462 826471746 826131940 825789452 825349569 824836969
2794.2H24836969m91798m92095n90504o34372n81682n44965n65290o25849o72579o72817
$$ 824836969 824345171 823853076 823262572 822628200 822046518 821501553 820936263 820310414 819637835 818965018
2814.6H18965018o55830o53863o76215p28190p80523p99655q01743q08358q75294j005292
$$ 818965018 818309188 817655325 816979110 816250920 815470397 814670742 813868999 813060641 812185347 811180055
2835H11180055j121521j328111j695036k036334k247929k309799k134085j717329j220942
$$ 811180055 810058534 808730423 807035387 804999053 802751124 800441325 798307240 796589911 795368969
2853.3G95368969q14020n45204m48465n80251q28267j006841j136899j222193j167119
$$ 795368969 794554949 794009745 793561280 792981029 792152762 791145921 790009022 788786829 787619710
2871.7G87619710j063108j006425r14574p80940p10666p48038q38161r17494r91762
$$ 787619710 786556602 785550177 784635603 783854663 783143997 782395959 781557798 780640304 779648542
2890.1G79648542j035213j027346j085281j223087j265169j205682j210869j320779
$$ 779648542 778613329 777585983 776500702 775277615 774012446 772806764 771595895 770275116
2906.4G70275116j457632j622915j862466k096296k151072j961886j644731j264274
$$ 770275116 768817484 767194569 765332103 763235807 761084735 759122849 757478118 756213844
2922.7G56213844q41558m18544j00791j0312Q3744M09008P62343R84728J183093J314759
$$ 756213844 755372286 754953742 754852951 754842639 754926383 755335391 756097734 757082462 758265555 759580314
2943.1G59580314J195014Q20577M06742J69992j5258k38896k33471J3530J87218K20299
$$ 759580314 760775328 761595905 762002647 762172639 762157381 761918485 761685014 761698544 761885762 762106061
2963.5G62106061K81453L87907M51744N21600N87463N40972N16415N28335L74019J86682
$$ 762106061 762387514 762775421 763227165 763748765 764336228 764877200 765393615 765921950 766295969 766482651
2983.9G66482651J72258K72095L75867K96652j6749k58744l77714n06699n75245o12259
$$ 766482651 766654909 766927004 767302871 767599523 767582774 767324030 766946316 766439617 765864372 765252113
3004.3G65252113o20246n09083l93450m78923p04647q75890r55462r63867r21071r27865
$$ 765252113 764631867 764122784 763729334 763250411 762545764 761669874 760714412 759750545 758829474 757901609
3024.7G57901609j024842j032472r01878q54969j041710j236379j145006j006245j116634
$$ 757901609 756876767 755844295 754942417 754087448 753045738 751809359 750664353 749658108 748541474
3043G48541474j333177j406014j288831j242816j354218j413584j441657j464069j349151
$$ 748541474 747208297 745802283 744513452 743270636 741916418 740502834 739061177 737597108 736247957
3061.4G36247957j173496j089871j199007j440585j514077j359463j163662j088559
$$ 736247957 735074461 733984590 732785583 731344998 729830921 728471458 727307796 726219237
3077.7G26219237j228929j404345j473605j518906j488328j431703j535654j649141
$$ 726219237 724990308 723585963 722112358 720593452 719105124 717673421 716137767 714488626
3094G14488626j549602j360416j355052j569808j681626j539290j477182j673340j743556
$$ 714488626 712939024 711578608 710223556 708653748 706972122 705432832 703955650 702282310 700538754
3112.4G00538754j537978j461923j661897j945317k125799k072514j901209j832247
$$ 700538754 699000776 697538853 695876956 693931639 691805840 689733326 687832117 685999870
3128.7F85999870j910448k013922k014040j912296j888037k077162k255857k245367
$$ 685999870 684089422 682075500 680061460 678149164 676261127 674183965 671928108 669682741
3145F69682741k162218k052486j993000k139688k377152k454639k395809k357602k350211
$$ 669682741 667520523 665468037 663475037 661335349 658958197 656503558 654107749 651750147 649399936
3163.4F49399936k323150k342463k424419k458215k447426k446890k459168k483785
$$ 649399936 647076786 644734323 642309904 639851689 637404263 634957373 632498205 630014420
3179.7F30014420k511263k510906k507150k532482k561450k580285k589583k577484
$$ 630014420 627503157 624992251 622485101 619952619 617391169 614810884 612221301 609643817
3196F09643817k533674k517700k534748k544641k558947k549708k494394k451480k447903
$$ 609643817 607110143 604592443 602057695 599513054 596954107 594404399 591910005 589458525 587010622
3214.3E87010622k428174k394140k385795k390623k380431k358198k302468k171397
$$ 587010622 584582448 582188308 579802513 577411890 575031459 572673261 570370793 568199396
3230.7E68199396k068937k181649k360761k311707k127587j975298j864374j881003
$$ 568199396 566130459 563948810 561588049 559276342 557148755 555173457 553309083 551428080
3247E51428080j974225j955629j848817j770377j813054j904726j861453j749575j709819
$$ 551428080 549453855 547498226 545649409 543879032 542065978 540161252 538299799 536550224 534840405
3265.3E34840405j698494j646817j655578j764536j869738j901567j854718j842618
$$ 534840405 533141911 531495094 529839516 528074980 526205242 524303675 522448957 520606339
3281.6E20606339j884758j864553j800001j783728j842439j940668k046228k162754
$$ 520606339 518721581 516857028 515057027 513273299 511430860 509490192 507443964 505281210
3298E05281210k172291k005339j883596k027840k318292k477795k481223k443403k402573
$$ 505281210 503108919 501103580 499219984 497192144 494873852 492396057 489914834 487471431 485068858
3316.3D85068858k375812k372771k357662k352297k474427k606959k585679k502233
$$ 485068858 482693046 480320275 477962613 475610316 473135889 470528930 467943251 465441018
3332.6D65441018k358198k235949k399474k635926k649844k637595k578854k372742
$$ 465441018 463082820 460846871 458447397 455811471 453161627 450524032 447945178 445572436
3348.9D45572436k415270k740890k834051k589077k336711k329171k406597k226293
$$ 445572436 443157166 440416276 437582225 434993148 432656437 430327266 427920669 425694376
3365.3D25694376k022683k176434k480537k461553k138555j924961j837492j750708
$$ 425694376 423671693 421495259 419014722 416553169 414414614 412489653 410652161 408901453
3381.6D08901453j631290j440614j157522q48443q66860j223445j260489p77990m63932
$$ 408901453 407270163 405829549 404672027 403823584 402956724 401733279 400472790 399694800 399230868
3399.9C99230868p75367j156867r53495n30661l64780l49611m19736m60625k47895
$$ 399230868 398455501 397298634 396345139 395814478 395449698 395100087 394680351 394219726 393971831
3418.3C93971831j491N1857J87158M97431O94841O42299P06703R54091Q85487N62728
$$ 393971831 393970340 394022197 394209355 394706786 395401627 396043926 396750629 397704720 398590207 399152935
3438.7C99152935N85913R34631J245737J486182J508057J430124J528383J731842J956702
$$ 399152935 399738848 400673479 401919216 403405398 404913455 406343579 407871962 409603804 411560506
3457D11560506K116263K057164K043069K364904K573221K214045J720816J774788K170473
$$ 411560506 413676769 415733933 417777002 420141906 422715127 424929172 426649988 428424776 430595249
3475.4D30595249K447843K497733K350837K282381K463073K544671K426803K446562
$$ 430595249 433043092 435540825 437891662 440174043 442637116 445181787 447608590 450055152
3491.7D50055152K645672K835601K732635K582699K786517K786010K371759K481013
$$ 450055152 452700824 455536425 458269060 460851759 463638276 466424286 468796045 471277058
3508D71277058L047586L230005K956152K692640K766907L014267L333956L353804L056854
$$ 471277058 474324644 477554649 480510801 483203441 485970348 488984615 492318571 495672375 498729229
3526.4D98729229L096700L277361L289640L502786L675103L401459L320515L661036
$$ 498729229 501825929 505103290 508392930 511895716 515570819 518972278 522292793 525953829
3542.7E25953829M013121L922403L406227L374815L840208L866911L719211L940284
$$ 525953829 529966950 533889353 537295580 540670395 544510603 548377514 552096725 556037009
3559E56037009L984093L546417L899574N558312N457282L891111L740311M420697M746020
$$ 556037009 560021102 563567519 567467093 573025405 578482687 582373798 586114109 590534806 595280826
3577.4E95280826M864097M772126M338563M684091O089210N754769M219949M483760
$$ 595280826 600144923 604917049 609255612 613939703 620028913 625783682 630003631 634487391
3593.7F34487391N394816N346239N244195N169094M479289M326462N386413N705952
$$ 634487391 639882207 645228446 650472641 655641735 660121024 664447486 669833899 675539851
3610F75539851N245924N017162M328966M966497O137014M501164K550959K777875O106257
$$ 675539851 680785775 685802937 690131903 695098400 701235414 705736578 708287537 711065412 717171669
3628.4G17171669P234931L862381L021657L499687L461898L431618K886533K029062
$$ 717171669 724406600 728268981 731290638 734790325 738252223 741683841 744570374 746599436
3644.7G46599436K766490N913853N909741J727462R31859L021896K905011J611233
$$ 746599436 749365926 755279779 761189520 762916982 763848841 766870737 769775748 771386981
3661G71386981J325846R47714Q31425K458989K857030R27031K420008L232241P42852
$$ 771386981 772712827 773660541 774491966 776950955 779807985 780735016 783155024 786387265 787130117
3679.4G87130117J06693R6738j03354J209139L294290K341985M59731J88827L08693
$$ 787130117 787236810 787333548 787230194 788439333 791733623 794075608 794535339 794724166 795032859
3697.7G95032859O47426J595139J254857k54095m09305J217902K759933J285136n93841
$$ 795032859 795680285 797275424 798530281 798276186 797866881 799084783 801844716 803129852 802536011
3716.1H02536011n95451J62542O58453P07924N43535k74837q48532J90020K119422
$$ 802536011 801940560 802103102 802761555 803469479 804013014 803738177 802889645 803079665 805199087
3734.4H05199087K527833K76744k032697j363635J879632J163960p07865J610637J962423
$$ 805199087 807726920 808003664 805970967 804607332 806486964 807650924 806943059 808553696 810516119
3752.8H10516119o72400j041710L95715N77271m99547l20971K79665O91474Q32557
$$ 810516119 809843719 808802009 809197724 809774995 809275448 808954477 809234142 809925616 810758173
3771.1H10758173j66296p88928j53243R03189N78106k65301K5392J62184q3148k74897
$$ 810758173 810591877 809802949 809649706 810552895 811131001 810865700 810891092 811053276 810970128 810695231
3791.5H10695231m46320N8294J20640N0663J445950N74708m21584P54058j26064j582205
$$ 810695231 810248911 810307205 810427845 810478508 811924458 812499166 812077582 812831640 812705576 811123371
3811.9H11123371q99136R63867O29723L67939J451731j58191r68039m72665m38094
$$ 811123371 810224235 811188102 811817825 812185764 813637495 813479304 812511265 812038600 811600506
3830.3H11600506j56641r6917K86162J277387Q47817m0114k57731r46283j967907j798451
$$ 811600506 811443865 811346948 811633110 812910497 813758314 813718200 813460469 812514186 810546279 808747828
3850.7H08747828J911938M326701K8432k126158j369118J05679N92410m31597Q4639
$$ 808747828 810659766 814986467 815014899 812888741 811519623 811625302 812217712 811786115 811870754
3869H11870754J260400L63946m64797j094938n32210O76751J85729M57286J36257q60334
$$ 811870754 813131154 813495100 813030303 811935365 811403155 812079906 812265635 812722921 812859178 811998844
3889.4H11998844L92914O02424j125336j176357K40863J074016J149475M88281o44087
$$ 811998844 812391758 812994182 811868846 810692489 810933352 812007368 813156843 813645124 813001037
3907.8H13001037q92938o04987n02050P5400P71106L21507l64780q9229J07348l48568
$$ 813001037 812108099 811503112 811001062 811076462 811847568 812169075 811804295 811715066 811822414 811473846
3928.2H11473846r0777O54637L20256m42564n16415j51932L16262J78516k34068J11342
$$ 811473846 811383069 812037706 812357962 811915398 811398983 811247051 811563313 811741829 811507761 811619103
3948.6H11619103L12626q4936k46287j54018o7890J34170K34545K3722j04487l7312
$$ 811619103 811931729 811846793 811600506 811446488 811378598 811512768 811747313 811771035 811666548 811629236
3969H11629236j0908Q762P5042M828o6161O2347J31428j3709j40548o5625L0875R895
$$ 811629236 811618328 811627090 811702132 811706960 811640799 811703146 811834574 811820865 811680317 811614692 811645567 811655462
3993.4H11655462P212L2723
$$ 811655462 811662674 811695397
3997.5H11695397
$$ 811695397
##END=$$ End of the data block
