##TITLE=$$ Begin of the data block
##JCAMP-DX=5.00 $$ ACD/SpecManager v 10.08
##SPECTROMETER/DATA SYSTEM=Alpha
##DATE=09 Apr 2014 11:14:46
##DATA TYPE=INFRARED SPECTRUM
##DATA CLASS=XYDATA
##ORIGIN=
##OWNER=
##NPOINTS=1765
##FIRSTX=399.75695801
##LASTX=3997.56933594
##MAXX=3997.56933594
##MINX=399.75695801
##MAXY=0.86559719
##MINY=0.39457247
##XFACTOR=1.0000000000
##YFACTOR=1.000000000000000e-9
##FIRSTY=0.71946138
##DELTAX=2.03957629
##XUNITS=1/CM
##YUNITS=ARBITRARY UNITS
##XYDATA=(X++(Y..Y))
399.8G19461381j373052j413703j213372p48813m18782l39806l55065j64926j35780
418.1G13298082p00891o12557q6069r8526l26514k16544j71363n09322n30362L4570
438.5G10080504L01004k55168o48617j20640K60889p9155k42590K66253N2929j070141
458.9G08545268r71675k65181k48015m75526l93391l21567q21054j004636k38180K07424
479.3G04013467l30925q21531m61817p6174m41731o62803j16885l1888q33273r72987
499.7F99263453l02612m01199r89914o65307q2791o13630j355052r33230l43144q01026
520.1F92775548j165331o45578m48584j091421j215577n28753l70622r11414r47058
538.4F85451210m91441n37097j065910j015186m74692o39796j155555j006067o98507
$$ plain form
399.8 719461381 718088329 716674626 715461254 714712441 714293659 713953853 713598788 713433862 713298082
418.1 713298082 712597191 711984634 711898565 711800039 711473525 711256981 711085618 710576296 710045934 710080504
438.5 710080504 710381508 710126340 709477723 709357083 709617972 709538817 709296227 709562480 709615409 708545268
458.9 708545268 707573593 707308412 707060397 706584871 706191480 705869913 705048859 704044223 703806043 704013467
479.3 704013467 703682542 702861011 702399194 702323020 701881289 701218486 701101601 701069713 700236440 699263453
499.7 699263453 698960841 698559642 697569728 696904421 696821630 696208000 694852948 693919718 693576574 692775548
520.1 692775548 691610217 690964639 690516055 689424634 688209057 687680304 687309682 686398268 685451210
538.4 685451210 684959769 684422672 683356762 682341576 681866884 681227088 680071533 679065466 678366959
556.8F78366959j108467j441420p91549l13878j020074j641751j200676r10937j462400
575.2F68475807j637399j030148r34124j422703j272857n09083m23014j025260r82165
593.5F59239054n02110q87036j700223j727581j513421j887560k029002j244664n72741
611.9F47174716p41482o17564P59423K214134K575636K631843L007650L073693K596318
630.2F62674367K572597K998888K687633J834095J629412J847148J566887J294434
646.5F79105461J782238K128840J334309N65350J299024K693951L005028K403974J833022
664.9F96151197J783848K477407K579570K505899K464115J888812J662910K094328
681.2G13608086K082706J436948J261950J639068J498759Q77559P45416R87947R00685
$$ plain form
556.8 678366959 677258492 675817072 675025523 674711645 673691571 672049820 670849144 669938207 668475807
575.2 668475807 666838408 665808260 664874136 663451433 662178576 661669493 661246479 660221219 659239054
593.5 659239054 658736944 657849908 656149685 654422104 652908683 651021123 648992121 647747457 647174716
611.9 647174716 646433234 645815670 646575093 648789227 651364863 653996706 657004356 660078049 662674367
630.2 662674367 665246964 668245852 670933485 672767580 674396992 676244140 677811027 679105461
646.5 679105461 680887699 683016539 684350848 684916198 686215222 688909173 691914201 694318175 696151197
664.9 696151197 697935045 700412452 702992022 705497921 707962036 709850848 711513758 713608086
681.2 713608086 715690792 717127740 718389690 720028758 721527517 722405076 723150492 724138439 725039124
699.6G25039124O87480R55642J431346J440286J224041J469195J871169J707434J368106
717.9G37193823J517653J737953J533865J383245J553476J643181J437605J270413
734.2G49271214J369834J348197J037538R43125J249730J497925J475393J375735J440764
752.6G61009455J480460J305520J235843J353979J309455R34541P09116Q58844Q91626
771G71088839N88119K40385P0751p0155l75867m83274j40250J52886K62797O94871
791.4G72029102J506209K125383K419829K823293L312230L349007K950608K711118
807.7G93226779K515077J902402J222074J048863J077771N67913l24309q18551j047492
826G99370527j595735k070010j964629j766801j945078k042234j667797j351893j477540
$$ plain form
699.6 725039124 725726604 726682246 728113592 729553878 730777919 732247114 734118283 735825717 737193823
717.9 737193823 738711476 740449429 741983294 743366539 744920015 746563196 748000801 749271214
734.2 749271214 750641048 751989245 753026783 753969908 755219638 756717563 758192956 759568691 761009455
752.6 761009455 762489915 763795435 765031278 766385257 767694712 768629253 769338369 770197213 771088839
771 771088839 771676958 771917343 771988094 771917939 771542072 771058798 770918548 771071434 771334231 772029102
791.4 772029102 773535311 775660694 778080523 780903816 784216046 787565053 790515661 793226779
807.7 793226779 795741856 797644258 798866332 799915195 800992966 801560879 801236570 800418019 799370527
826 799370527 797774792 795704782 793740153 791973352 790028274 787986040 786318243 784966350 783488810
844.4G83488810j336038m55320N74946J446009K572656L881335M558206M499435M501641
862.7H03731680M624188M145324L187239K640665K538025K093911J348555J044035
879.1H25353622R65357L69430m29273o53744n63800q23796j015305n06342J34170L00646
899.4H23130965M41849R18448J159192O42538j0372j55806m23253j245200j847446
917.8H22610915j828552j751482j746237j221419k35080L37421K99633L34740N72264
936.2H17372203L96073j57416l55780k47240n32508j151264j486599j679361k371013
954.5H09787095l271342l680646m006028m923344n979776o570995p047773p728517
970.8G66578674p992983p340788o397784n823672n263329m399299l760040l610909
$$ plain form
844.4 783488810 782152772 781697452 782272398 783718407 786291063 790172398 794730604 799230039 803731680
862.7 803731680 808355868 812501192 815688431 818329096 820867121 822961032 824309587 825353622
879.1 825353622 826318979 826688409 826259136 825605392 825041592 824217796 823202491 822696149 822830319 823130965
899.4 823130965 823572814 824491262 825650454 826292992 826282620 826126814 825703561 824458361 822610915
917.8 822610915 820782363 819030881 817284644 816063225 815828145 816165566 816465199 816799939 817372203
936.2 817372203 817768276 817610860 817255080 817007840 816475332 815324068 813837469 812158108 809787095
954.5 809787095 806515753 802835107 798829079 793905735 787925959 781354964 774307191 766578674
970.8 766578674 758585691 751244903 744847119 739023447 733760118 729360819 725600779 721989870
987.1G21989870l306150k536595j932502j750350j417041q20339n69224q29279j165986
1005.5G07662404j505495k184808k999067l351390l326536l426492l562033l368855
1021.8F83937728l114283l190279l294527l081322k806425k739668k631903k288580
1038.1F60790741k011120k052426k150297k065361k019882k112627j946926j291216
1054.5F45140886n21898q34L35276M77194P5877q46267j744389k335906k762616l068387
1074.8F34748936l107071k938509k831638k901495l010988l101826l219068l175973
1091.2F10462368k709270k005398j469851j161635r47237q01444q25286r81331j118660
1109.5E98442256j194417j301706j532614j962543k580762k982974k682030j972556
$$ plain form
987.1 721989870 718683720 716147125 714214623 712464273 711047232 710226893 709657669 708828390 707662404
1005.5 707662404 706156909 703972101 700973034 697621644 694295108 690868616 687306583 683937728
1021.8 683937728 680823445 677633166 674338639 671257317 668450892 665711224 663079321 660790741
1038.1 660790741 658779621 656727195 654576898 652511537 650491655 648379028 646432102 645140886
1054.5 645140886 644618988 644618154 644953430 645430624 645506501 644660234 642915845 640579939 637817323 634748936
1074.8 634748936 631641865 628703356 625871718 622970223 619959235 616857409 613638341 610462368
1091.2 610462368 607753098 605747700 604277849 603116214 602168977 601367533 600542247 599560916 598442256
1109.5 598442256 597247839 595946133 594413519 592450976 589870214 586887240 584205210 582232654
1125.8E82232654j104295N13375J991450K024711J641631J800239K086580K167642
1142.2E93353987K024471J747430J554787J537561J610160J697600J848161K136529
1158.5F07510686K532065L053367L722668M462361N113482N541146N759597N864441
1174.8F43559813N860270N700171N444586N154490M750550M113555L323734K571046
1191.1F80478215J913190J355589J013100J028061J357376J770914K103328K323449
1207.4F93343222K337515K075851J693368J423955J277805J159072J108646J154721
1223.7G05574155J253307J340151J396954J506030J649082J699746J685023J676380
1240.1G17780828J581252J346171J083314Q58307O00457L23296K05100L04818M94361
$$ plain form
1125.8 582232654 581128359 581641734 583633184 585657895 587299526 589099765 591186345 593353987
1142.2 593353987 595378458 597125888 598680675 600218236 601828396 603525996 605374157 607510686
1158.5 607510686 610042751 613096118 616818786 621281147 626394629 631935775 637695372 643559813
1174.8 643559813 649420083 655120254 660564840 665719330 670469880 674583435 677907169 680478215
1191.1 680478215 682391405 683746994 684760094 685788155 687145531 688916445 691019773 693343222
1207.4 693343222 695680737 697756588 699449956 700873911 702151716 703310788 704419434 705574155
1223.7 705574155 706827462 708167613 709564567 711070597 712719679 714419425 716104448 717780828
1240.1 717780828 719362080 720708251 721791565 722649872 723250329 723573625 723778725 724083543 724577904
1258.4G24577904P19547J089811J626432K070010K276063K486587K748012K814412
1274.7G40408778K735317K762735K916753K997518K972007L035306L125370K985477
1291G63939261K701402K539218K425491K120734J742720J565576J455843J130402P89404
1309.4G80410051P27415P15316N33223M79817O73473P94292P55667P82907R04143Q24690
1329.8G87600994M35293J00493J18971K11716N4300o3777J24633K72989J49548K1458
1350.2G89026618L8385o7472m18186n85079m78387o83368j225471j346588j149476
1368.5G83110976j108289j220524j330972j498699k332628m034400m575133j969278
1384.9G65041053J601339K224564P93815k7180o54459j330972j652061j784623k038241
$$ plain form
1258.4 724577904 725297451 726387262 728013694 730083704 732359767 734846354 737594366 740408778
1274.7 740408778 743144095 745906830 748823583 751821101 754793108 757828414 760953784 763939261
1291 763939261 766640663 769179881 771605372 773726106 775468826 777034402 778490245 779620647 780410051
1309.4 780410051 781137466 781852782 782386005 782865822 783539295 784333587 785089254 785872161 786776304 787600994
1329.8 787600994 788036287 788136780 788255751 788467467 788521767 788457990 788582623 788855612 789005160 789026618
1350.2 789026618 789065003 788997531 788579345 787994266 787515879 786832511 785607040 784260452 783110976
1368.5 783110976 782002687 780782163 779451191 777952492 775619864 771585464 767010331 765041053
1384.9 765041053 766642392 768866956 769660771 769633591 768979132 767648160 765996099 764211476 762173235
1403.2G62173235k315342k086580j718283j724839j616537j096845p84457j117766
1419.5G49712586j199185p09594m97579n82278m23908k7955J97530L78251O30736P19488
1439.9G48198092P82490Q03172J203418J910627J966357J745284K216160L992796N006254
1458.3G67824650L079235K694548L853142L976643L106058L625631N220175M645705
1474.6G98025787K921045K399385K131402J531124J004935J036763Q01503l59118r29594
1493H08563232o56187q27491j652778j846671j420259j369476k626420l218233k668202
1511.3G92277515k437174k249003j879692j475632j659811j967191j682282j543760
1527.6G77382970j619697j521349j284837j081109q91030o71029p58648j006067j044989
$$ plain form
1403.2 762173235 759857893 757771313 756053030 754328191 752711654 751614809 750830352 749712586
1419.5 749712586 748513401 747803807 747306228 746723950 746300042 746272087 746469617 746847868 747478604 748198092
1439.9 748198092 748980582 749783754 750987172 752897799 754864156 756609440 758825600 762818396 767824650
1458.3 767824650 770903885 773598433 777451575 781428218 784534276 788159907 793380082 798025787
1474.6 798025787 800946832 803346217 805477619 807008743 808013678 809050441 809851944 809492826 808563232
1493 808563232 807907045 807079554 805426776 803580105 802159846 800790370 798163950 794945717 792277515
1511.3 792277515 789840341 787591338 785711646 784236014 782576203 780609012 778926730 777382970
1527.6 777382970 775763273 774241924 772957087 771875978 770984948 770313919 769555271 768549204 767504215
1546G67504215o40392o0141J25110k861R0539O61850O5327j153529j177609r77337
1566.4G64435172j271665k067268k306998k377212l333568l873468l676116l822804
1582.7G41706073m208564m660547m900813n027175n243302n559981n633413n525709
1599G00946569n607545n731583n618333n556345n813539n822421n351364n488098o223738
1617.4F49733603n099118m107773m383564m272521l803432l275275k332151j421034
1633.7F21038735o34372m77N29289J264453K075851L787756M925430L386616M425407
1652F40798688P778466M983246L420949M362583N731583N869865M709840N353272O663203
1670.4F89671695N543053N458832O130338N261361M791320N880117Q118868O355167
$$ plain form
1546 767504215 766863823 766803682 766928792 766925931 767016470 767678320 767743647 766590118 765412509 764435172
1566.4 764435172 763163507 761096239 758789241 756412029 753078461 749204993 745528877 741706073
1582.7 741706073 737497509 732836962 727936149 722908974 717665672 712105691 706472278 700946569
1599 700946569 695339024 689607441 683989108 678432763 672619224 666796803 661445439 655957341 649733603
1617.4 649733603 644634485 640526712 636143148 631870627 628067195 624791920 622459769 621038735
1633.7 621038735 620404363 620403886 620933175 622197628 624273479 628061235 632986665 636373281 640798688
1652 640798688 648577154 653560400 656981349 661343932 667075515 672945380 677655220 683008492 689671695
1670.4 689671695 695214748 700673580 706803918 712065279 716856599 722736716 730855584 737210751
1686.7G37210751M557728M876972M565417N410552O464422O278873P064700N374551
1703G81803966M327416M620671L870487L342569L211260L331483L826677L015638J804054
1721.4H13154221J764357K053916K069473K119124K057255K562701K354265J327455
1737.7H29462767J597821J996935J818418J692117J754045J898050J632929J058400
1754H42911482J054406J218915J101077J078188Q15988O74486Q59141R58383J006067
1772.4H51678133P22468L35336L85940N49137N25534N18144M86254L80159N56528P93815
1792.8H56931448M35948J78874L49343N05805L45468J71721K43366L80158L71039J98543
1813.2H60111713J82271K90990K54929J70172L05652M48764L06487K56657K28942N4598
$$ plain form
1686.7 737210751 741768479 746645451 751210868 756621420 763085842 769364715 776429415 781803966
1703 781803966 786131382 790752053 794622540 797965109 801176369 804507852 808334529 811350167 813154221
1721.4 813154221 814918578 816972494 819041967 821161091 823218346 825781047 828135312 829462767
1737.7 829462767 831060588 833057523 834875941 836568058 838322103 840220153 841853082 842911482
1754 842911482 843965888 845184803 846285880 847364068 848180056 848854542 849713683 850672066 851678133
1772.4 851678133 852400601 852735937 853121877 853671014 854196548 854714692 855200946 855581105 856137633 856931448
1792.8 856931448 857367396 857546270 857895613 858401418 858746886 858918607 859161973 859542131 859913170 860111713
1813.2 860111713 860293984 860584974 860839903 861010075 861315727 861764491 862070978 862327635 862556577 862611175
1833.6H62611175L8325J30415J70768K35021L69608K83957N0187R596J371L7730J78337
1856H64116490K05934Q6546M1008J39534K24889K32696J12355j2934l2842n0903Q583
1878.4H65071356J25587Q2493l5703K4736K02119J26600r6857k5451Q2433l9816j01149
1900.9H65416348J8597R6678J9610l9637J2100p510j07050k2233J28329O1452r8407
1923.3H65478277j83403r6143n6862j67072j22547K0980l6716j68324n1081Q8096q7261
1945.7H64617944k43783j41680l6419j32799k33650j57237o4016j41263j99973n0485
1966.1H63216639K861j94610k77042j36435n1856j47760k17318p9334J8954j06394
1986.5H62027705j82033n9247n2571k61665k83062r7632o2347j89125j89126q8274
$$ plain form
1833.6 862611175 862649500 862779915 862950683 863185704 863555312 863839269 863889456 863899052 863900423 863938153 864116490
1856 864116490 864322424 864408970 864449978 864589512 864814401 865047097 865159452 865146518 865113676 865062773 865071356
1878.4 865071356 865196943 865279436 865243733 865268469 865470588 865597188 865500331 865474880 865557313 865517497 865416348
1900.9 865416348 865434945 865531623 865551233 865511596 865523696 865516186 865409136 865386903 865515232 865576684 865478277
1923.3 865478277 865294874 865198731 865141869 864974797 864852250 864873230 864836514 864668190 864617109 864705205 864617944
1945.7 864617944 864374161 864232481 864196062 864063263 863829613 863672376 863608360 863467097 863267124 863216639
1966.1 863216639 863219500 863024890 862747848 862611413 862559557 862411797 862194479 862115145 862134099 862027705
1986.5 862027705 861845672 861786425 861733854 861472189 861189127 861091495 861029148 860840023 860650897 860562623
2006.9H60562623j29819k29955j81377o3539q1539k00808j94311r2626j26123j86741
2027.3H59075785r3103l4690j58369k32518j23739n6863j43588k04026j13488l7193
2047.7H57878208q5115j24276p4506n0545r2625q3506j9551j2040r2566j30176p4208
2070.2H57039094m1306o0260m9830o556o557n4538n6386j19O735m6015m7147J3947
2094.6H56691062J5498k6703j729M6075R954n7221l8922K4438L5286J4067J8477K5094
2119.1H56755376Q702r000J5080N8174M1306q464R358O7949N3704J0610L5345P6175
2143.6H57114315L8922J2696R8765J34348K8074k2948N4837J11401R5665O9261O4790
2166H57800126M6730J8716K7657O4551O9440K4915L1709J03831J08779K0206j0967
$$ plain form
2006.9 860562623 860432804 860202849 860021472 859957933 859876394 859675586 859481275 859388649 859262526 859075785
2027.3 859075785 858982682 858947992 858789623 858557105 858433366 858376503 858232915 858028889 857915401 857878208
2047.7 857878208 857793093 857668817 857594311 857543766 857451141 857367635 857348084 857336044 857243478 857113302 857039094
2070.2 857039094 856997788 856937528 856887698 856881142 856874585 856820047 856763661 856763542 856770277 856724262 856677115 856691062
2094.6 856691062 856706560 856679857 856678128 856724203 856734157 856676936 856638014 856662452 856697738 856711805 856730282 856755376
2119.1 856755376 856764078 856755078 856770158 856828332 856869638 856861174 856870532 856938481 856992185 857002795 857038140 857114315
2143.6 857114315 857153237 857165933 857264698 857399046 857427120 857404172 857459009 857570410 857666075 857735336 857800126
2166 857800126 857846856 857865572 857893229 857957780 858027220 858052135 858083844 858187675 858296454 858316660 858305693
2188.4H58305693M6611N6624L0756K7597J5974J192k563K0564L9458J7345l58p15L576
2215H58561754K682K206R358n961k0683J3590N3048M5121M947k2411L219R656n4419
2241.5H58602107p3135l0697j4722j5676q881k0206m5300n6743n1022k6703J312J4245
2265.9H58274579M530n424M411N96j7941j729L1889L3855J0491j7226n4658j21653
2290.4H58141720j45197q3148l9518m9591q7976j19567j40310k05040k85446k66970
2310.8H56718957j40965j12533k76089l94940l01361j93537k39253k90274k04861r2566
2331.2H54472578j84656l77833l57867j59681R2984O03675J079619N16892n41508j008451
2351.6H54135752q37148n34355k49028Q3625L74079N90086P16984P50124P62999P91729
$$ plain form
2188.4 858305693 858352304 858408928 858439684 858467281 858483255 858484447 858481884 858502448 858541906 858559251 858558893 858558178 858561754
2215 858561754 858564436 858566642 858576000 858570039 858549356 858562946 858615994 858661115 858666062 858643651 858646870 858656526 858602107
2241.5 858602107 858528972 858498275 858483553 858467877 858458996 858438790 858393490 858336747 858285725 858259022 858260334 858274579
2265.9 858274579 858279109 858273685 858278096 858278692 858260751 858259022 858290911 858324766 858335257 858318031 858263373 858141720
2290.4 858141720 857996523 857913375 857873857 857824266 857736290 857616723 857476413 857271373 856985927 856718957
2310.8 856718957 856577992 856465459 856189370 855794430 855493069 855299532 855060279 854770005 854565144 854472578
2331.2 854472578 854287922 853910089 853552222 853392541 853485525 854089200 855168819 855685711 855144203 854135752
2351.6 854135752 853298604 852764249 852515221 852598846 852972925 853563011 854279995 855030119 855793118 856584847
2372H56584847P79688O77169N42223M55022L93569K88189J18375J251K7776R2030N3704
2394.4H60013843k4081m291N2452K3246j9670K3127L4690o5089r6678J9252O5029m3989
2418.9H59977841j11341o7353n9069r3638j7763R3162L3498r6857q1301J2279l398
2441.3H59586060r5010p9334J2696j0252r0539n9486q225o9201j26600m9770J9133
2463.8H59029472p2777j54615p9393j7822q5890j37508o3956K38n9604j10507n3048
2486.2H58194590k9028j11043j47224q3983q1956j54436j31547l2723m1425j23322
2506.6H57257903q5414j0907p2062j39475o0499j1981j22547j75774p5936o676n9485
2529H56437147j11997p4447m6610j12653j49966p8380m8577j11998j23143o1869o7890
$$ plain form
2372 856584847 857364535 858041704 858583927 859038949 859432518 859720707 859839082 859840333 859868109 859960139 860013843
2394.4 860013843 859989762 859985471 860037923 860061169 860041499 860064626 860099316 860034227 859937549 859956801 860021830 859977841
2418.9 859977841 859866500 859799147 859740078 859646440 859628677 859721839 859755337 859658480 859577179 859589458 859586060
2441.3 859586060 859491050 859411716 859424412 859414160 859323621 859264135 859255910 859186709 859060109 859010339 859029472
2463.8 859029472 858956695 858802080 858722687 858704865 858618975 858481467 858417511 858417749 858358145 858247638 858194590
2486.2 858194590 858165562 858054519 857907295 857823312 857741356 857586920 857455373 857422650 857381225 857257903
2506.6 857257903 857172489 857161582 857089520 856950045 856889546 856877565 856755018 856579244 856503308 856496632 856437147
2529 856437147 856325150 856250703 856204093 856091440 855941474 855863094 855814517 855702519 855579376 855517507 855449617
2551.5H55449617j41740j51873r6380o9201q0526p4566p0273j28687k02417j81616
2571.9H54252338j08480r1314j18375j27852j01149j18554j90139k07126j68621j83821
2592.3H52836907k22147j82747j28687j49667k12491k18630j87099k17735k77221k63036
2612.7H50777447k25782k58565k64943k02298j79887k15292k46167k32577k00391k25961
2633.1H48525584k79486k51770j96338k26140k56241k07126j91569k41697k79784k69890
2653.5H46125543k41876k52246k59757k13504j91391k39253k53498k01822j96874k52604
2673.9H43822718k17021j40846k01046k97487l11315k88010k90095k77579k26677k33531
2694.3H41339111k93255l09288k70963k58445k93792k96056k55168k60770l15070l12507
$$ plain form
2551.5 855449617 855307877 855156004 855059624 854990423 854909897 854835331 854765058 854636371 854433954 854252338
2571.9 854252338 854143858 854052544 853934169 853806317 853705168 853586614 853396475 853189349 853020728 852836907
2592.3 852836907 852614760 852432013 852303326 852153659 851941168 851722538 851535439 851317704 851040483 850777447
2612.7 850777447 850551665 850293100 850028157 849825859 849645972 849430680 849184513 848951936 848751545 848525584
2633.1 848525584 848246098 847994328 847797990 847571850 847315609 847108483 846916914 846675217 846395433 846125543
2653.5 846125543 845883667 845631421 845371664 845158160 844966769 844727516 844474018 844272196 844075322 843822718
2673.9 843822718 843605697 843464851 843263805 842966318 842655003 842366993 842076898 841799319 841572642 841339111
2694.3 841339111 841045856 840736568 840465605 840207160 839913368 839617312 839362144 839101374 838786304 838473797
2714.6H38473797k87593l05175k79010k13086k11895l20613m39823l79026k36094k21252
2735H35580230k85089k99812k43544k13564k54511k71798k75910l39746l69787l18468
2755.4H32708001k84612l26037l82543l50595k93135l24667l68237l36290k96771l68714
2775.8H29376400m78149m52280l92735m17173l83854l14534l76164m87805n15580m70638
2796.2H25087488m83036n99683o30736n46217n22852n82158o48082o94930p03633o72102
2816.6H19004059o59049o90102p31051p57814p55191p74800q61884r53912r93490j045108
2837H10781658j284063j688600k017677k223312k334118k196253j737475j185358p82251
2855.4G95332551n31912m49598o02662q38936j007318j157761j228153j125396j017570
$$ plain form
2714.6 838473797 838186204 837881029 837602019 837388933 837177038 836856425 836416602 836037576 835801482 835580230
2735 835580230 835295141 834995329 834751785 834538221 834283710 834011912 833736002 833396256 833026469 832708001
2755.4 832708001 832423389 832097352 831714809 831364214 831071079 830746412 830378175 830041885 829745114 829376400
2775.8 829376400 828898251 828445971 828053236 827636063 827252209 826937675 826561511 826073706 825558126 825087488
2796.2 825087488 824604452 824004769 823374033 822827816 822304964 821722806 821074724 820379794 819676161 819004059
2816.6 819004059 818345010 817654908 816923857 816166043 815410852 814636052 813774168 812820256 811826766 810781658
2837 810781658 809497595 807808995 805791318 803568006 801233888 799037635 797300160 796114802 795332551
2855.4 795332551 794800639 794351041 793748379 792909443 791902125 790744364 789516211 788390815 787373245
2873.7G87373245j004458r26912p68721o87718p51436q88467r57548r73284j010299
2892.1G79404402j026571j081467j229107j296043j221717j170933j266182j457274
2908.4G69655108j652658j883149k117574k174079j985431j655996j249909q22842
2924.7G56113470m15743j01089J5914J25051M07576P37965R95994J225233J362026
2943.1G60466397J193762P67052L81589J95324K7120k04801k44141k4438K06113K78115
2963.5G63042092K86639L77357M91917N52893N69999N08845M79519N00322L53694J62542
2983.9G67325819K04503L44157L83139K75731j132k40267l75986n22792n83589n80848
3004.3G66228735n73217m97699m19915m91977p02858q88705r72927r67621r05574r20653
$$ plain form
2873.7 787373245 786368787 785441875 784673154 783985436 783234000 782345533 781387985 780414701 779404402
2892.1 779404402 778377831 777296364 776067257 774771214 773549497 772378564 771112382 769655108
2908.4 769655108 768002450 766119301 764001727 761827648 759842217 758186221 756936312 756113470
2924.7 756113470 755697727 755596638 755612552 755737603 756145179 756883144 757879138 759104371 760466397
2943.1 760466397 761660159 762427211 762808800 763004124 763031244 762826443 762582302 762557864 762763977 763042092
2963.5 763042092 763328731 763706088 764198005 764750898 765320897 765829742 766309261 766809583 767163277 767325819
2983.9 767325819 767530322 767874479 768257618 768533349 768532217 768291950 767915964 767393172 766809583 766228735
3004.3 766228735 765655518 765157819 764737904 764245927 763543069 762654364 761681437 760713816 759808242 758887589
3024.7G58887589j035810j039207r07182q53002j011908j213730j167893j060903j169622
3043G49428332j313031j324832j269400j285851j371742j381993j385331j417399j340091
3061.4G37338662j178801j078367j204014j455963j518666j367569j169563j096964
3077.7G27268755j240551j401186j428545j442849j464725j474201j557649j627802
3094G15631247j550615j419246j410962j556635j634001j520038j486003j679361j736701
3112.4G01637685j508176j417339j650333j958728k139330k111912j925945j793027
3128.7F87132895j867116k019762k023459j875460j854777k111793k336502k290249
3145F70753777k131283k012730j986384k134979k377927k465308k393425k351105k369940
$$ plain form
3024.7 758887589 757851779 756812572 755905390 755052388 754040480 752826750 751658857 750597954 749428332
3043 749428332 748115301 746790469 745521069 744235218 742863476 741481483 740096152 738678753 737338662
3061.4 737338662 736159861 735081494 733877480 732421517 730902851 729535282 728365719 727268755
3077.7 727268755 726028204 724627018 723198473 721755624 720290899 718816698 717259049 715631247
3094 715631247 714080632 712661386 711250424 709693789 708059788 706539750 705053747 703374386 701637685
3112.4 701637685 700129509 698712170 697061837 695103109 692963779 690851867 688925922 687132895
3128.7 687132895 685265779 683246017 681222558 679347098 677492321 675380528 673044026 670753777
3145 670753777 668622494 666609764 664623380 662488401 660110474 657645166 655251741 652900636 650530696
3163.4F50530696k369523k347648k366603k415478k449393k469003k480209k492249
3179.7F31140590k523005k538204k522886k514959k531051k570033k627850k631485
3196F10681117k548397k517164k547443k550006k546072k534031k489150k432346k428413
3214.3E88088095k448857k412200k414941k464533k424717k342701k294064k196610
3230.7E69089472k092063k217472k378881k250671k069771j992941j903653j896263
3247E52287757j971185j940429j833439j759946j793266j885533j865148j770080j700520
3265.3E35768211j634598j598537j690984j839518j934469j968920j893222j797021
3281.6E21410942j797855j831591j845181j837075j849711j923561k039611k182424
$$ plain form
3163.4 650530696 648161173 645813525 643446922 641031444 638582051 636113048 633632839 631140590
3179.7 631140590 628617585 626079381 623556495 621041536 618510485 615940452 613312602 610681117
3196 610681117 608132720 605615556 603068113 600518107 597972035 595438004 592948854 590516508 588088095
3214.3 588088095 585639238 583227038 580812097 578347564 575922847 573580146 571286082 569089472
3230.7 569089472 566997409 564779937 562401056 560150385 558080614 556087673 554184020 552287757
3247 552287757 550316572 548376143 546542704 544782758 542989492 541103959 539238811 537468731 535768211
3265.3 535768211 534133613 532535076 530844092 529004574 527070105 525101185 523207963 521410942
3281.6 521410942 519613087 517781496 515936315 514099240 512249529 510325968 508286357 506103933
3298E06103933k189756k005338j881838k004653k277971k463132k488613k430946k401322
3316.3D85960364k416759k391160k323210k296269k430469k611518k648651k582550
3332.6D66259778k420187k255857k374083k638757k687604k647459k579838k406746
3348.9D46249247k433747k680898k761215k568513k358675k376199k428025k190590
3365.3D26451385j971096k178758k527237k489567k140939j919329j839280j794637
3381.6D09590542j689106j439184j136303q72850r15706j257420j257926p45356m25548
3399.9C99851143p29262j087308r02355n38707l95447l88712m64469m83364k75701
3418.3C94585818j3351J01477K12013M83841P33614O99043O94514Q91178Q36075N29378
$$ plain form
3298 506103933 503914177 501908839 500027001 498022348 495744377 493281245 490792632 488361686 485960364
3316.3 485960364 483543605 481152445 478829235 476532966 474102497 471490979 468842328 466259778
3332.6 466259778 463839591 461583734 459209651 456570894 453883290 451235831 448655993 446249247
3348.9 446249247 443815500 441134602 438373387 435804874 433446199 431070000 428641975 426451385
3365.3 426451385 424480289 422301531 419774294 417284727 415143788 413224459 411385179 409590542
3381.6 409590542 407901436 406462252 405325949 404453099 403537393 402279973 401022047 400276691 399851143
3399.9 399851143 399121881 398034573 397132218 396593511 396198064 395809352 395344883 394861519 394585818
3418.3 394585818 394572467 394673944 394885957 395369798 396103412 396802455 397496969 398388147 399224222 399753600
3438.7C99753600N68897R73105J306296J496196J484006J443058J570791J725555J903653
3457D12225157K085298K055914K063512K383232K554030K181589J699716J784057K206713
3475.4D31239218K494990K529502K351702K303272K490819K534151K400189K434284
3491.7D50778127K656370K850115K724559K571135K801180K828986K396226K415984
3508D72022682K947420L207624L037453K798229K785176K999723L378332L404617L065348
3526.4D99646604L068566L237784L272176L484488L662824L420890L310382L615737
3542.7E26719451M032969M011572L464699L398478L856182L868401L707468L920377
3559E56979597L985881L597141L979861N603314N423903L816367L665924M383027M743397
$$ plain form
3438.7 399753600 400322497 401295602 402601898 404098094 405582100 407025158 408595949 410321504 412225157
3457 412225157 414310455 416366369 418429881 420813113 423367143 425548732 427248448 429032505 431239218
3475.4 431239218 433734208 436263710 438615412 440918684 443409503 445943654 448343843 450778127
3491.7 450778127 453434497 456284612 459009171 461580306 464381486 467210472 469606698 472022682
3508 472022682 474970102 478177726 481215179 484013408 486798584 489798307 493176639 496581256 499646604
3526.4 499646604 502715170 505952954 509225130 512709618 516372442 519793332 523103714 526719451
3542.7 526719451 530752420 534763992 538228691 541627169 545483351 549351752 553059220 556979597
3559 556979597 560965478 564562619 568542480 574145794 579569697 583386064 587051988 591435015 596178412
3577.4E96178412M870415M820049M439056M756331O084979N742669M246771M539490
3593.7F35678172N444884N357564N253076N176366M456281M301847N370795N667150
3610F76706135N211175N071163M446566N051017O172061M503667K486408K659380O054819
3628.4G18362391P306516L922761L036379L518999L463686L386914K881229K107024
3644.7G47985899K814591N803526N762756J737892J025200L042996K849639J602113
3661G72624612J347542R48846Q41439K462804K858400R63390K401829L169358O91414
3679.4G88309634J4722L4213m6909J304925L322422K344251M37200J24216K86281O96719
3699.8G96827674J630425J251281k10703l34799J232386K751886J249910o81043o44922
$$ plain form
3577.4 596178412 601048827 605868876 610307932 615064263 621149242 626891911 631138682 635678172
3593.7 635678172 641123056 646480620 651733696 656910062 661366343 665668190 671038985 676706135
3610 676706135 681917310 686988473 691435039 696486056 702658117 707161784 709648192 712307572 718362391
3628.4 718362391 725668907 729591668 732628047 736147046 739610732 742997646 745878875 747985899
3644.7 747985899 750800490 756604016 762366772 764104664 765129864 768172860 771022499 772624612
3661 772624612 773972154 774921000 775762439 778225243 781083643 782047033 784448862 787618220 788309634
3679.4 788309634 788324356 788358569 788311660 789616585 792939007 795283258 795720458 795844674 796130955 796827674
3699.8 796827674 798458099 799709380 799498677 799163878 800396264 803148150 804398060 803717017 803072095
3718.1H03072095J59144O59705P33912O19649k00629q22365K52604K177775K388180
3736.5H09040070J22845k019584j285673J882077J108646p53939J576781J955629o99461
3754.8H10927391j079977M12822O28889m87089l57807K31564O92487Q90016j25289
3773.2H11733007p81059j47581Q87811N19514k76982J12116K28524j09434k99633m00543
3793.6H11465740R8825J04189K7179J387120M95493m20511Q12352r4235j594901r45747
3814H11335504R09507O20425M22537J544774j31726j017690n33819m86493j46926m9591
3834.4H12466502L16978J309037Q56817j9372k28703r86278k056360j895487J855134
3852.7H11618268M379988N4836k154886j344323K06768O90043m08769J3888J163125
$$ plain form
3718.1 803072095 803231239 803890944 804624856 805244505 805043876 804221511 804474115 806651890 809040070
3736.5 809040070 809162915 807143331 805857658 807739735 808848381 808094442 809671223 811626852 810927391
3754.8 810927391 809847414 810260236 810889125 810402036 810044229 810275793 810968280 811858296 811733007
3773.2 811733007 810951948 810804367 811692178 812211692 811934710 812046826 812275350 812165916 811866283 811465740
3793.6 811465740 811564565 811668754 811695933 813083053 813578546 813158035 813970387 813876152 812281251 811335504
3814 811335504 812245011 812865436 813287973 814832747 814701021 813683331 813149512 812663019 812516093 812466502
3834.4 812466502 812783480 814092517 814949334 814929962 814701259 813714981 811658621 809763134 811618268
3852.7 811618268 815998256 816053092 813898206 812553883 812760651 813450694 813041925 813055813 814218938
3871.1H14218938L19541m86016j105130m63069P99120K24948L90589L4094r31561L30567
3891.5H13332021N70834j070559j094222K94089J112223J213372N33282o73949r30965
3909.8H13286126o12140m97341Q2671P30992K76923l07739j0788Q9705m32730j55926
3930.2H12449753O74486M16637l89934n65767j89483L57032J95801k85029M8041K74002
3950.6H12985539q6486k22385r6917k5809Q9884J96695M4823r5427k6762N6564N6327
3973.1H12876046R596o3837m5299R3698J27554J371q4698l3736M1187K4914j5258o497
3997.5H12925041
$$ plain form
3871.1 814218938 814538479 814052463 812947333 812484264 813283384 813508332 813898921 813933015 813001454 813332021
3891.5 813332021 813902855 812832296 811738074 812032163 813144386 814357758 814891040 814217091 813286126
3909.8 813286126 812673986 812176645 812259316 812990308 813267231 812959492 812948704 813038409 812605679 812449753
3930.2 812449753 813124239 813540876 813150942 812585175 812395692 812752724 812948525 812663496 812711537 812985539
3950.6 812985539 812899053 812676668 812579751 812553942 812643826 812840521 812885344 812789917 812763155 812819719 812876046
3973.1 812876046 812885642 812821805 812776506 812870204 812997758 812999129 812914431 812880695 812921882 812946796 812931538 812925041
3997.5 812925041
##END=$$ End of the data block
