##TITLE=$$ Begin of the data block
##JCAMP-DX=5.00 $$ ACD/SpecManager v 10.08
##SPECTROMETER/DATA SYSTEM=Alpha
##DATE=14 Apr 2014 11:23:48
##DATA TYPE=INFRARED SPECTRUM
##DATA CLASS=XYDATA
##ORIGIN=
##OWNER=
##NPOINTS=1765
##FIRSTX=399.75695801
##LASTX=3997.56933594
##MAXX=3997.56933594
##MINX=399.75695801
##MAXY=0.86463684
##MINY=0.30213735
##XFACTOR=1.0000000000
##YFACTOR=1.000000000000000e-9
##FIRSTY=0.69239366
##DELTAX=2.03957629
##XUNITS=1/CM
##YUNITS=ARBITRARY UNITS
##XYDATA=(X++(Y..Y))
399.8 692393661 690955639 687591255 685803413 685649872 683639467 680623114 679932594 680403173 678615510
418.1 678615510 675998390 676272690 676757455 674650908 672816992 673745751 674166858 671548605 669202447
436.5 669202447 669613123 669939756 668126345 667150140 668560803 668693781 666497052 665501297 666385710
454.8 666385710 665851355 663668454 663315594 664346159 663440228 661100686 660557270 661121786 659743547
473.2 659743547 657545507 657318830 657854676 656713545 655212283 655682862 656395257 654840469 652683079
491.5 652683079 652391732 652521133 651091397 649483562 649210334 648913503 647380650 646017075 645850837
509.9 645850837 645371914 643724501 642434418 642150700 641243339 639129579 637419939 636874735 636107683
528.3 636107683 634477973 633283436 632932723 632082582 630532146 629789352 630091727 629898190 628789246
546.6 628789246 628051579 627914190 627255499 626056015 625253081 624762058 623675346 621920824 620265126
565 620265126 618755877 616766095 614509404 612598598 610824287 608889699 607045949 605382979 603657126
583.3 603657126 601731956 599756181 597889900 596126616 594413579 592911303 591866016 591031611 589872181
601.7 589872181 588418484 587381244 587159872 587270737 586960495 586101592 585498750 586441398 589121461
620 589121461 592500865 595988393 599503338 602909327 605971277 608815551 611688256 614257336 616055667
638.4 616055667 617063046 617326319 617231429 617933393 619948685 621939838 621963918 620299637 620269597 624172926
658.8 624172926 629786253 634078979 636210382 636803210 638765931 642438769 645394206 647667170 649495304
677.1 649495304 651040673 652861953 654930294 656521618 657568097 658762097 660103083 660801172 660839379
695.5 660839379 661072671 661800921 662485659 663185596 664544702 666216493 667380214 668256700 669488609
713.8 669488609 670675814 670918882 670912445 672486603 675555944 678585351 681176364 683822155 686273932
732.2 686273932 687914371 689133108 690590501 692033648 693043530 694099724 695841253 697821438
748.5 697821438 699304044 700755954 702886164 705064237 706448853 707587838 709272981 711010456
764.8 711010456 712204993 713329375 714866757 716292918 716961980 717239082 717588961 717539907 716863155
783.2 716863155 716411829 716755629 717463970 718367219 720214486 723345518 726977944 730582595 734534860
801.6 734534860 738885164 742775142 745723128 748424947 751392484 753996253 755820513 757406592
817.9 757406592 758884490 759442151 758771420 757544458 755947530 753413796 750166297 747245789 744824052
836.2 744824052 742084861 738799632 735696435 733099937 730711758 729068041 729493320 732379973 736931920
854.6 736931920 742613137 749494910 757054627 764131963 770333290 776096165 781331062 785421729
870.9 785421729 788479984 791222036 793663263 795205534 795895219 796257138 796148241 795067132 793362319
889.3 793362319 791902184 790910959 790235221 790146410 791011870 792504549 793935478 795147717 796285152
907.6 796285152 797058582 796907544 795746982 793978155 791752100 789006829 786161780 783903658 782485008
926 782485008 781815529 781914711 782764733 783913732 784845173 785606563 786419213 787124515 787496865 787558317
946.4 787558317 787383974 786752999 785330653 783125639 780239105 776440799 771480501 765355229 757966518
964.7 757966518 749058008 738499045 726528227 713863015 701421976 689985752 680002391 671475470
981 671475470 664044917 657303452 651129365 645619631 640864015 636884451 633634686 631026328 628941596
999.4 628941596 627258003 625760257 623884737 621018708 617018700 612015843 606229424 600030184
1015.7 600030184 593802989 587744057 581847489 576148033 570753515 565660000 560820699 556349874
1032 556349874 552492797 549341321 546680987 544258177 541992009 539847732 537633479 535179734 532710254
1050.4 532710254 530733168 529731810 530081391 531924009 534885764 538033187 540295780 541102588 540363491
1068.7 540363491 538178563 535053492 531772435 528817475 526125133 523400009 520428240 516943574
1085 516943574 512526691 507186353 501901090 498098582 496643603 497526467 500229001 503988385 507972419
1103.4 507972419 511568367 514622033 517241716 519275784 520265341 519791603 517281830 512047708 505074382
1121.8 505074382 500201702 500497758 504343569 508000553 509440362 509046316 509030879 511302650 515730381
1140.1 515730381 520972729 525800049 529498398 532072067 534036279 535791099 537507892 539470911
1156.4 539470911 542154551 545958102 551117599 557916105 566570699 576710820 587417245 597922623
1172.7 597922623 607923448 617196500 625363111 632209599 637826562 642054856 644294202 644211113
1189.1 644211113 642090738 638422906 633716166 628843963 625108242 623512983 624060392 626033723
1205.4 626033723 628655910 631133020 632640839 632862508 632275283 631510675 630654931 629610777 628696144
1223.7 628696144 628220081 628031194 627959251 628238320 629116416 630330384 631488144 632689714 634145856
1242.1 634145856 635552049 636501491 637123168 637715936 638190091 638436258 638839006 639914811 641737103
1260.4 641737103 644150317 647338033 651515722 656314313 661243260 666338623 671777248 677265108
1276.8 677265108 682407856 687371373 692536294 697782755 702694297 707249522 711649716 715657115
1293.1 715657115 718889058 721537769 724022388 726220787 727829695 729115605 730497539 731795132
1309.4 731795132 732629418 733197391 733953536 734858394 735656738 736511469 737650752 738775611 739465714
1327.8 739465714 739800692 740014136 739884794 739162982 738268137 737885594 738039494 738247454 738376439 738596082
1348.1 738596082 738766551 738558888 738056362 737446725 736294627 733842611 730024278 726155400 723398626
1366.5 723398626 721184790 718251586 713751256 708188355 704111159 703600168 705751061 708043396
1382.8 708043396 709812105 711889684 713825345 714520276 713850141 712379575 710701764 708680272 706236005
1401.2 706236005 703613937 701079011 698828280 696708739 694836795 693458259 692284644 690984845
1417.5 690984845 690008819 689671159 689321220 688568950 687423229 685830832 683846056 681598127 679293215
1435.9 679293215 677634954 676469207 674907923 672927082 670918405 668884516 666642070 664010525
1452.2 664010525 661448538 660458565 662929714 667132616 671176434 675786018 682884037 693924308
1468.5 693924308 709425688 728112578 743700564 753699064 760528624 765266120 768256605 769729614
1484.8 769729614 769901812 768947065 767298579 765400350 762786746 759114444 755175412 751488149 747651517
1503.2 747651517 742420912 735781610 730982721 727336943 723321259 719251156 715956390 713671982
1519.5 713671982 711664438 709884405 708478272 707299650 706217408 704793215 703327298 702367663
1535.8 702367663 701208591 699627459 699061275 699567795 700162232 700552285 700986147 701714575 702443540
1554.1 702443540 702686250 702980220 704767525 706405222 706774294 706287324 705150425 703550577 701553881
1572.5 701553881 698499382 694225848 690047026 685669780 680305421 674385190 668130457 661442816
1588.8 661442816 654384851 647187114 639900327 632605493 625355601 618140697 611019075 603983700
1605.1 603983700 596888959 589653492 582490325 575435758 567762673 559648335 553228617 547527969
1621.4 547527969 541182935 535286248 530311763 526062608 522673249 519886255 518090606 518242717
1637.8 518242717 519513428 521265805 523440897 526661992 530981004 534610271 538648427 545447707
1654.1 545447707 551705539 556756675 562194288 568684101 575701952 581938207 588447452 596284926
1670.4 596284926 603817225 611417353 619902790 627820551 634783328 642070532 651764274 661379397
1686.7 661379397 669233203 676615655 683007181 689485252 696965575 705355883 715870559 725257158
1703 725257158 732714891 739770532 745851994 751002967 755447268 759391367 763748884 768479764 772422373
1721.4 772422373 775561810 778434873 781155586 783674836 785759866 787937522 790754020 793193877
1737.7 793193877 795107722 797074318 799452782 802426994 806101322 810713768 816083431 820857763
1754 820857763 824572384 827572942 830084920 832536995 834803998 836447656 837629378 838663876 839849830
1772.4 839849830 841401339 842949152 844274819 845384240 846327066 847284794 848357022 849169910 849458814
1790.7 849458814 849964619 851105630 852121770 852660120 853213847 854092836 854900062 855336666 855626404
1809.1 855626404 856137693 856805325 857309639 857658207 858105242 858505428 858596981 858649135 858912885 859253764
1829.5 859253764 859727621 860248625 860626817 860948980 861166358 861096919 860969007 861314058 861867309 862213731
1849.9 862213731 862485945 862781942 862963498 863005936 863147020 863421679 863528013 863283157 863052368 863328516
1870.3 863328516 863811076 864020765 864069104 864200413 864313483 864276826 864228547 864263952 864231110 864160299 864204466
1892.7 864204466 864349067 864505470 864536464 864492476 864545286 864636838 864568651 864415407 864435375 864569724 864490688
1915.1 864490688 864205003 864144623 864311635 864371359 864359319 864415646 864489496 864451408 864300251 864198625 864192128
1937.6 864192128 864040911 863685787 863531411 863674581 863710940 863515913 863340139 863299131 863218546 862976193
1958 862976193 862763345 862743676 862696946 862412930 862132192 862092257 862071097 861847401 861614466 861591935 861579418
1980.4 861579418 861347854 861062765 860947967 860861242 860582054 860304117 860280633 860291302 860058665 859735131
2000.8 859735131 859575748 859499753 859253168 858904004 858732462 858694375 858501077 858164132 857969582 857887328
2021.2 857887328 857650578 857292295 857095897 857080162 856942832 856615245 856404066 856384516 856266320 855990171
2041.6 855990171 855818808 855816185 855725169 855463624 855279863 855281472 855211735 854943454 854743302 854756594 854748487
2064 854748487 854558587 854387045 854380906 854371846 854219794 854102790 854174316 854254782 854149699 854004979 854048014
2086.5 854048014 854142308 854068875 853970051 854058027 854168296 854079604 853950620 854021966 854190111 854194105 854071975
2108.9 854071975 854080200 854223192 854233861 854109585 854131281 854307592 854371190 854299307 854350090 854551494 854641974
2131.3 854641974 854583442 854629874 854810834 854873180 854788065 854821086 855023742 855130970 855066180 855073333 855249465
2153.8 855249465 855375826 855357885 855388999 855562508 855682969 855644524 855668724 855908155 856153786 856198847
2174.2 856198847 856197000 856345773 856504917 856489718 856459737 856611967 856801927 856827736 856788397 856872380 857008517
2196.6 857008517 857014537 856946230 856996894 857112050 857099175 857040703 857131600 857288122 857301116 857214391 857236385
2219 857236385 857337713 857310116 857213557 857262671 857389390 857376933 857256055 857241750 857316852 857263982 857104540
2241.5 857104540 857066154 857140422 857094407 856904984 856776237 856748700 856662393 856472254 856320202 856297970 856278718
2263.9 856278718 856153190 856070936 856130004 856160522 856080115 856063545 856221199 856410146 856459796 856388807 856239080
2286.3 856239080 855974913 855585992 855176687 854888201 854614615 854167581 853631914 853159368 852618039 851792932
2306.7 851792932 850769877 849815011 849033415 848262966 847196817 845736921 844233155 843057036 842141151
2325.1 842141151 841186225 840138674 839293599 838796794 838421226 838020027 837609947 837345719 837901711
2343.5 837901711 840111971 842645347 843016207 840674937 836973250 833592474 831288576 830274284
2359.8 830274284 830448389 831670344 833718240 836269498 839142323 842167914 845058382 847751498
2376.1 847751498 850379169 852859676 854882956 856274128 857119262 857591033 857804596 857856631 857866943
2394.4 857866943 857876301 857841253 857764006 857716203 857733011 857747614 857671261 857572436 857584298 857629180 857563972 857442379
2418.9 857442379 857356548 857280195 857176542 857085824 857038796 856966615 856826961 856704652 856663764 856630743 856517076
2441.3 856517076 856359541 856251419 856187403 856082916 855941772 855862975 855839550 855730772 855532467 855395615
2461.7 855395615 855341911 855249047 855102360 854997396 854917824 854757726 854531586 854386747 854346037 854255199
2482.1 854255199 854073882 853914440 853803456 853654087 853460729 853319407 853244603 853132367 852941215 852771580
2502.5 852771580 852690697 852582335 852367818 852175415 852074444 851936579 851698279 851506829 851417243 851284027
2522.9 851284027 851062417 850859940 850732565 850615501 850452781 850274742 850119531 849963605 849772632 849586606
2543.3 849586606 849461436 849350929 849191248 849007010 848823786 848632395 848423719 848205626 847999692 847798467
2563.7 847798467 847580075 847346842 847118676 846869767 846564293 846248865 845962405 845678031 845391095 845120311
2584.1 845120311 844852924 844539285 844151199 843767583 843467891 843205452 842923820 842602015 842226565 841853082
2604.5 841853082 841515005 841159403 840785980 840446413 840135396 839807272 839438260 839047313 838678062 838335693
2624.9 838335693 837988019 837621331 837264001 836931884 836574256 836178303 835809767 835468709 835098088 834709227
2645.3 834709227 834355235 834018290 833616495 833167553 832783997 832447946 832042754 831581175 831164777 830795348
2665.7 830795348 830406785 830010593 829687357 829429150 829153419 828858256 828599751 828355610 828042567 827678084
2686.1 827678084 827362716 827112257 826832831 826499701 826200962 825935304 825578809 825093806 824604571 824166536
2706.5 824166536 823670983 823062122 822443366 821880043 821279645 820623755 820026636 819511175 818974018 818360209
2726.9 818360209 817818046 817505538 817295194 817044795 816837013 816677690 816441715 816119432 815806627 815536499
2747.3 815536499 815188229 814665496 814115882 813669264 813192785 812590003 812000334 811511278 810976267 810291290
2767.7 810291290 809563339 808909714 808255076 807417393 806446135 805545509 804683805 803724170 802708805
2786 802708805 801736474 800751567 799637973 798459053 797355592 796236157 794916332 793475986 792048633
2804.4 792048633 790554821 788939297 787203431 785314739 783282876 781079650 778668225 776048064
2820.7 776048064 773113191 769689620 765671313 760944009 755249321 748238564 739526868 728613853
2837 728613853 714913845 698092163 678231716 655522764 630590558 605687499 585203350 573939264
2853.3 573939264 573837340 582588732 595529199 608265460 617870271 623146951 624729455 624912798
2869.7 624912798 626595974 631201386 637642622 643594086 647177637 647611201 645054162 640101373
2886 640101373 633374333 625415385 616758227 607895076 599051297 590138435 581022859 571566641 561418831
2904.3 561418831 550063252 536960840 521582782 503446817 482403517 459251076 436063677
2918.6 436063677 415928513 402170271 397059649 400864452 412012190 428123772 447182894 467741102
2934.9 467741102 488354534 507362545 523177862 534539759 540660977 541554213 538393378 533440590
2951.2 533440590 529401422 528625011 532253444 540062726 551342070 565436721 581582427 598673582
2967.6 598673582 615450203 630942762 644576788 656100273 665670574 673643529 680166245 685414970
2983.9 685414970 689787745 693508089 696585119 698970318 700614750 701687455 702301204 702365637 702035546
3002.2 702035546 701577485 701112330 700758278 700570762 700437248 700233042 699928880 699548066 699122012 698626697
3022.6 698626697 697960138 697076023 696104288 695168376 694208682 693042517 691656351 690270364 688907444
3041 688907444 687373161 685630620 683840752 682161093 680562198 678905725 677202940 675510049 673813820
3059.3 673813820 672157288 670607209 669179738 667756557 666219831 664667249 663238347 661952555
3075.6 661952555 660717726 659366071 657846868 656226873 654544652 652908862 651362836 649734199
3092 649734199 647952557 646176934 644500494 642787516 640916288 638976991 637108922 635248482 633220792
3110.3 633220792 631132483 629172862 627206445 625068009 622719646 620185077 617600977 615087450
3126.6 615087450 612654805 610172868 607552052 604925692 602404416 599870741 597120821 594203889
3143 594203889 591341317 588558793 585797012 583013296 580090165 576989055 573824048 570681155 567580521
3161.3 567580521 564517677 561429203 558270156 555092156 551931918 548757076 545568705 542405248
3177.6 542405248 539257586 536054909 532813311 529637873 526517928 523347855 520109236 516891956
3193.9 516891956 513719678 510517299 507300556 504157305 501082778 498015106 494920284 491855502
3210.3 491855502 488880008 485933930 482968122 480009735 477094799 474194258 471257567 468342841
3226.6 468342841 465538174 462843865 460190326 457475126 454698950 451930791 449209094 446615875
3242.9 446615875 444152206 441685438 439144015 436627269 434227616 431891471 429529130 427122802
3259.2 427122802 424724191 422358781 420039892 417826533 415727764 413585007 411296934 408988506
3275.5 408988506 406768471 404605806 402447432 400320500 398250610 396204948 394188643 392205238
3291.8 392205238 390199333 388118893 385946006 383800983 381852627 380028635 378103405 375994742
3308.2 375994742 373775274 371532917 369358301 367277414 365214467 363133878 361083120 359074086
3324.5 359074086 357010335 354857236 352705956 350613803 348617196 346707016 344736934 342631698
3340.8 342631698 340497673 338373721 336316347 334443957 332559347 330443233 328298688 326356620
3357.1 326356620 324555814 322751909 320973784 319385946 317918688 316294521 314452827 312663913
3373.4 312663913 311190784 309972018 308811247 307659507 306653380 305861056 305275798 304946035 304627776
3391.8 304627776 304010838 303371519 303163171 303228319 303012758 302474231 302137345 302171975 302326947 302434951
3412.2 302434951 302484781 302576333 302828550 303211153 303663373 304294288 305177540 306228966 307267994 308332443
3432.6 308332443 309569508 310740441 311644018 312601626 313915908 315498561 317176938 318850666 320576042
3450.9 320576042 322425008 324383765 326491296 328733742 330927342 333137870 335690111 338492125
3467.2 338492125 341007859 343045175 345089227 347495526 350237012 353078902 355698377 358199209
3483.6 358199209 360917330 363787919 366622210 369517565 372547716 375657290 378735691 381787330
3499.9 381787330 384905905 387953490 390831172 393844008 397221357 400814235 404328376 407626748
3516.2 407626748 410934687 414517254 418391973 422193021 425694048 429230303 433046758 436991781
3532.5 436991781 441013902 445096970 449072570 453125238 457481772 461949795 466182709 470228702
3548.8 470228702 474417686 478832543 483325183 487857014 492509216 497146130 501527786 505958736
3565.1 505958736 511198878 516872823 522087157 527048826 532198310 537588537 543169320 548778057
3581.5 548778057 554199815 559565187 565260351 571208835 576943099 582661688 588668227 594817102
3597.8 594817102 600983679 607108355 613000035 618679702 624661624 631012082 637292266 643367827
3614.1 643367827 649139345 655006588 661411703 667540848 672793388 677568257 683128417 689715445
3630.4 689715445 695681691 701067507 706330240 711389661 716284156 720881462 724904656 728543401
3646.7 728543401 732781291 737819195 742289364 746008396 749843836 753742099 757145524 760053396
3663 760053396 762539744 764564037 766534090 768801510 770699084 772456169 774946570 777513385 779666245
3681.4 779666245 781569004 783188641 784526825 785818994 787414610 789244473 790837824 791939974
3697.7 791939974 792708457 793554544 794637501 795543373 795982957 796280861 797149122 798555195 799631059
3716.1 799631059 800095737 800212562 800271451 800532937 801066399 801618993 801828325 801729620 801845610 802691281
3736.5 802691281 803901970 804515958 804231703 803918362 804340065 804645419 804782569 805565000 806532025
3754.8 806532025 807067573 807362139 807797492 808211684 808362126 808421493 808581471 808948696 809396505 809635878
3775.2 809635878 809649825 809651375 809798956 809994459 810228884 810543835 810787737 810877800 810738385 810406685
3795.6 810406685 810126185 809847057 809756696 810100853 810319602 810531199 811063528 811341524 810993671 810495198
3816 810495198 810314715 810125768 810260653 810845196 811169922 811196148 811105132 811001539 810932815 810629129
3836.4 810629129 810246825 810330391 810799778 811361253 811739206 811569929 810591817 809257567 809287369 810449123
3856.8 810449123 811163306 811163008 810831368 810627043 810518801 810283959 810283244 810609281 810923874 811037362 810828626
3879.2 810828626 810634553 810699105 810810447 810903549 810819626 810605764 810639203 810754359 810553133 810079575
3899.6 810079575 809647143 809594274 810032785 810555398 810797811 810814202 810671568 810382545 810179651 810185492
3920 810185492 810184062 810054004 809917092 809837639 809805095 809915721 810135543 810219169 810097456 809887826 809691846
3942.5 809691846 809622645 809680164 809749424 809779882 809788704 809793353 809763491 809717953 809686601 809634745 809616745 809656680
3966.9 809656680 809649169 809603095 809627235 809675813 809658170 809657097 809734583 809803069 809798300 809670925 809461415 809333205
3991.4 809333205 809316754 809379876 809499264
3997.5 809499264
##END=$$ End of the data block
