##TITLE=$$ Begin of the data block
##JCAMP-DX=5.00 $$ ACD/SpecManager v 10.08
##SPECTROMETER/DATA SYSTEM=Alpha
##DATE=14 Apr 2014 11:23:48
##DATA TYPE=INFRARED SPECTRUM
##DATA CLASS=XYDATA
##ORIGIN=
##OWNER=
##NPOINTS=1765
##FIRSTX=399.75695801
##LASTX=3997.56933594
##MAXX=3997.56933594
##MINX=399.75695801
##MAXY=0.86483139
##MINY=0.30207676
##XFACTOR=1.0000000000
##YFACTOR=1.000000000000000e-9
##FIRSTY=0.69275850
##DELTAX=2.03957629
##XUNITS=1/CM
##YUNITS=ARBITRARY UNITS
##XYDATA=(X++(Y..Y))
$$ plain form
399.8 692758501 690694511 686968207 685462832 685988009 684234679 680810928 679638267 679865599 677973568
418.1 677973568 675445914 675977349 676734924 674596965 672367573 672944307 673367143 670930803 668759227
436.5 668759227 669485331 669976652 668134928 667203009 668505311 668543994 666643500 666032493 666876078
454.8 666876078 666096032 663712561 663008094 663824856 663089573 660933614 660360575 660882294 659642041
473.2 659642041 657607377 657226861 657464623 656348646 655034184 655422211 655981004 654543281 652666152
491.5 652666152 652528286 652489126 650767267 649084330 648985863 648827612 647264123 646006227 646103024 645672321
511.9 645672321 643776476 642199457 641817212 640997410 639078557 637617111 637198389 636320651 634555161
530.3 634555161 633395851 633087814 632191122 630713642 630061090 630124688 629507780 628277600 627754211
$$ packed form
399.8F92758501k063990l726304j505375N25177j753330l423751j172661K27332j892031
418.1F77973568k527654N31435P57575k137959k229392N76734M22836k436340k171576
436.5F68759227P26104M91321j841724r31919J302302L8683j900494o11007Q43585
454.8F66876078p80046k383471p04467Q16762p35283k155959n73039N21719j240253
473.2F59642041k034664l80516K37762j115977j314462L88027N58793j437723j877129
491.5F52666152j37866l9160j721859j682937r8467j58251j563489j257896R6797m30703
511.9F45672321j895845j577019l82245q19802j918853j461446m18722q77738j765490
530.3F34555161j159310l08037q96692j477480o52552O3598o16908j230180n23389
$$ plain form
548.6 627754211 627756715 627011120 625787318 625158191 624667048 623389006 621768773 620566189 619300604
567 619300604 617208838 614777029 612778425 611122668 609423161 607577205 605752528 604003429 602088511
585.4 602088511 600077927 598173559 596212745 594230533 592609286 591479659 590570331 589516342 588283539
603.7 588283539 587346137 587052107 587094247 586844802 586140215 585698903 586746216 589431942 592725694
622.1 592725694 596158326 599691987 603123605 606240749 609137475 611950576 614384890 616138101
638.4 616138101 617285252 617764592 617767096 618430138 620321810 622153103 622069955 620344400 620337546 624344945
658.8 624344945 630066037 634422183 636439741 636780322 638673961 642454326 645528793 647928417 649776518
677.1 649776518 651236951 652992070 655032098 656601012 657683372 658980548 660373390 661079466 661134064
$$ packed form
548.6F27754211K504p45595j223802o29127m91143j278042j620233j202584j265585
567F19300604k091766k431809j998604j655757j699507j845956j824677j749099j914918
585.4F02088511k010584j904368j960814j982212j621247j129627r09328j053989j232803
603.7E88283539r37402k94030M2140k49445p04587m41312J047313K685726L293752
622.1E92725694L432632L533661L431618L117144K896726K813101K434314J753211
638.4F16138101J147151M79340K504O63042J891672J831293q3148j725555o854M007399
658.8F24344945N721092M356146K017558L40581J893639L780365L074467K399624J848101
677.1F49776518J460433J755119K040028J568914J082360J297176J392842P06076N4598
$$ plain form
695.5 661134064 661354959 662073731 662795484 663476288 664723277 666367352 667586207 668465674 669698596
713.8 669698596 670877874 671067297 671060503 672665834 675718904 678705633 681228280 683824182 686341524
732.2 686341524 688112974 689387798 690873146 692356169 693314373 694306016 696065605 698033512 699484050
750.6 699484050 700986743 703150570 705305755 706697404 707811236 709415197 711108387 712282240
766.9 712282240 713396609 714955986 716390550 717051983 717308879 717641115 717607677 716928780 716486216
785.2 716486216 716887236 717627466 718542576 720406294 723550439 727191746 730750382 734658659 739035487
803.6 739035487 742933750 745850325 748536706 751542032 754240334 756142557 757780254 759294093
819.9 759294093 759812951 759072423 757786095 756125331 753558040 750275433 747293949 744866967 742202580
$$ packed form
695.5F61134064K20895P18772P21753O80804J246989J644075J218855Q79467J232922
713.8F69698596J179278J89423o794J605331L053070K986729K522647K595902K517342
732.2F86341524J771450J274824J485348J483023R58204R91643J759589J967907J450538
750.6F99484050J502693K163827K155185J391649J113832J603961J693190J173853
766.9G12282240J114369J559377J434564O61433K56896L32236l3438o78897m42564
785.2G16486216M01020P40230R15110J863718L144145L641307L558636L908277M376828
803.6G39035487L898263K916575K686381L005326K698302J902223J637697J513839
819.9G59294093N18858p40528j286328j660764k567291l282607k981484k426982k664387
$$ plain form
838.3 742202580 739014447 735979915 733384192 730984271 729396582 729862869 732689559 737175167 742855847
856.6 742855847 749707222 757187724 764226139 770412803 776143610 781378269 785525203 788643301
872.9 788643301 791438997 793955684 795553684 796200097 796459019 796303809 795227647 793515861 792057514
891.3 792057514 791092217 790427685 790317059 791148067 792627454 794055402 795266211 796425819 797189057
909.6 797189057 796990037 795844376 794128478 791907430 789134204 786275268 784040749 782631755 781919301
928 781919301 781988740 782834351 783966422 784891665 785681605 786535203 787244558 787573695 787602127 787425578
948.4 787425578 786797881 785356939 783112288 780222714 776472986 771549404 765435219 758064210 749153078
966.8 749153078 738571107 726588011 713895321 701433420 690041602 680146754 671678245 664246857
$$ packed form
838.3G42202580l188133l034532k595723k399921j587689M66287K826690M485608N680680
856.6G42855847O851375P480502P038415O186664N730807N234659M146934L118098
872.9G88643301K795696K516687J598000O46413K58922j55210j076162j711786j458347
891.3G92057514r65297o64532j10626Q31008J479387J427948J210809J159608P63238
909.6G97189057j99020j145661j715898k221048k773226k858936k234519j408994p12454
928G81919301O9439Q45611J132071R25243P89940Q53598P09355L29137K8432j76549
948.4G87425578o27697j440942k244651k889574l749728m923582o114185p371009q911132
966.8G49153078j0581971j1983096j2692690j2461901j1391818r894848q468509p431388
$$ plain form
983.1 664246857 657479465 651277006 645728707 640943468 636977911 633747697 631096542 628922045
999.4 628922045 627171338 625645041 623774707 620936930 616930425 611895084 606079817 599843264
1015.7 599843264 593607605 587605953 581817508 576194763 570776284 565634847 560815811 556390643
1032 556390643 552558124 549431026 546783626 544364095 542145252 540059566 537849069 535381496 532914519
1050.4 532914519 530928910 529904544 530255258 532123983 535080314 538193524 540454090 541269422 540510237
1068.7 540510237 538312376 535175443 531893611 528996527 526362181 523621738 520590007 517064154
1085 517064154 512660384 507382989 502144217 498311311 496792018 497649759 500351310 504113972 508124828
1103.4 508124828 511743724 514817119 517471254 519520581 520503461 520015836 517491996 512274742 505327523
$$ packed form
983.1F64246857o767392o202459n548299m785239l965557l230214k651155k174497
999.4F28922045j750707j526297j870334k837777m006505n035341n815267o236553
1015.7E99843264o235659o001652n788445n622745n418479n141437m819036m425168
1032E56390643l832519l127098k647400k419531k218843k085686k210497k467573k466977
1050.4E32914519j985609j024366L50714J868725K956331L113210K260566Q15332p59185
1068.7E40510237k197861l136933l281832k897084k634346k740443l031731l525853
1085E17064154m403770n277395n238772l832906j519293Q57741K701551L762662M010856
1103.4E08124828L618896L073395K654135K049327R82880m87625k523840n217254o947219
$$ plain form
1121.8 505327523 500416458 500630975 504425943 508111715 509652495 509310961 509250939 511470616 515889764
1140.1 515889764 521154881 525990665 529665172 532214701 534171164 535933375 537639856 539559960
1156.4 539559960 542233109 546069264 551249444 558056295 566699266 576795340 587495208 598053932
1172.7 598053932 608080566 617310643 625427365 632263839 637873709 642098427 644363165 644298553
1189.1 644298553 642185807 638523281 633801401 628905177 625153005 623569787 624157190 626140535
1205.4 626140535 628734648 631191254 632686019 632906139 632341564 631595314 630732715 629680753 628785968
1223.7 628785968 628339112 628141582 628047526 628353477 629274964 630508780 631685615 632894576 634325922
1242.1 634325922 635703087 636646748 637288332 637903690 638386667 638637781 639033437 640090287 641886652
$$ packed form
1121.8E05327523m911065K14517L794968L685772J540780l41534o0022K219677M419148
1140.1E15889764N265117M835784L674507K549529J956463J762211J706481J920104
1156.4E39559960K673149L836155N180180O806851Q642971J0096074J0699868J0558724
1172.7E98053932J0026634R230077Q116722O836474N609870M224718K264738o4612
1189.1F44298553k112746l662526m721880m896224l752172j583218N87403J983345
1205.4F26140535K594113K456606J494765K20120n64575p46250q62599j051962q94785
1223.7F28785968m46856j97530r4056L05951R21487J233816J176835J208961J431346
1242.1F34325922J377165R43661O41584O15358M82977K51114L95656J056850J796365
$$ plain form
1260.4 641886652 644264698 647412300 651553392 656335950 661266148 666368425 671810150 677296400
1276.8 677296400 682427526 687369645 692523360 697753966 702647746 707209945 711629748 715657353
1293.1 715657353 718910873 721584082 724099100 726327837 727956653 729234397 730579197 731831908
1309.4 731831908 732641935 733241737 734062910 735015512 735824823 736642480 737735629 738854051 739555478
1327.8 739555478 739892542 740113020 740013301 739322603 738434970 738054931 738191009 738346994 738446116 738686323
1348.1 738686323 738901138 738742828 738284051 737676620 736475825 733972251 730152547 726302683 723526597
1366.5 723526597 721276939 718320727 713829577 708314598 704289079 703796089 705916882 708180487
1382.8 708180487 709945619 712006330 713941514 714661300 713998437 712538064 710881114 708862662 706406176
$$ packed form
1260.4F41886652K378046L147602M141092M782558M930198N102277N441725N486250
1276.8F77296400N131126M942119N153715N230606M893780M562199M419803M027605
1293.1G15657353L253520K673209K515018K228737J628816J277744J344800J252711
1309.4G31831908Q10027N99802Q21173R52602Q09311Q17657J093149J118422P01427
1327.8G39555478L37064K20478r9719o90698q87633l80039J36078J55985R9122K40207
1348.1G38686323K14815j58310m58777o07431j200795k503574l819704l849864k776086
1366.5G23526597k249658k956212m491150n514979m025519m92990K120793K263605
1382.8G08180487J765132K060711J935184P19786o62863j460373j656950k018452k456486
$$ plain form
1401.2 706406176 703769147 701223016 698980033 696877122 695003808 693621933 692455232 691158533
1417.5 691158533 690165341 689811766 689467728 688715339 687559843 685961068 683964193 681686938 679347515
1435.9 679347515 677676976 676508904 674937010 672953069 670965731 668955922 666710377 664048374
1452.2 664048374 661453903 660471559 662979782 667183578 671203434 675798595 682906926 693970203
1468.5 693970203 709481001 728155017 743748128 753779531 760626972 765347958 768320143 769811451
1484.8 769811451 770030320 769103110 767429769 765501082 762876153 759183884 755227864 751540542 747723699
1503.2 747723699 742541134 735928059 731103718 727435529 723422587 719383061 716112494 713833451
1519.5 713833451 711870909 710155845 708749771 707502604 706343889 704902947 703482151 702565014
$$ packed form
1401.2G06406176k637029k546131k242983k102911j873314j381875j166701j296699
1417.5F91158533r93192l53575l44038p52389j155496j598775j996875k277255k339423
1435.9F79347515j670539j168072j571894j983941j987338k009809k245545k662003
1452.2F64048374k594471r82344K508223M203796M019856M595161P108331J1063277
1468.5F93970203J5510798J8674016J5593111J0031403O847441M720986K972185J491308
1484.8G69811451K18869r27210j673341j928687k624929l692269l956020l687322l816843
1503.2G47723699n182565o613075m824341l668189m012942m039526l270567k279043
1519.5G13833451j962542j715064j406074j247167j158715j440942j420796r17137
$$ plain form
1535.8 702565014 701429784 699882507 699359894 699876010 700431824 700781465 701212943 701968968 702739298
1554.1 702739298 703017831 703318119 705073535 706676960 707023919 706529200 705407381 703818917 701803863
1572.5 701803863 698722720 694451392 690315664 685968339 680597901 674652219 668379962 661687970
1588.8 661687970 654609740 647389412 640096426 632781386 625502229 618275166 611147821 604109645
1605.1 604109645 597019553 589794755 582651198 575604558 567915738 559774935 553337336 547624111
1621.4 547624111 541254699 535327792 530334651 526084423 522702515 519927800 518129945 518243670
1637.8 518243670 519489765 521244764 523417950 526630402 530956924 534617782 538735747 545624435
1654.1 545624435 551876903 556876838 562285841 568812549 575884461 582142651 588673830 596548080
$$ packed form
1535.8G02565014j135230j547277n22613N16116N55814L49641M31478P56025P70330
1554.1G02739298K78533L00288J755416J603425L46959m94719j121819j588464k015054
1572.5G01803863l081143m271328m135728m347325n370438n945682o272257o691992
1588.8F61687970p078230p220328p292986p315040p279157p227063p127345p038176
1605.1F04109645p090092p224798p143557p046640p688820q140803o437599n713225
1621.4E47624111o369412n926907m993141m250228l381908k774715j797855J13725
1637.8E18243670J246095J754999K173186L212452M326522L660858M117965O888688
1654.1E45624435O252468M999935N409003O526708P071912O258190O531179P874250
$$ plain form
1670.4 596548080 604114175 611734986 620212793 628095746 635013819 642278790 651999474 661628485
1686.7 661628485 669452310 676796913 683174610 689659715 697153091 705573142 716109097 725480318
1703 725480318 732926071 739979625 746034205 751145482 755589485 759570777 763944149 768672407 772629023
1721.4 772629023 775780618 778651416 781373918 783902824 785985708 788165331 791011870 793484688
1737.7 793484688 795415103 797383845 799762607 802725136 806373835 810978651 816364288 821142375
1754 821142375 824841559 827830851 830359221 832831800 835084438 836709082 837886870 838920236 840106249
1772.4 840106249 841661036 843214393 844540834 845649719 846606791 847581327 848641813 849436462 849730134
1790.7 849730134 850240648 851373851 852378190 852894068 853433490 854334354 855174780 855620682 855911613
$$ packed form
1670.4E96548080P566095P620811Q477807P882953O918073P264971R720684R629011
1686.7F61628485P823825P344603O377697O485105P493376Q420051J0535955R371221
1703G25480318P445753P053554O054580N111277M444003L981292M373372M728258L956616
1721.4G72629023L151595K870798K722502K528906K082884K179623K846539K472818
1737.7G93484688J930415J968742K378762K962529L648699M604816N385637M778087
1754H21142375L699184K989292K528370K472579K252638J624644J177788J033366J186013
1772.4H40106249J554787J553357J326441J108885R57072R74536J060486P94649K93672
1790.7H49730134N10514J133203J004339N15878N39422R00864Q40426M45902K90931
$$ plain form
1809.1 855911613 856449902 857129276 857598722 857914150 858353257 858757079 858862519 858931303 859207869 859557450
1829.5 859557450 860009432 860500216 860892355 861239731 861437321 861337543 861228526 861603737 862131655 862436116
1849.9 862436116 862706542 863020301 863208115 863254786 863387227 863639534 863736868 863486886 863264620 863591015
1870.3 863591015 864106596 864283621 864282250 864406884 864533961 864492357 864443302 864490628 864458680 864385545 864425004
1892.7 864425004 864554584 864709795 864753246 864696205 864724159 864831388 864804327 864661038 864667356 864794970 864730895
1915.1 864730895 864487112 864451706 864597559 864615619 864575744 864638507 864735425 864695966 864513040 864400208 864419818
1937.6 864419818 864291728 863938630 863774955 863912880 863948822 863757849 863601685 863578498 863477349 863194466
1958 863194466 862982512 862997830 862962663 862671614 862397492 862354338 862309158 862072051 861838460 861809015 861787140
$$ packed form
1809.1H55911613N38289O79374M69446L15428M39107M03822J05440O8784K76566L49581
1829.5H59557450M51982M90784L92139L47376J97590r9778j09017L75211N27918L04461
1849.9H62436116K70426L13759J87814M6671J32441K52307R7334k49982k22266L26395
1870.3H63591015N15581J77025j371J24634J27077m1604m9055M7326l1948p3135L9459
1892.7H64425004J29580J55211M3451n7041K7954J07229k7061j43289O318J27614o4075
1915.1H64730895k43783l5406J45853J8060l9875O2763R6918l9459j82926j12832J9610
1937.6H64419818j28090l53098j63675J37925L5942j90973j56164k3187j01149k82883
1958H63194466k11954J5318l5167k91049k74122m3154m5180k37107k33591k9445k1875
$$ plain form
1980.4 861787140 861549199 861253262 861140549 861087978 860843658 860566258 860519350 860517204 860298812 860002398
2000.8 860002398 859860718 859774292 859514654 859185576 859040141 858993471 858759820 858378589 858165145 858102083
2021.2 858102083 857893646 857548714 857352853 857310951 857150495 856839359 856642187 856612623 856484473 856203258
2041.6 856203258 856045961 856080413 855998933 855712771 855518103 855522156 855459690 855219901 855042934 855039179 854993284
2064 854993284 854767740 854582906 854616344 854651213 854487002 854341805 854408741 854493976 854395151 854247868 854275703
2086.5 854275703 854372561 854320884 854226768 854291618 854370058 854265392 854152322 854258358 854439914 854434133 854316533
2108.9 854316533 854339182 854476869 854482234 854377389 854424000 854588807 854605258 854513526 854577422 854788184 854876161
2131.3 854876161 854802608 854844153 855039656 855115533 855022728 855023563 855202675 855321586 855286658 855311573 855484545
$$ packed form
1980.4H61787140k37941k95937j12713n2571k44320k77400m6908k146k18392k96414
2000.8H60002398j41680q6426k59638l29078j45435m6670k33651l81231k13444o3062
2021.2H58102083k08437l44932j95861m1902j60456l11136j97172k9564j28150k81215
2041.6H56203258j57297L4452q1480k86162j94668M053o2466k39789j76967l755m5895
2064H54993284k25544j84834L3438L4869j64211j45197O6936Q5235r8825j47283K7835
2086.5H54275703R6858n1677r4116O4850P8440j04666j13070J06036J81556n781j17600
2108.9H54316533K2649J37687N365j04845M6611J64807J6451r1732O3896K10762Q7977
2131.3H54876161p3553M1545J95503P5877r2805Q35J79112J18911l4928K4915J72972
$$ plain form
2153.8 855484545 855608881 855606139 855650008 855817974 855934799 855909348 855925143 856116891 856317163 856354058 856370211
2176.2 856370211 856537342 856724739 856748998 856754065 856919229 857082188 857083499 857054889 857161939 857303023 857288182
2198.6 857288182 857204795 857263446 857382119 857356846 857286155 857378602 857555985 857589245 857504368 857504666 857578099
2221.1 857578099 857559085 857480764 857513845 857612848 857580721 857448280 857440293 857546926 857522011 857355654 857307374
2243.5 857307374 857392669 857339621 857131839 857019305 857020974 856923580 856705010 856559455 856556535 856540024 856418133
2265.9 856418133 856343269 856409073 856446624 856368423 856368363 856535435 856682360 856675386 856586039 856467009 856250346
2288.4 856250346 855908096 855533242 855221689 854901314 854442596 853914201 853435457 852850139 851974308 850948215
2308.8 850948215 850012064 849234939 848456025 847355902 845830619 844274044 843100309 842201471 841231287
$$ packed form
2153.8H55484545J24336k742M3869J67966J16825k5451J5795J91748K00272L6895J6153
2176.2H56370211J67131J87397K4259N067J65164J62959J311k8610J07050J41084j4841
2198.6H57288182q3387N8651J18673k5273p0691R2447J77383L3260q4877K98P3433
2221.1H57578099j9014p8321L3081R9003l2127j32441p987J06633k4915j66357m8280
2243.5H57307374Q5295n3048k07782j12534J669r7394k18570j45555k920j6511j21891
2265.9H56418133p4864O5804L7551p8201o0J67072J46925o974q9347j19030k16663
2288.4H56250346l42250l74854l11553l20375m58718n28395m78744n85318q75831j026093
2308.8H50948215r36151p77125p78914j100123j525283j556575j173735q98838r70184
$$ plain form
2327.1 841231287 840152383 839282453 838765800 838355601 837896883 837430537 837181330 837825775 840128124
2345.5 840128124 842719913 843087673 840672255 836869657 833402932 831000507 830000043 830309570 831534088
2363.8 831534088 833517253 836126089 839126170 842249274 845215678 847987473 850659728 853146970
2380.2 853146970 855195045 856623650 857472360 857935667 858158529 858203828 858168840 858146548 858106554 858019590
2400.6 858019590 857974648 858008146 858038187 857985675 857905507 857903361 857923090 857859373 857765675 857710660 857651770 857531548
2425 857531548 857370436 857259512 857199192 857107222 857001185 856951654 856924534 856830776 856683075 856588244 856544077
2447.5 856544077 856426477 856263876 856187701 856151998 856015861 855819106 855717123 855687141 855570436 855378985
2467.9 855378985 855252147 855171561 855032206 854847193 854714692 854647160 854552507 854419827 854307711 854201734
$$ packed form
2327.1H41231287j078904q69930n16653m10199m58718m66346k49207O44445K302349
2345.5H40128124K591789L67760k415418l802598l466725k402425j000464L09527J224518
2363.8H31534088J983165K608836L000081L123104K966404K771795K672255K487242
2380.2H53146970K048075J428605Q48710M63307K22862M5299l4988k2292l9994q6964
2400.6H58019590m4942L3498L0041n2512q0168k146J9729o3717r3698n5015n8890j20222
2425H57531548j61112j10924o0320r1970j06037m9531k7120r3758j47701r4831m4167
2447.5H56544077j17600j62601p6175l5703j36137j96755j01983k9982j16705j91451
2467.9H55378985j26838q0586j39355j85013j32501o7532r4653j32680j12116j05977
$$ plain form
2488.3 854201734 854040384 853831351 853661299 853562355 853456199 853287637 853109837 852985859 852856934 852650642
2508.7 852650642 852477014 852414548 852307677 852084517 851889789 851759970 851595342 851378381 851180494 851040661
2529 851040661 850911021 850756168 850593209 850424290 850244224 850053191 849880219 849769950 849670529 849505782
2549.4 849505782 849310458 849127233 848944128 848747194 848535895 848328531 848124325 847886741 847638369 847441733
2569.8 847441733 847247243 846960664 846628487 846348822 846089363 845805168 845520318 845225573 844875753 844472587
2590.2 844472587 844089448 843775272 843496382 843207359 842884183 842527688 842176914 841832280 841463149 841098607
2610.6 841098607 840769470 840462267 840134799 839752257 839341938 838962197 838618279 838269055 837900937 837559879
2631 837559879 837256908 836926222 836573362 836244524 835903168 835514963 835115552 834754407 834415436 834023833
$$ packed form
2488.3H54201734j61350k09033j70052r8944j06156j68562j77800j23978j28925k06292
2508.7H52650642j73628o2466j06871k23160j94728j29819j64628k16961j97887j39833
2529H51040661j29640j54853j62959j68919j80066j91033j72972j10269r9421j64747
2549.4H49505782j95324j83225j83105j96934k11299k07364k04206k37584k48372j96636
2569.8H47441733j94490k86579l32177k79665k59459k84195k84850k94745l49820m03166
2590.2H44472587l83139l14176k78890k89023l23176l56495l50774l44634l69131l64542
2610.6H41098607l29137l07203l27468l82542m10319l79741l43918l49224l68118l41058
2631H37559879l02971l30686l52860l28838l41356l88205l99411l61145l38971l91603
$$ plain form
2651.4 834023833 833593309 833198667 832807660 832374275 831932247 831532896 831161737 830757916 830355525 830048144
2671.8 830048144 829808950 829551518 829279780 829012215 828723192 828386247 828026295 827715218 827459812 827182531
2692.2 827182531 826846957 826522291 826240420 825911343 825471997 824986696 824528217 824043870 823451102 822825193
2712.6 822825193 822253466 821647227 820979297 820371687 819855750 819321871 818705559 818149209 817812920 817614496
2733 817614496 817418694 817228794 817046046 816810191 816497207 816197515 815937698 815550327 814986110 814441085
2753.4 814441085 814019859 813581228 813022196 812446296 811930835 811366737 810667872 809934676 809257627 808565676
2773.8 808565676 807748079 806840897 805962026 805083811 804102540 803061128 802091599 801156640 800095439
2792.2 800095439 798922837 797779262 796613216 795261323 793783367 792326987 790848672 789257586
$$ packed form
2651.4H34023833m30524l94642l91007m33385m42028l99351l71159m03821m02391l07381
2671.8H30048144k39194k57432k71738k67565k89023l36945l59952l11077k55406k77281
2692.2H27182531l35574l24666k81871l29077m39346m85301m58479m84347n92768o25909
2712.6H22825193n71727o06239o67930o07610n15937n33879o16312n56350l36289j98424
2733H17614496j95802j89900j82748k35855l12984k99692k59817l87371n64217n45025
2753.4H14441085m21226m38631n59032n75900n15461n64098o98865p33196o77049o91951
2773.8H08565676q17597r07182q78871q78215r81271j041412r69529r34959j061201
2792.2H00095439j172602j143575j166046j351893j477956j456380j478315j591086
$$ plain form
2808.5 789257586 787536204 785675526 783660233 781459272 779053509 776414871 773461580 770073950
2824.8 770073950 766091526 761353552 755639970 748604834 739862382 728941858 715258002 698448420
2841.1 698448420 678577423 655843019 630872548 605920076 585400283 574129999 574034393 582792819
2857.4 582792819 595761836 608535767 618141711 623389900 624966264 625168562 626853108 631469429
2873.7 631469429 637981415 643988609 647535384 647906721 645330012 640386224 633684576 625747085
2890.1 625747085 617072701 608168781 599300861 590377927 581248224 571771741 561583936 550184488
2906.4 550184488 537081540 521717608 503562152 482493311 459326446 436133713 416029781
2920.6 416029781 402323663 397229373 401020050 412161887 428281218 447369456 467964530 488576412
$$ packed form
2808.5G89257586j721382j860678k015293k200961k405763k638638k953291l387630
2824.8G70073950l982424m737974n713582p035136q742452j0920524j3683856j6809582
2841.1F98448420j9870997k2734404k4970471k4952472k0519793j1270284r5606Q758426
2857.4E82792819J2969017J2773931R605944N248189J576364K02298J684546M616321
2873.7F31469429O511986O007194L546775L71337k576709m943788o701648p937491
2890.1F25747085q674384q903920q867920q922934r129703r476483j0187805j1399448
2906.4E50184488j3102948j5363932j8155456k1068841k3166865k3192733k0103932
2920.6D16029781j3706118n094290L790677J1141837J6119331J9088238K0595074K0611882
$$ plain form
2937 488576412 507570267 523408651 534802079 540933669 541813076 538615882 533656716 529657602
2953.3 529657602 528883994 532477677 540295839 551620126 565733790 581880927 599016726 615846276
2969.6 615846276 631369829 645034492 656549871 666106641 674103677 680638611 685877800 690235019
2985.9 690235019 693942010 697021186 699414849 701063812 702127159 702723145 702809989 702525198 702084243
3004.3 702084243 701643765 701330423 701147735 700979531 700732350 700396538 699999869 699566305 699088991 698465228
3024.7 698465228 697598815 696609795 695652246 694678187 693517447 692160547 690783083 689408064 687892675
3043 687892675 686183751 684412837 682731688 681090176 679398477 677726865 676074684 674365699 672675908
3061.4 672675908 671126962 669694245 668216228 666652024 665128052 663705945 662396431 661164820
$$ packed form
2937D88576412J8993855J5838384J1393428O131590Q79407l197194m959166l999114
2953.3E29657602p73608L593683P818162J1324287J4113664J6147137J7135799J6829550
2969.6F15846276J5523553J3664663J1515379R556770P997036O534934N239189M357219
2985.9F90235019L706991L079176K393663J648963J063347N95986Q6844k84791m40955
3004.3G02084243m40478l13342j82688j68204k47181l35812l96669m33564m77314o23763
3024.7F98465228q66413r89020r57549r74059j160740j356900j377464j375019j515389
3043F87892675j708924j770914j681149j641512j691699j671612j652181j708985j689791
3061.4F72675908j548946j432717j478017j564204j523972j422107j309514j231611
$$ plain form
3077.7 661164820 659832358 658313751 656715691 655088007 653479993 651909113 650257409 648505211
3094 648505211 646746755 645026863 643271267 641395092 639464140 637586713 635715723 633707047 631637096
3112.4 631637096 629671454 627698421 625540316 623169184 620638371 618042052 615496278 613069534
3128.7 613069534 610646546 608058333 605382383 602824867 600332975 597632408 594704807 591791034
3145 591791034 588965297 586179137 583423078 580549240 577419043 574182212 571018100 567963898 564960241
3163.4 564960241 561885238 558714390 555536032 552387834 549222410 546021700 542827725 539644539
3179.7 539644539 536422253 533211410 530074656 526937902 523727298 520473421 517258942 514064372 510834694
3198 510834694 507641852 504553914 501494765 498390585 495276958 492218524 489215463 486219376 483226985
$$ packed form
3077.7F61164820j332462j518607j598060j627684j608014j570880j651704j752198
3094F48505211j758456j719892j755596j876175j930952j877427j870990k008676k069951
3112.4F31637096j965642j973033k158105k371132k530813k596319k545774k426744
3128.7F13069534k422988k588213k675950k557516k491892k700567k927601k913773
3145E91791034k825737k786160k756059k873838l130197l236831l164112l054202l003657
3163.4E64960241l075003l170848l178358l148198l165424l200710l193975l183186
3179.7E39644539l222286l210843l136754Tl210604l253877l214479l194570l229678
3198E10834694l192842l087938l059149l104180l113627l058434l003061k996087k992391
$$ plain form
3216.4 483226985 480260164 477318585 474383265 471465230 468590945 465771049 463044375 460392177
3232.7 460392177 457687140 454911023 452172637 449493825 446893841 444403559 441931993 439392865
3249 439392865 436841697 434370965 431976467 429593176 427216083 424865395 422504932 420168072 417966902
3267.4 417966902 415888906 413758576 411472499 409154564 406939209 404787987 402643949 400533229
3283.7 400533229 398448646 396368653 394353598 392381698 390344471 388229877 386081338 383994073
3300 383994073 382053286 380201578 378262699 376118362 373856097 371632576 369508773 367447853 365386039
3318.4 365386039 363298535 361230135 359203011 357128471 354976296 352834105 350747764 348731607
3334.7 348731607 346773982 344764352 342647910 340507209 338378549 336335033 334493816 332658798
$$ packed form
3216.4D83226985k966821k941579k935320k918035k874285k819896k726674k652198
3232.7D60392177k705037k776117k738386k678812k599984k490282k471566k539128
3249D39392865k551168k470732k394498k383291k377093k350688k360463k336860k201170
3267.4D17966902k077996k130330k286077k317935k215355k151222k144038k110720
3283.7D00533229k084583k079993k015055j971900k037227k114594k148539k087265
3300C83994073j940787j851708j938879k144337k262265k223521k123803k060920k061814
3318.4C65386039k087504k068400k027124k074540k152175k142191k086341k016157
3334.7C48731607j957625k009630k116442k140701k128660k043516j841217j835018
$$ plain form
3351 332658798 330576837 328397185 326383978 324550748 322752684 320971221 319382101 317967415 316413909
3369.3 316413909 314597428 312801331 311290741 310014337 308861911 307769030 306751758 305903107
3385.7 305903107 305311501 305011988 304703712 304075599 303436309 303235948 303301692 303073704 302495897 302098781
3406.1 302098781 302076757 302236825 302436769 302556992 302633643 302867651 303322911 303888649 304533809 305338532
3426.5 305338532 306326032 307377934 308502048 309773088 310962975 311891109 312852830 314145774 315677583
3444.8 315677583 317312926 319004953 320762366 322614789 324584961 326715708 328977048 331184924
3461.1 331184924 333397359 335957319 338755190 341227472 343251467 345340490 347757697 350445807
3477.4 350445807 353260934 355920553 358488113 361243129 364086092 366887659 369780719 372804165
$$ packed form
3351C32658798k081961k179652k013207j833230j798064j781463j589120j414686j553506
3369.3C16413909j816481j796097j510590j276404j152426j092881j017272q48651
3385.7C05903107n91606k99513l08276o28113o39290k00361O5744k27988n77807l97116
3406.1C02098781k2024J60068J99944J20223P6651K34008M55260N65738O45160Q04723
3426.5C05338532R87500J051902J124114J271040J189887R28134R61721J292944J531809
3444.8C15677583J635343J692027J757413J852423J970172K130747K261340K207876
3461.1C31184924K212435K559960K797871K472282K023995K089023K417207K688110
3477.4C50445807K815127K659619K567560K755016K842963K801567K893060L023446
$$ plain form
3493.8 372804165 375922501 379030555 382118195 385250598 388253808 391136825 394241601 397650599
3510.1 397650599 401196718 404692054 408031523 411370099 414893061 418686599 422490448 426033080
3526.4 426033080 429585099 433405846 437389404 441488117 445644289 449664980 453707516 457985610
3542.7 457985610 462366968 466587305 470682204 474933535 479415566 483949155 488465041 493082941
3559 493082941 497734606 502183259 506664872 511872232 517494857 522715747 527681708 532809198 538174987
3577.4 538174987 543743014 549395502 554891527 560289681 566025257 572062731 577837288 583512783
3593.7 583512783 589462698 595566094 601711750 607899725 613894701 619624496 625586927 631898105
3610 631898105 638185620 644282758 650056899 655957103 662390351 668504477 673744559 678515136 684014201
$$ packed form
3493.8C72804165L118336L108054L087640L132403L003210K883017L104776L408998
3510.1C97650599L546119L495336L339469L338576L522962L793538L803849L542632
3526.4D26033080L552019L820747L983558M098713M156172M020691M042536M278094
3542.7D57985610M381358M220337M094899M251331M482031M533589M515886M617900
3559D93082941M651665M448653M481613N207360N622625N220890M965961N127490N365789
3577.4E38174987N568027N652488N496025N398154N735576O037474N774557N675495
3593.7E83512783N949915O103396O145656O187975N994976N729795N962431O311178
3610F31898105O287515O097138N774141N900204O433248O114126N240082M770577N499065
$$ plain form
3628.4 684014201 690511525 696505487 701982260 707288086 712348163 717247009 721861124 725883126
3644.7 725883126 729515374 733774424 738812029 743221641 746891439 750750065 754685163 758052528
3661 758052528 760890186 763387799 765487492 767484784 769749045 771670163 773398817 775817871 778386772
3679.4 778386772 780570507 782464027 784061670 785405099 786726236 788322926 790128469 791714311
3695.7 791714311 792819262 793576777 794403195 795499146 796463549 796955824 797263086 798097968 799424291
3714 799424291 800445318 800905406 801008523 801092505 801414967 801927507 802403152 802594125 802569091 802803576
3734.4 802803576 803727090 804919302 805490673 805189490 804844916 805198193 805431187 805525482 806334078 807347775
3754.8 807347775 807873905 808152080 808612287 809061646 809240699 809294164 809423208 809777200 810236454 810526788
$$ packed form
3628.4F84014201O497324N993962N476773N305826N060077M898846M614115M022002
3644.7G25883126L632248M259050N037605M409612L669798L858626L935098L367365
3661G58052528K837658K497613K099693J997292K264261J921118J728654K419054K568901
3679.4G78386772K183735J893520J597643J343429J321137J596690J805543J585842
3695.7G91714311J104951P57515Q26418J095951R64403M92275L07262Q34882J326323
3714G99424291J021027M60088J03117Q3982L22462N12540M75645J90973k5034K34485
3734.4H02803576R23514J192212N71371l01183l44574L53277K32994R4295Q08596J013697
3754.8H07347775N26130K78175M60207M49359J79053N3465J29044L53992M59254K90334
$$ plain form
3775.2 810526788 810629427 810700953 810875714 811052501 811198235 811405122 811628103 811751902 811639786 811357200
3795.6 811357200 811078668 810715795 810562670 810934663 811222374 811458230 811953723 812192202 811844647 811372936
3816 811372936 811186194 810952842 811038554 811612368 812003255 812120080 812058091 811892986 811751604 811446249
3836.4 811446249 811067820 811150312 811633289 812194765 812589109 812486768 811631262 810389102 810331762 811369777
3856.8 811369777 812061250 812058032 811691582 811460793 811353862 811136663 811123610 811439455 811818361 811997473
3877.2 811997473 811800420 811606288 811652124 811725736 811793745 811718881 811576426 811671257 811758280 811481237 810957491
3899.6 810957491 810564578 810585916 811017871 811475992 811663330 811646104 811470985 811158359 810973763 811027527
3920 811027527 811076403 810974181 810841143 810779989 810747027 810807943 811002374 811122060 811063349 810881555 810655951
$$ packed form
3775.2H10526788J02639P1526J74761J76787J45734K06887K22981J23799j12116k82586
3795.6H11357200k78532l62873j53125L71993K87711K35856M95493K38479l47555m71711
3816H11372936j86742k33352Q5712N73814L90887J16825o1989j65105j41382l05355
3836.4H11446249l78429Q2492M82977N61476L94344j02341q55506j242160n7340J038015
3856.8H11369777O91473l218l66450k30789j06931k17199j3053L15845L78906J79112
3877.2H11997473j97053j94132M5836P3612O8009p4864j42455R4831Q7023k77043n23746
3899.6H10957491l92913K1338M31955M58121J87338j7226j75119l12626j84596N3764
3920H11027527M8876j02222j33038o1154l2962O0916J94431J19686n8711j81794k25604
$$ plain form
3942.5 810655951 810565829 810649276 810765207 810818374 810790300 810713053 810646355 810639322 810639918 810589075 810563564 810596049
3966.9 810596049 810589254 810544491 810561717 810605705 810586929 810556054 810584962 810617447 810590923 810508549 810401857
3989.4 810401857 810329854 810325086 810393453 810495019
3997.5 810495019
$$ packed form
3942.5H10655951r0122Q3447J15931N3167k8074p7247o6698p033N96n0843k5511L2485
3966.9H10596049o795m4763J7226M3988j8776l0875K8908L2485k6524q2374j06692
3989.4H10401857p2003m768O8367J01566
3997.5H10495019
##END=$$ End of the data block
