##TITLE=$$ Begin of the data block
##JCAMP-DX=5.00 $$ ACD/SpecManager v 10.08
##SPECTROMETER/DATA SYSTEM=Alpha
##DATE=14 Apr 2014 11:23:48
##DATA TYPE=INFRARED SPECTRUM
##DATA CLASS=XYDATA
##ORIGIN=
##OWNER=
##NPOINTS=1765
##FIRSTX=399.75695801
##LASTX=3997.56933594
##MAXX=3997.56933594
##MINX=399.75695801
##MAXY=0.86509615
##MINY=0.30219534
##XFACTOR=1.0000000000
##YFACTOR=1.000000000000000e-9
##FIRSTY=0.69305962
##DELTAX=2.03957629
##XUNITS=1/CM
##YUNITS=ARBITRARY UNITS
##XYDATA=(X++(Y..Y))
$$ plain form
399.8 693059623 691320300 687630534 685921848 685777366 683510661 680445194 679924309 680275261 678066969
418.1 678066969 675131321 675399661 676393151 674850523 672868192 673372686 673851252 671511829 669239283
436.5 669239283 669624090 669887245 668186605 667468190 668773115 668691218 666615963 665819764 666724205
454.8 666724205 666176736 664018273 663545430 664356768 663382530 661104083 660440207 660700023 659251392
473.2 659251392 657294750 657244563 657827914 656743824 655183792 655445635 655982554 654442847 652428627
491.5 652428627 652137339 652110696 650587320 649110496 649137914 648975611 647372842 646012425 645929992 645495355
511.9 645495355 643740714 642154098 641647637 640760422 638820708 637382567 636970520 635988653 634098470
530.3 634098470 632801533 632367015 631595194 630382955 629863799 630093932 629765093 628636539 627932250
$$ packed form
399.8F93059623j739323l689766j708686j44482k266705l065467n20885L50952k208292
418.1F78066969k935648K68340R93490j542628j982331N04494M78566k339423k272546
436.5F69239283L84807K63155j700640p18415J304925q1897k075255p96199R04441
454.8F66724205n47469k158463m72843Q11338r74238k278447o63876K59816j448631
473.2F59251392j956642n0187N83351j084090j560032K61843N36919j539707k014220
491.5F52428627k91288k6643j523376j476824K7418j62303j602769j360417q2433m34637
511.9F45495355j754641j586616n06461q87215j939714j438141m12047r81867j890183
530.3F34098470j296937m34518p71821j212239n19156K30133l28839j128554p04289
$$ plain form
548.6 627932250 627818584 627163172 625861943 624937057 624392271 623287380 621647596 620174587 618751705
567 618751705 616814017 614540935 612480521 610658705 608812928 606958687 605289757 603734374 601966441
585.4 601966441 599979281 598062932 596198201 594260097 592596829 591524363 590678215 589517176 588158429
603.7 588158429 587244272 587049663 587252200 587163389 586426973 585806727 586692989 589317381 592672408 596258700
624.1 596258700 599917769 603273571 606194317 608997226 611870527 614415050 616221368 617309451
640.4 617309451 617657423 617608964 618302941 620244503 622141480 622110367 620486140 620608509 624618709
658.8 624618709 630228162 634541690 636635840 636984766 638747454 642529249 645660341 648046970 649916112
677.1 649916112 651470304 653213918 655126631 656659484 657784104 659089744 660511434 661253035 661278307
$$ packed form
548.6F27932250j13666o55412j301229r24886n44786j104891j639784j473009j422882
567F18751705j937688k273082k060414j821816j845777j854241j668930j555383j767933
585.4F01966441j987160j916349j864731j938104j663268j072466q46148j161039j358747
603.7E88158429r14157j94609K02537q8811p36416o20246Q86262K624392L355027L586292
624.1E96258700L659069L355802K920746K802909K873301K544523J806318J088083
640.4F17309451L47972m8459O93977J941562J896977l1113j624227J22369M010200
658.8F24618709N609453M313528K094150L48926J762688L781795L131092K386629J869142
677.1F49916112J554192J743614J912713J532853J124620J305640J421690P41601K5272
$$ plain form
695.5 661278307 661464095 662180185 662879348 663510203 664741635 666448176 667725146 668577015 669730663
713.8 669730663 670862019 671117306 671227932 672862232 675882816 678878725 681455135 684078157 686571479
732.2 686571479 688326597 689571261 690946579 692360044 693402052 694501460 696286023 698260188
748.5 698260188 699695230 701092184 703142583 705309272 706809580 708019018 709620476 711228132
764.8 711228132 712359071 713474095 714997828 716390669 717054188 717381120 717778921 717704415 716949344
783.2 716949344 716488540 716941059 717768490 718704283 720525622 723648012 727288067 730849445 734724402
801.6 734724402 739032924 742911518 745861650 748602271 751623273 754256129 756115973 757729232
817.9 757729232 759175599 759670615 758972943 757768989 756196618 753667951 750411510 747460485 745055795
$$ packed form
695.5F61278307J85788P16090O99163O30855J231432J706541J276970Q51869J153648
713.8F69730663J131356K55287J10626J634300L020584K995909K576410K623022K493322
732.2F86571479J755118J244664J375318J413465J042008J099408J784563J974165
748.5F98260188J435042J396954K050399K166689J500308J209438J601458J607656
764.8G11228132J130939J115024J523733J392841O63519L26932L97801p4506p55071
783.2G16949344m60804M52519Q27431R35793J821339L122390L640055L561378L874957
801.6G34724402M308522L878594K950132K740621L021002K632856J859844J613259
817.9G57729232J446367M95016o97672j203954j572371k528667l256441k951025k404690
$$ plain form
836.2 745055795 742458582 739317715 736242652 733637273 731276870 729661345 730034828 732809305 737290382
854.6 737290382 742937088 749771297 757270694 764301300 770484090 776247442 781526983 785659194
870.9 785659194 788709939 791484892 794014871 795636356 796337545 796630561 796459615 795363367 793637455
889.3 793637455 792164207 791195035 790525734 790404320 791223407 792670727 794043422 795219064 796389997
907.6 796389997 797211170 797089815 795990288 794304729 792132556 789375365 786442161 784114480 782688916
926 782688916 781978011 781987786 782765806 783889890 784834504 785598218 786394536 787105560 787504673 787589729
946.4 787589729 787409008 786748827 785319090 783123612 780231118 776442051 771540225 765462875 758081198
964.7 758081198 749159038 738565087 726584971 713969827 701605558 690235138 680302262 671806455
$$ packed form
836.2G45055795k597213l140867l075063k605379k360403j615525L73483K774477M481077
854.6G37290382N646706O834209P499397P030606O182790N763352N279541M132211
870.9G85659194L050745K774953K529979J621485P01189K93016j70946j096248j725912
889.3G93637455j473248r69172o69301j21414Q19087J447320J372695J175642J170933
907.6G96389997Q21173j21355j099527j685559k172173k757191k933204k327681j425564
926G82688916p10905R775P78020J124084R44614P63714P96318P11024L99113Q5056
946.4G87589729j80721o60181j429737k195478k892494l789067m901826o077350p381677
964.7G58081198q922160j0593951j1980116j2615144j2364269j1370420r932876q495807
$$ plain form
981 671806455 664355934 657563329 651382208 645892620 641102433 637052417 633745074 631068110 628886163
999.4 628886163 627119184 625573099 623663068 620762765 616724849 611713350 605938673 599722624
1015.7 599722624 593481898 587479234 581717491 576136410 570773244 565684080 560878396 556454837
1032 556454837 552639127 549537897 546944380 544587791 542366505 540226698 537988067 535526156 533092201
1050.4 533092201 531170130 530184388 530492842 532295346 535238087 538364530 540627360 541439712 540693521
1068.7 540693521 538504064 535366476 532109678 529218554 526561797 523839831 520845950 517324805
1085 517324805 512909234 507615387 502366245 498564839 497087657 497938126 500628948 504418075 508427083
1103.4 508427083 512020588 515092313 517714858 519701481 520668507 520218611 517732382 512502432 505496979
$$ packed form
981F71806455p450521o792605o181121n489588m790187m050016l307343k676964k181947
999.4F28886163j766979j546085j910031k900303m037916n011499n774677o216049
1015.7E99722624o240726o002664n761743n581081n363166n089164m805684m423559
1032E56454837l815710l101230k593517k356589k221286k139807k238631k461911k433955
1050.4E33092201j922071r85742L08454J802504K942741L126443K262830Q12352p46191
1068.7E40693521k189457l137588l256798k891124k656757k721966k993881l521145
1085E17324805m415571n293847n249142l801406j477182Q50469K690822L789127M009008
1103.4E08427083L593505L071725K622545J986623R67026m49896k486229n229950p005453
$$ plain form
1121.8 505496979 500536859 500729680 504525006 508228123 509779394 509452760 509413958 511622548 516021073
1140.1 516021073 521277308 526108265 529806495 532375634 534309030 536058009 537798464 539754391
1156.4 539754391 542406261 546185493 551336586 558130682 566749930 576849818 587565720 598101497
1172.7 598101497 608096242 617313206 625417054 632249355 637893438 642150462 644397557 644309938 642208815
1191.1 642208815 638572156 633854449 628938854 625190437 623632491 624224484 626219988 628842890
1207.4 628842890 631289303 632753313 632976174 632436514 631705582 630844235 629780829 628856301 628384292
1225.8 628384292 628193438 628120601 628435373 629351079 630578101 631768465 633011699 634477079 635889411
1244.1 635889411 636864066 637507617 638095737 638541281 638775229 639198065 640288174 642072558 644419312
$$ packed form
1121.8E05496979m960120J92821L795326L703117J551271l26634l8802K208590M398525
1140.1E16021073N256235M830957L698230K569139J933396J748979J740455J955927
1156.4E39754391K651870L779232N151093O794096Q619248J0099888J0715902J0535777
1172.7E98101497R994745R216964Q103848O832301N644083M257024K247095q7619k101123
1191.1F42208815l636659m717707m915595l748417j557946N91993J995504K622902
1207.4F28842890K446413J464010K22861n39660p30932q61347j063406r24528m72009
1225.8F28384292j90854p2837L14772R15706J227022J190364J243234J465380J412332
1244.1F35889411R74655O43551N88120M45544K33948M22836J090109J784384K346754
$$ plain form
1262.5 644419312 647557497 651682138 656406403 661271393 666349053 671782553 677240789 682365596
1278.8 682365596 687348843 692532003 697755754 702644527 707216620 711634159 715645969 718905747
1295.1 718905747 721592903 724095523 726310968 727955759 729273856 730663002 731951296 732764840
1311.4 732764840 733334124 734126449 735057652 735867858 736740112 737894773 739024460 739704013 740019023
1329.8 740019023 740227282 740113735 739417315 738545716 738176286 738315344 738472760 738558710 738784492 738991320
1350.2 738991320 738811016 738318026 737702429 736531377 734065890 730244517 726361215 723593593 721387088
1368.5 721387088 718453646 713952363 708388627 704306602 703799427 705942571 708242118 710060477
1384.9 710060477 712170839 714110851 714810908 714129567 712647259 710983872 708979726 706527710 703884840
$$ packed form
1262.5F44419312L138185M124641M724265M864990N077660N433500N458236N124807
1278.8F82365596M983247N183160N223751M888773M572093M417539M011810L259778
1295.1G18905747K687156K502620K215445J644791J318097J389146J288294Q13544
1311.4G32764840N69284P92325R31203Q10206Q72254J154661J129687O79553L15010
1329.8G40019023K08259j13547o96420q71599l69430J39058J57416Q5950K25782K06828
1350.2G38991320j80304m92990o15597j171052k465487l821373l883302k767622k206505
1368.5G21387088k933442m501283n563736m082025n07175K143144K299547J818359
1384.9G10060477K110362J940012P00057o81341j482308j663387k004146k452016k642870
$$ plain form
1403.2 703884840 701337218 699094296 696998060 695127904 693736851 692588389 691339731 690345824
1419.5 690345824 689946651 689590335 688869119 687752306 686152756 684123456 681840181 679520071 677836835
1437.9 677836835 676632643 675045967 673043311 671011627 668987632 666761518 664105773 661526978
1454.2 661526978 660591066 663105428 667251289 671226084 675815940 682931364 693997800 709540427
1470.5 709540427 728268087 743860960 753854215 760684431 765411198 768384874 769890368 770161688
1486.8 770161688 769277871 767593741 765647471 763035893 759333372 755325913 751634121 747864127
1503.2 747864127 742714822 736080647 731230021 727580249 723606110 719586074 716318667 714045107
1519.5 714045107 712077141 710362256 708990932 707763612 706595242 705156207 703739703 702823699
$$ packed form
1403.2G03884840k547622k242922k096236j870156j391053j148462j248658r93907
1419.5F90345824l99173l56316p21216j116813j599550k029300k283275k320110j683236
1437.9F77836835j204192j586676k002656k031684k023995k226114k655745k578795
1454.2F61526978r35912K514362M145861L974795M589856P115424J1066436J5542627
1470.5G09540427J8727660J5592873R993255O830216M726767K973676J505494K71320
1486.8G70161688q83817j684130j946270k611578l702521m007459l691792l769994
1503.2G47864127n149305o634175m850626l649772l974139m020036l267407k273560
1519.5G14045107j967966j714885j371324j227320j168370j439035j416504r16004
$$ plain form
1535.8 702823699 701718509 700213909 699686050 700189173 700755060 701110423 701530874 702258945 703006268
1554.1 703006268 703322470 703683794 705378830 706921518 707293630 706840515 705738068 704160452 702143192
1572.5 702143192 699041665 694737256 690560341 686185122 680818319 674890816 668618977 661899149
1588.8 661899149 654783726 647551358 640264690 632945597 625661910 618443310 611320615 604263842
1605.1 604263842 597138941 589895368 582766414 575739205 568056464 559906185 553447604 547734439
1621.4 547734439 541375637 535427451 530401528 526138604 522754788 519966900 518150151 518268406
1637.8 518268406 519523442 521284521 523480654 526739001 531109393 534789860 538899720 545732915
1654.1 545732915 551950574 556974947 562434256 568984210 576047063 582315207 588870287 596738994
$$ packed form
1535.8G02823699j105190j504600n27859N03123N65887L55363M20451P28071P47323
1554.1G03006268L16202L61324J695036J542688L72112m53115j102447j577616k017260
1572.5G02143192l101527m304409m176915m375219n366803n927503o271839o719828
1588.8F61899149p115423p232368p286668p319093p283687p218600p122695p056773
1605.1F04263842p124901p243573p128954p027209p682741q150279o458581n713165
1621.4E47734439o358802n948186n025923m262924l383816k787888j816749J18255
1637.8E18268406J255036J761079K196133L258347M370392L680467M109860O833195
1654.1E45732915O217659N024373N459309O549954P062853O268144O555080P868707
$$ plain form
1670.4 596738994 604282081 611894131 620382309 628306150 635288119 642584383 652267575 661857724
1686.7 661857724 669672310 677009642 683382571 689889073 697419882 705834210 716327727 725700319
1703 725700319 733163655 740190029 746228814 751389802 755896151 759906411 764275730 768964887 772878408
1721.4 772878408 776012659 778880179 781608462 784174323 786306202 788501799 791331053 793781817
1737.7 793781817 795708954 797706246 800118387 803112984 806804419 811423481 816761196 821480155
1754 821480155 825150728 828128099 830637395 833089650 835343480 836983144 838175833 839223623 840407491
1772.4 840407491 841942608 843477666 844787955 845884740 846828878 847797394 848880887 849713683 850047171
1790.7 850047171 850573778 851661682 852614224 853133142 853701711 854616106 855469286 855934918 856222987
$$ packed form
1670.4E96738994P543087P612050Q488178P923841O981969P296264R683192R590149
1686.7F61857724P814586P337332O372929O506502P530809Q414328J0493517R372592
1703G25700319P463336P026374O038785N160988M506349M010260M369319M689157L913521
1721.4G72878408L134251K867520K728283K565861K131879K195597K829254K450764
1737.7G93781817J927137J997292K412141K994597L691435M619062N337715M718959
1754H21480155L670573K977371K509296K452255K253830J639664J192689J047790J183868
1772.4H40407491J535117J535058J310289J096785R44138R68516J083493Q32796L33488
1790.7H50047171N26607J087904R52542N18918N68569R14395Q53180M65632K88069
$$ plain form
1809.1 856222987 856726289 857374549 857844591 858178616 858637452 859065115 859184623 859244943 859500349 859823763
1829.5 859823763 860263765 860758007 861155987 861521006 861751378 861674607 861557484 861928165 862465322 862757325
1849.9 862757325 863012373 863331139 863521576 863559842 863694787 863953650 864043534 863791943 863558412 863828897
1870.3 863828897 864292741 864475548 864513874 864656866 864782095 864748895 864709318 864773095 864776611 864718199 864742637
1892.7 864742637 864858806 865000844 865030169 864978135 865010083 865083575 865024865 864908457 864959359 865096152 865015745
1915.1 865015745 864754081 864726126 864908040 864952803 864903629 864940464 865028977 864999890 864820898 864690363 864681721
1937.6 864681721 864538252 864198685 864060521 864203751 864225984 864020467 863875210 863880396 863776565 863466442
1958 863466442 863228321 863218963 863172174 862886250 862625599 862603605 862581015 862351894 862109065 862067223 862052441
$$ packed form
1809.1H56222987N03302O48260M70042L34025M58836M27663J19508O0320K55406L23414
1829.5H59823763M40002M94242L97980L65019K30372p6771j17123L70681N37157K92003
1849.9H62757325K55048L18766J90437L8266J34945K58863Q9884k51591k33531K70485
1870.3H63828897M63844J82807L8326J42992J25229l3200l9577O3777L516n8412K4438
1892.7H64742637J16169J42038K9325n2034L1948P3492n8710j16408N0902J36793q0407
1915.1H65015745k61664k7955J81914M4763m9174L6835Q8513k9087j78992j30535q642
1937.6H64681721j43469l39567j38164J43230K2233k05517j45257N186j03831l10123
1958H63466442k38121r358m6789k85924k60651k1994k2590k29121k42829m1842j4782
$$ plain form
1980.4 862052441 861847281 861584365 861489713 861438572 861172676 860863864 860807598 860811293 860597372 860310316
2000.8 860310316 860173821 860091150 859830379 859469175 859278858 859214187 858986616 858620882 858422101 858346283
2021.2 858346283 858117998 857795119 857653916 857655704 857489467 857134223 856909752 856872022 856730938 856450558
2041.6 856450558 856306791 856346250 856271625 855992615 855796158 855810940 855761111 855489969 855280936 855297863
2062 855297863 855279326 855072558 854904056 854909778 854893625 854707718 854552090 854604185 854689002 854612470 854507685
2084.4 854507685 854571283 854669929 854591668 854463696 854517400 854626179 854573309 854478598 854551077 854705691 854698479
2106.9 854698479 854575515 854591787 854716539 854704201 854601264 854654193 854829490 854881883 854809403 854843557 855012596
2129.3 855012596 855090082 855035424 855086148 855273128 855355918 855298042 855333745 855522633 855637491 855590880 855607152
$$ packed form
1980.4H62052441k05160k62916r4652n1141k65896l08812n6266L695k13921k87056
2000.8H60310316j36495q2671k60771l61204j90317o4671k27571l65734j98781p5818
2021.2H58346283k28285l22879j41203J788j66237l55244k24471l7730j41084k80380
2041.6H56450558j43767L9459p4625k79010j96457J4782m9829k71142k09033J6927
2062H55297863j8537k06768j68502N722j6153j85907j55628N2095Q4817p6532j04785
2084.4H54507685O3598R8646p8261j27972N3704J08779n2870r4711P2479J54614p212
2106.9H54698479j22964J6272J24752j2338j02937N2929J75297N2393p2480L4154J69039
2129.3H55012596P7486n4658N0724J86980Q2790n7876L5703J88888J14858m6611J6272
$$ plain form
2151.7 855607152 855789781 855911255 855879009 855899930 856069684 856209457 856203556 856226504 856426418 856629908
2172.1 856629908 856665909 856691778 856869102 857038796 857025087 856999874 857160032 857352555 857378006 857343495 857439876
2194.6 857439876 857581317 857584178 857523024 857597172 857733607 857716382 857646346 857745767 857908249 857900977 857788026
2217 857788026 857795954 857900262 857887030 857788384 857831597 857977808 857973278 857833505 857808232 857884228 857854307 857725382
2241.5 857725382 857676685 857722700 857658744 857458353 857337177 857319593 857214391 857008517 856880188 856880963 856857538
2263.9 856857538 856727481 856654525 856726468 856760859 856676579 856665552 856837690 857026160 857051313 856965482 856834948
2286.3 856834948 856574595 856167555 855759084 855463803 855176449 854745090 854242682 853769720 853154600 852247059
2306.7 852247059 851199150 850218713 849395037 848596990 847478926 845957041 844406784 843167543 842188895
$$ packed form
2151.7H55607152J82629J21474l2246K0921J69754J39773n901K2948J99914K03490
2172.1H56629908L6001K5869J77324J69694j3709k5213J60158J92523K5451l4511R6381
2194.6H57439876J41441K861o1154P4148J36435j7225p0036R9421J62482p272j12951
2217H57788026P928J04308j3232r8646M3213J46211m530j39773k5273P5996k9921j28925
2241.5H57725382m8697M6015o3956k00391j21176j7584j05202k05874j28329P75k3425
2263.9H56857538j30057p2956P1943L4391q4280j1027J72138J88470K5153q5831j30534
2286.3H56834948k60353m07040m08471k95281k87354m31359n02408m72962o15120r07541
2306.7H52247059j047909r80437q23676p98047j118064j521885j550257j239241r78648
$$ plain form
2325.1 842188895 841185153 840093434 839218676 838695049 838248253 837744415 837295353 837067008 837722778
2343.5 837722778 840103507 842755139 843120158 840668201 836796761 833278775 830874383 829805553
2359.8 829805553 830041111 831347823 833462358 836129248 839128673 842294037 845357478 848187029
2376.1 848187029 850882828 853400350 855461180 856894076 857789099 858313143 858547091 858568430 858536243
2394.4 858536243 858549774 858551204 858491659 858438373 858422756 858387530 858312249 858258784 858280838 858312011 858253777 858164907
2418.9 858164907 858111858 858037591 857914746 857793570 857714832 857639790 857526898 857425094 857383192 857349157 857232749
2441.3 857232749 857059360 856960356 856926501 856806695 856628001 856542349 856529474 856446385 856279612 856150210
2461.7 856150210 856076121 855942786 855753124 855631709 855559289 855416298 855225742 855103433 855041504 854936004
$$ packed form
2325.1H42188895j003742j091719q74758n23627m46796n03838m49062k28345O55770
2343.5H37722778K380729K651632L65019k451957l871440l517986k404392j068830
2359.8H29805553K35558J306712K114535K666890K999425L165364L063441K829551
2376.1H48187029K695799K517522K060830J432896Q95023N24044K33948K1339l2187
2394.4H58536243J3531J430n9545n3286j5617l5226p5281n3465K2054L1173n8234q8870
2418.9H58164907n3049p4267j22845j21176p8738p5042j12892j01804m1902l4035j16408
2441.3H57232749j73389r9004l3855j19806j78694q5652j2875q3089j66773j29402
2461.7H56150210p4089j33335j89662j21415p2420j42991j90556j22309o1929j05500
$$ plain form
2482.1 854936004 854775548 854636371 854529381 854387105 854196489 854026258 853916466 853824437 853689909 853525162
2502.5 853525162 853384674 853229523 853022456 852860391 852786541 852676988 852468491 852288663 852175355 851997733
2522.9 851997733 851751566 851558089 851444364 851343453 851196408 851011992 850848973 850705981 850528717 850328445
2543.3 850328445 850179732 850069106 849912643 849713624 849526465 849358678 849158466 848923504 848724663 848549783
2563.7 848549783 848334074 848086059 847846687 847597718 847286701 846957982 846692383 846439540 846144617 845848560
2584.1 845848560 845558107 845220625 844862461 844561338 844286740 843969822 843623579 843288183 842958093 842614532
2604.5 842614532 842249274 841874719 841525257 841191173 840853095 840519011 840165257 839775681 839382291 838996828
2624.9 838996828 838630378 838309169 838014126 837702215 837351561 836975932 836614788 836262047 835876703 835475385
$$ packed form
2482.1H54936004j60456j39177j06990j42276j90616j70231j09792r2029j34528j64747
2502.5H53525162j40488j55151k07067j62065p3850j09553k08497j79828j13308j77622
2522.9H51997733k46167j93477j13725j00911j47045j84416j63019j42992j77264k00272
2543.3H50328445j48713j10626j56463j99019j87159j67787k00212k34962j98841j74880
2563.7H48549783k15709k48015k39372k48969l11017l28719k65599k52843k94923k96057
2584.1H45848560k90453l37482l58164l01123k74598l16918l46243l35396l30090l43561
2604.5H42614532l65258l74555l49462l34084l38078l34084l53754l89576l93390l85463
2624.9H38996828l66450l21209k95043l11911l50654l75629l61144l52741l85344m01318
$$ plain form
2645.3 835475385 835117221 834792674 834417343 833997011 833606482 833213329 832757711 832284749 831889093 831557035
2665.7 831557035 831164420 830727577 830410719 830195725 829945207 829663038 829404533 829146683 828817785 828435779
2686.1 828435779 828111947 827866077 827597558 827269197 826972187 826716781 826362073 825866222 825384021 824976027
2706.5 824976027 824509621 823916316 823291838 822700560 822065830 821391284 820795715 820278943 819738686 819134474
2726.9 819134474 818582952 818243861 818044484 817813575 817582309 817423165 817237616 816932976 816612601 816345870
2747.3 816345870 815978944 815439761 814917564 814507604 814049780 813465834 812880099 812370241 811838031 811187685
2767.7 811187685 810482919 809808195 809101343 808250308 807312727 806421340 805535078 804551721 803521454
2786 803521454 802534401 801530898 800404608 799225509 798133969 797036171 795731246 794269443 792800188
$$ packed form
2645.3H35475385l58164l24547l75331m20332l90529l93153m55618m72962l95656l32058
2665.7H31557035l92615m36843l16858k14994k50518k82169k58505k57850l28898l82006
2686.1H28435779l23832k45870k68519l28361k97010k55406l54708m95851m82201m07994
2706.5H24976027m66406n93305o24478n91278o34730o74546n95569n16772n40257o04212
2726.9H19134474n51522l39091j99377k30909k31266j59144j85549l04640l20375k66731
2747.3H16345870l66926n39183n22197m09960m57824n83946n85735n09858n32210o50346
2767.7H11187685p04766o74724p06852q51035r37581q91387q86262r83357j030267
2786H03521454r87053j003503j126290j179099j091540j097798j304925j461803j469255
$$ plain form
2804.4 792800188 791300416 789698184 787968516 786110401 784108102 781877816 779407024 776761353
2820.7 776761353 773869514 770513058 766502559 761740208 756034493 749016166 740275681 729323506
2837 729323506 715580821 698726058 678832054 656061888 631044686 606070042 585546255 574280322
2853.3 574280322 574208379 583007157 596024334 608829856 618446112 623712718 625311553 625514328
2869.7 625514328 627196431 631824255 638310492 644259512 647811413 648241520 645689070 640736938
2886 640736938 634028137 626087785 617417634 608511627 599629223 590712607 581587970 572072685 561852574
2904.3 561852574 550443590 537309647 521914244 503758430 482689291 459509492 436297774
2918.6 436297774 416140676 402379572 397286266 401125729 412336260 428498149 447576612 468157470
$$ packed form
2804.4G92800188j499772j602232j729668j858115k002299k230286k470792k645671
2820.7G76761353k891839l356456m010499m762351n705715p018327q740485j0952175
2837G29323506j3742685j6854763j9894004k2770166k5017202k4974644k0523787j1265933
2853.3E74280322p1943Q798778J3017177J2805522R616256N266606J598835K02775
2869.7F25514328J682103M627824O486237N949020L551901M30107k552450m952132
2886F40736938o708801p940352q670151q906007q882404q916616r124637r515285j0220111
2904.3E61852574j1408984j3133943j5395403j8155814k1069139k3179799k3211718
2918.6D36297774k0157098j3761104n093306L839463J1210531J6161889J9078463K0580858
$$ plain form
2934.9 468157470 488804221 507861316 523744226 535162330 541311681 542190850 538971841 533968806
2951.2 533968806 529933751 529176116 532791674 540589094 551883101 566005707 582190514 599352837
2967.6 599352837 616216183 631770551 645452440 657016337 666615188 674608409 681133151 686351061
2983.9 686351061 690690279 694420874 697521150 699923277 701590061 702656448 703247488 703329742 703051507
3002.2 703051507 702628016 702155828 701783597 701602817 701480806 701278329 701003194 700661719 700222492 699697971
3022.6 699697971 699036360 698156059 697167337 696200550 695216835 694079936 692765951 691421866 690064311
3041 690064311 688556790 686842084 685045123 683355033 681739807 680050910 678322077 676623821 674939096
3059.3 674939096 673288584 671751857 670335054 668862641 667257369 665699244 664288402 662992716
$$ packed form
2934.9D68157470K0646751J9057095J5882910J1418104O149351Q79169l219009n003035
2951.2E33968806m035055p57635L615558P797420J1294007J4122606J6184807J7162323
2967.6E99352837J6863346J5554368J3681889J1563897R598851P993221O524742N217910
2983.9F86351061M339218L730595L100276K402127J666784J066387N91040Q2254k78235
3002.2G03051507m23491m72188l72231j80780j22011k02477k75135l41475m39227n24521
3022.6F99697971o61611q80301r88722r66787r83715j136899j313985j344085j357555
3041F90064311j507521j714706j796961j690090j615226j688897j728833j698256j684725
3059.3F74939096j650512j536727j416803j472413j605272j558125j410842j295686
$$ plain form
3075.6 662992716 661745012 660386443 658865392 657269716 655627489 654000401 652421176 650748730
3092 650748730 648956299 647223651 645601094 643892944 641968310 639983475 638116717 636281967 634285867
3110.3 634285867 632197976 630227864 628271520 626111627 623722315 621180177 618611634 616105378
3126.6 616105378 613659441 611170650 608538210 605877340 603342295 600800753 598044872 595165908
3143 595165908 592316210 589469016 586649120 583890855 581013918 577889204 574678004 571550310 568513393
3161.3 568513393 565467298 562329650 559152603 555990279 552819014 549642146 546467185 543275952
3177.6 543275952 540071964 536837757 533596456 530422032 527278543 524062872 520796537 517578006
3193.9 517578006 514403045 511212051 508012533 504866779 501766980 498659521 495566815 492545098
$$ packed form
3075.6F62992716j247704j358569j521051j595676j642227j627088j579225j672446
3092F50748730j792431j732648j622557j708150j924634j984835j866758j834750j996100
3110.3F34285867k087891j970112j956344k159893k389312k542138k568543k506256
3126.6F16105378k445937k488791k632440k660870k535045k541542k755881k878964
3143E95165908k849698k847194k819896k758265k876937l124714l211200l127694l036917
3161.3E68513393l046095l137648l177047l162324l171265l176868l174961l191233
3177.6E43275952l203988l234207l241301l174424l143489l215671l266335l218531
3193.9E17578006l174961l190994l199518l145754l099799l107459l092706l021717
$$ plain form
3210.3 492545098 489568114 486548483 483495057 480496168 477560759 474636734 471727341 468853652
3226.6 468853652 466032833 463309109 460646331 457912713 455120593 452383965 449711889 447106749
3242.9 447106749 444585651 442079723 439514786 436985731 434571087 432193100 429809779 427434981
3259.2 427434981 425059438 422672659 420336396 418136120 416058660 413939714 411673397 409370720
3275.5 409370720 407115161 404879451 402677029 400565356 398539186 396537334 394541085 392542154
3291.8 392542154 390504926 388389975 386217445 384128392 382199168 380330443 378374249 376254916
3308.2 376254916 374020994 371782452 369626582 367548734 365479708 363387644 361334056 359332770
3324.5 359332770 357225925 354973018 352737486 350624710 348666072 346807033 344859004 342744231
$$ packed form
3210.3D92545098k976984l019631l053426k998889k935409k924025k909393k873689
3226.6D68853652k820819k723724k662778k733618k792120k736628k672076k605140
3242.9D47106749k521098k505928k564937k529055k414644k377987k383321k374798
3259.2D27434981k375543k386779k336263k200276k077460k118946k266317k302677
3275.5D09370720k255559k235710k202422k111673k026170k001852j996249j998931
3291.8C92542154k037228k114951k172530k089053j929224j868725j956194k119333
3308.2C76254916k233922k238542k155870k077848k069026k092064k053588k001286
3324.5C59332770k106845k252907k235532k112776j958638j859039j948029k114773
$$ plain form
3340.8 342744231 340591013 338471085 336437643 334577233 332685262 330549031 328370243 326378703
3357.1 326378703 324550003 322750330 320948720 319324583 317887008 316328049 314530730 312778443
3373.4 312778443 311308324 310037374 308843672 307704866 306679696 305824518 305211723 304923296 304672420
3391.8 304672420 304103792 303459972 303225547 303324312 303149700 302581668 302198499 302195340 302319974 302461147
3412.2 302461147 302590817 302734405 303007126 303408712 303872943 304489195 305355787 306417912 307476968
3430.5 307476968 308550656 309799045 310990810 311905146 312847644 314139247 315732479 317464560 319199681
3448.9 319199681 320935071 322740644 324665606 326766700 329035640 331287324 333527386 336057961
3465.2 336057961 338834137 341348916 343411028 345510632 347967684 350697756 353487641 356092840
$$ packed form
3340.8C42744231k153218k119928k033442j860410j891971k136231k178788j991540
3357.1C26378703j828700j799673j801610j624137j437575j558959j797319j752287
3373.4C12778443j470119j270950j193702j138806j025170q55178o12795k88427k50876
3391.8C04672420n68628o43820k34425R8765j74612n68032l83169l159J24634J41173
3412.2C02461147J29670J43588K72721M01586M64231O16252Q66592J062125J059056
3430.5C07476968J073688J248389J191765R14336R42498J291603J593232J732081J735121
3448.9C19199681J735390J805573J924962K101094K268940K251684K240062K530575
3465.2C36057961K776176K514779K062112K099604K457052K730072K789885K605199
$$ plain form
3481.5 356092840 358662546 361462027 364320278 367117554 370039672 373103678 376217157 379273564
3497.8 379273564 382328331 385493517 388553977 391442806 394505382 397901922 401487291 405007124
3514.2 405007124 408333093 411686212 415282428 419119388 422856003 426341921 429954052 433818877
3530.5 433818877 437791795 441924095 446097553 450087756 454146981 458483100 462926537 467194974
3546.8 467194974 471273214 475464731 479917437 484442890 488951236 493596047 498306364 502802491
3563.1 502802491 507273078 512430966 518039465 523271680 528238773 533362508 538742125 544335485
3579.4 544335485 549998939 555519164 560968757 566719413 572740614 578515530 584190607 590159655
3595.7 590159655 596340835 602564394 608778954 614802241 620586157 626594841 632892251 639111876
$$ packed form
3481.5C56092840K569706K799481K858251K797276K922118L064006L113479L056407
3497.8C79273564L054767L165186L060460K888829L062576L396540L585369L519833
3514.2D05007124L325969L353119L596216L836960L736615L485918L612131L864825
3530.5D33818877L972918M132300M173458L990203M059225M336119M443437M268437
3546.8D67194974M078240M191517M452706M525453M508346M644811M710317M496127
3563.1E02802491M470587N157888N608499N232215M967093N123735N379617N593360
3579.4E44335485N663454N520225N449593N750656O021201N774916N675077N969048
3595.7E90159655O181180O223559O214560O023287N783916O008684O297410O219625
$$ plain form
3612.1 639111876 645187914 651016653 656968772 663405538 669493914 674732745 679587960 685218155
3628.4 685218155 691736877 697658837 703078926 708345234 713361323 718223035 722829521 726874053
3644.7 726874053 730511308 734714746 739685237 744093299 747794569 751666367 755613267 759007037
3661 759007037 761866033 764340043 766389728 768381178 770686746 772672594 774440646 776794910 779295027
3679.4 779295027 781509638 783472896 785107076 786438763 787692964 789224863 790984511 792524278
3695.7 792524278 793595552 794338763 795201600 796336532 797264040 797696590 798007429 798932672 800364673
3714 800364673 801397979 801792264 801859796 801932812 802224696 802743852 803260386 803492486 803522289 803742945
3734.4 803742945 804506600 805573702 806177258 805971980 805695951 806121469 806419373 806511462 807285547 808296561
$$ packed form
3612.1F39111876O076038N828739N952119O436766O088376N238831M855215N630195
3628.4F85218155O518722N921960N420089N266308N016089M861712M606486M044532
3644.7G26874053L637255M203438M970491M408062L701270L871798L946900L393770
3661G59007037K858996K474010K049685J991450K305568J985848J768052K354264K500117
3679.4G79295027K214611J963258J634180J331687J254201J531899J759648J539767
3695.7G92524278J071274P43211Q62837J134932R27508M32550L10839R25243J432001
3714H00364673J033306L94285O7532P3016K91884N19156N16534K32100K9803K20656
3734.4H03742945P63655J067102O03556k05278k76029M25518K97904R2089P74085J011014
$$ plain form
3754.8 808296561 808874607 809213340 809651732 810011208 810126245 810165703 810301602 810673773 811131299 811412513
3775.2 811412513 811543226 811640918 811785638 811920166 812057793 812275231 812484920 812590003 812498927 812240005
3795.6 812240005 811961353 811599731 811450303 811826527 812139928 812404454 812900066 813148677 812832713 812358677
3816 812358677 812132239 811899304 812017739 812604427 812982798 813036501 812893510 812705159 812580705 812317431
3836.4 812317431 812029421 812174320 812649906 813156188 813473701 813356936 812558532 811348200 811270356 812279224
3856.8 812279224 812942684 812922299 812578082 812421679 812383175 812197089 812196255 812481642 812779129 812874079 812625527
3879.2 812625527 812441349 812504172 812550426 812650919 812629879 812455833 812539339 812690914 812480390 811992824
3899.6 811992824 811554670 811485708 811900973 812379301 812580109 812588155 812443495 812166095 812002003 812014639
$$ packed form
3754.8H08296561N78046L38733M38392L59476J15037L9458J35899L72171M57526K81214
3775.2H11412513J30713R7692J44720J34528J37627K17438K09689J05083r1076k58922
3795.6H12240005k78652l61622j49428L76224L13401K64526M95612K48611l15964m74036
3816H12358677k26438k32935J18435N86688L78371N3703j42991j88351j24454k63274
3836.4H12317431k88010J44899M75586N06282L17513j16765p98404j210332p7844J008868
3856.8H12279224O63460k0385l44217j56403l8504j86086q34K85387K97487R4950k48552
3879.2H12625527j84178O2823M6254J00493k1040j74046Q3506J51575k10524m87566
3899.6H11992824m38154o8962M15265M78328K00808Q046j44660k77400j64092J2636
$$ plain form
3920 812014639 811979055 811832786 811717451 811651289 811569571 811598122 811816335 811990678 811935544 811739266 811567366
3942.5 811567366 811520278 811556578 811598957 811613142 811580300 811564088 811591864 811620355 811627567 811594009 811534524 811474621
3966.9 811474621 811416686 811352909 811299801 811320364 811397254 811452091 811501563 811560154 811561406 811466455 811345637
3989.4 811345637 811256707 811186433 811203182 811317503
3997.5 811317503
$$ packed form
3920H12014639l5584j46269j15335o6162q1718K8551K18213J74343n5134j96278j71900
3942.5H11567366m7088L6300M2379J4185l2842j6212K7776K8491P212l3558n9485n9903
3966.9H11474621n7935o3777n3108K0563P6890N4837M9472N8591J252r4951j20818
3989.4H11345637q8930p0274J6749J14321
3997.5H11317503
##END=$$ End of the data block
