##TITLE=$$ Begin of the data block
##JCAMP-DX=5.00 $$ ACD/SpecManager v 10.08
##SPECTROMETER/DATA SYSTEM=Alpha
##DATE=14 Apr 2014 11:23:48
##DATA TYPE=INFRARED SPECTRUM
##DATA CLASS=XYDATA
##ORIGIN=
##OWNER=
##NPOINTS=1765
##FIRSTX=399.75695801
##LASTX=3997.56933594
##MAXX=3997.56933594
##MINX=399.75695801
##MAXY=0.86541104
##MINY=0.30232033
##XFACTOR=1.0000000000
##YFACTOR=1.000000000000000e-9
##FIRSTY=0.69143093
##DELTAX=2.03957629
##XUNITS=1/CM
##YUNITS=ARBITRARY UNITS
##XYDATA=(X++(Y..Y))
399.8 691430926 689849734 686929405 685733199 685826063 683751047 680683136 680011153 680281460 677960694
418.1 677960694 675016284 675535262 676344812 674097776 671710312 672168016 672578394 670261323 668160260
436.5 668160260 668818951 669304669 667451382 666423082 667677164 667617559 665494204 664805472 665883183
454.8 665883183 665246904 662882805 662383258 663272321 662427366 660289884 659814179 660418212 659182072
473.2 659182072 657014668 656567633 656839073 655694842 654407740 654945493 655555487 653963804 651808619
491.5 651808619 651493847 651574850 650063634 648465931 648341000 648039162 646334469 645047665 645212114
509.9 645212114 644871652 643086314 641689479 641387701 640475273 638449192 636887729 636306405 635328650
528.3 635328650 633641541 632475495 632017016 631134570 629780114 629156828 629261971 628901660 627985775
546.6 627985775 627454877 627303421 626602352 625368118 624482572 623883605 622748435 621108294 619670630
565 619670630 618295550 616321981 614018619 612064481 610369205 608544111 606670678 604981601 603415430
583.3 603415430 601669073 599696338 597701371 595728397 593790829 592113256 590906143 590054870 589132249
601.7 589132249 587968647 587091148 586921513 587143123 586989403 586181402 585550606 586440265 589082897
620 589082897 592437029 595975876 599622965 603083968 606177926 608988643 611707270 614241481 616121888
638.4 616121888 617208540 617595136 617585003 618271828 620236576 622140467 622066140 620358169 620386958 624409258
658.8 624409258 630128384 634468257 636456609 636738896 638624251 642482460 645547390 647884548 649796128
677.1 649796128 651395440 653229952 655268788 656812370 657864094 659105182 660476148 661148608 661155164
695.5 661155164 661407530 662194669 662982881 663706481 664968252 666634560 667842805 668649077 669767201
713.8 669767201 670909703 671216667 671312749 672937870 676029205 679057777 681606412 684270382 686807692
732.2 686807692 688444972 689541459 690930724 692441642 693480492 694511116 696251392 698180974
748.5 698180974 699624002 701104462 703241408 705385506 706745088 707860351 709475219 711114883
764.8 711114883 712263644 713402748 714962721 716391265 717067778 717439890 717936516 717893898 717056155
783.2 717056155 716524899 716997445 717869699 718789637 720541418 723674119 727412045 731001139 734833419
801.6 734833419 739126444 743011832 745945513 748640478 751631141 754264712 756116688 757746875
817.9 757746875 759231329 759715021 758966923 757719636 756161273 753663301 750391245 747481465 745193422
836.2 745193422 742643416 739480913 736398220 733808517 731476426 729890764 730308771 733107865 737525225
854.6 737525225 743060052 749809623 757283032 764320493 770504296 776283324 781575441 785709798
870.9 785709798 788777471 791551471 794057846 795613408 796224892 796517134 796421170 795353115 793602467
889.3 793602467 792136312 791204751 790554464 790430427 791226685 792646766 794013083 795187771 796363533
907.6 796363533 797181666 797023296 795890570 794195116 792021632 789270401 786381662 784121752 782708228
926 782708228 781974912 782015681 782831788 783886492 784716606 785442472 786250412 786965966 787386715 787498832
946.4 787498832 787300587 786647320 785284221 783124208 780226707 776431501 771484315 765342355 757956564
964.7 757956564 749076903 738536835 726611555 714033306 701690316 690335691 680390537 671840727
981 671840727 664336324 657540202 651361108 645793736 640931606 636915147 633657396 630952537 628703177
999.4 628703177 626900673 625330508 623384833 620449901 616372108 611355126 605620980 599435508
1015.7 599435508 593194723 587158501 581362188 575811803 570518196 565492809 560766935 556427062
1032 556427062 552662790 549572349 546970367 544607282 542394578 540285110 538088202 535669506 533267915
1050.4 533267915 531365693 530398846 530730009 532530904 535416842 538453341 540654421 541484475 540784955
1068.7 540784955 538621426 535493076 532202721 529273689 526604593 523884177 520950735 517501295
1085 517501295 513078332 507758915 502527237 498748690 497283459 498150796 500851274 504635215 508653641
1103.4 508653641 512259424 515341461 518006980 520010054 520911813 520362079 517797470 512543976 505545914
1121.8 505545914 500580132 500767469 504558682 508238435 509787798 509518445 509552360 511788666 516159475
1140.1 516159475 521372139 526177526 529876590 532479823 534450769 536189020 537868023 539766192
1156.4 539766192 542409420 546229422 551425755 558225274 566833377 576923609 587604105 598081231
1172.7 598081231 608044028 617277324 625397682 632200360 637779772 641996503 644257128 644192219 642099619
1191.1 642099619 638486326 633799255 628897548 625155568 623602927 624189019 626153648 628742158
1207.4 628742158 631193638 632692516 632934630 632404029 631702960 630870104 629802048 628845215 628347635
1225.8 628347635 628174007 628140330 628475666 629398942 630627155 631819010 633083820 634575427 635995209
1244.1 635995209 636971474 637628376 638252318 638740182 638977110 639362454 640415132 642185211 644521415
1262.5 644521415 647625268 651720166 656443775 661287129 666293144 671672702 677131891 682263851
1278.8 682263851 687229991 692397237 697619200 702492654 707060635 711530805 715602756 718870223
1295.1 718870223 721543312 724053144 726284683 727946877 729297817 730715394 731995583 732806504
1311.4 732806504 733399153 734197974 735133111 735959113 736824095 737951279 739071131 739765227 740111411
1329.8 740111411 740343809 740231633 739536405 738662124 738284528 738435864 738619804 738725841 738951385 739123344
1350.2 739123344 738902330 738419175 737838030 736662269 734173715 730356753 726474881 723681808 721461654
1368.5 721461654 718538404 714046061 708491087 704422593 703918815 706053197 708336413 710140586
1384.9 710140586 712275267 714255571 714950562 714255929 712784111 711108148 709062040 706582546 703940988
1403.2 703940988 701409400 699176669 697083950 695230544 693862379 692718506 691461265 690476596
1419.5 690476596 690094590 689731061 688990533 687860250 686263382 684247911 681965172 679628134 677920461
1437.9 677920461 676680505 675047517 673041940 671054602 669032753 666768968 664091408 661490440
1454.2 661490440 660539150 663062572 667204797 671194851 675829470 682948351 693998098 709557056
1470.5 709557056 728327811 743970692 753980577 760797799 765526354 768507421 769984603 770220935
1486.8 770220935 769340158 767664969 765695333 763056159 759367704 755386353 751687229 747905254
1503.2 747905254 742776573 736198306 731390774 727747202 723755479 719733000 716496468 714256108
1519.5 714256108 712283432 710541308 709169567 707964301 706815839 705390453 703986287 703076899
1535.8 703076899 701971829 700489104 700000346 700502574 701057136 701428175 701865554 702602625 703370631
1554.1 703370631 703711569 704104662 705810130 707308173 707630098 707164705 706075966 704474628 702422142
1572.5 702422142 699353278 695100486 690893054 686472654 681113124 675203919 668905735 662146211
1588.8 662146211 655029058 647808135 640516460 633181095 625862241 618590295 611433506 604400992
1605.1 604400992 597317636 590048730 582856834 575813174 568163991 560060024 553606391 547859013
1621.4 547859013 541486382 535561740 530539811 526243150 522827268 520027697 518207967 518311262
1637.8 518311262 519548535 521299601 523498118 526783645 531180620 534868598 539000154 545872271
1654.1 545872271 552100003 557116628 562574148 569145799 576251507 582564592 589167476 597063124
1670.4 597063124 604594350 612199426 620682299 628574014 635548353 642897129 652624547 662191093
1686.7 662191093 669961452 677263677 683618724 690096498 697578311 706001043 716546953 725911736
1703 725911736 733338952 740351617 746383071 751526892 756029725 760070026 764478743 769182384 773096979
1721.4 773096979 776238501 779125690 781885624 784468949 786594510 788802624 791657507 794125676
1737.7 794125676 796077371 798090518 800502777 803493321 807182610 811793149 817102313 821803391
1754 821803391 825483084 828474224 830995977 833443224 835656226 837265909 838479042 839566946 840759873
1772.4 840759873 842266500 843775213 845087707 846197724 847147286 848128915 849222720 850046456 850367308
1790.7 850367308 850899816 852017343 852999747 853533864 854094803 854959548 855742157 856162488 856461763
1809.1 856461763 857011437 857667625 858101487 858398736 858840823 859276056 859419882 859507740 859795153 860149622
1829.5 860149622 860582650 861051381 861439049 861786902 862000167 861937106 861849189 862219036 862740040 863019645
1849.9 863019645 863250315 863550186 863748550 863803864 863934636 864177108 864275396 864066005 863880932 864177227
1870.3 864177227 864652514 864841163 864872634 864990711 865088582 865046084 865003645 865056992 865046859 864980638 865011930
1892.7 865011930 865140796 865284801 865314782 865272403 865313947 865410268 865374804 865239859 865265489 865411043 865357935
1915.1 865357935 865129769 865105867 865238607 865232110 865169406 865211904 865308285 865287006 865120947 865016818 865024984
1937.6 865024984 864876151 864537716 864418745 864566147 864572644 864351749 864184141 864168108 864079356 863813460
1958 863813460 863602757 863589823 863532662 863238633 862980902 862963796 862912536 862654150 862418115 862393856 862383664
1980.4 862383664 862169504 861907840 861824393 861764908 861478448 861165166 861111164 861110568 860890567 860588133 860442042
2002.8 860442042 860368550 860121906 859787047 859631598 859570980 859317422 858942688 858753085 858685613 858476460
2023.2 858476460 858160079 857977092 857927978 857751727 857421577 857226014 857192338 857036829 856754363 856608629
2043.6 856608629 856622517 856532156 856270850 856101930 856122732 856060863 855797410 855604768 855618834 855584025 855361223
2066.1 855361223 855201364 855239928 855252624 855087638 854943037 854983032 855047524 854965627 854864955 854928076 855020583
2088.5 855020583 854943752 854832649 854890525 854963779 854860604 854754508 854856193 855020642 855016649 854934752 854981244
2110.9 854981244 855102658 855091512 854985297 855010688 855155706 855205178 855163395 855234623 855412543 855479777 855422437
2133.4 855422437 855462492 855625212 855696797 855650365 855715096 855912030 855983078 855902791 855941236 856155872 856292546
2155.8 856292546 856276393 856311381 856473327 856582642 856567502 856616378 856819212 856989026 856993020 857011378 857204378
2178.2 857204378 857396066 857402205 857386351 857546091 857739389 857771456 857756555 857868612 857996523 857981503 857922256
2200.7 857922256 857979000 858066142 858028412 857997835 858146906 858317256 858290732 858173251 858187616 858278632 858252287
2223.1 858252287 858168602 858229876 858372211 858366966 858247161 858232021 858304679 858264327 858121276 858070493 858119786
2245.6 858119786 858073890 857910991 857823789 857817888 857688069 857437372 857285142 857288361 857263625 857126296 857045829
2268 857045829 857103348 857135236 857068777 857089102 857277811 857445955 857473493 857419670 857284546 857008934 856629372
2290.4 856629372 856271505 855997384 855677426 855190575 854657590 854172885 853533328 852594316 851527274
2308.8 851527274 850558698 849760473 848936796 847758293 846195519 844614565 843355656 842355311 841312766
2327.1 841312766 840207815 839353561 838832378 838359833 837838888 837382257 837184489 837884843 840274692
2345.5 840274692 842980921 843398511 840884268 836892128 833327651 830895603 829749584 829965234 831333339
2363.8 831333339 833504379 836259902 839368939 842554927 845604837 848492205 851298153 853893280
2380.2 853893280 855959177 857366681 858236432 858732820 858952820 858990312 858985662 859012783 859005928 858930349
2400.6 858930349 858877897 858883321 858882487 858822823 858758330 858777285 858803213 858726203 858611166 858545184 858490586 858381152
2425 858381152 858251691 858175933 858091712 857955277 857868850 857859194 857833505 857723057 857558846 857441485 857376039
2447.5 857376039 857270181 857133448 857056320 857021272 856918573 856743217 856604278 856538057 856449425 856303215
2467.9 856303215 856191337 856116354 855968952 855746329 855584979 855512023 855409622 855260313 855149984 855076790
2488.3 855076790 854935467 854725003 854574978 854500055 854375124 854180574 854019642 853909194 853761733 853562176
2508.7 853562176 853400111 853298783 853172719 852980077 852811098 852696359 852525473 852295637 852115810 852009475
2529 852009475 851904511 851731300 851516962 851342261 851200581 851025045 850847661 850735724 850628436 850465655
2549.4 850465655 850276411 850077152 849893987 849721253 849512994 849286377 849067450 848839164 848614335 848412573
2569.8 848412573 848167479 847836137 847495198 847227037 847002387 846739590 846437871 846125424 845774829 845379591
2590.2 845379591 845014632 844725311 844451785 844146609 843833923 843518257 843176603 842799842 842408180 842030406
2610.6 842030406 841675460 841359138 841043115 840673506 840279043 839887321 839506328 839150131 838813782 838498533
2631 838498533 838193715 837852955 837482870 837136447 836810708 836465359 836102366 835740805 835350692 834912717
2651.4 834912717 834494710 834146798 833780885 833329022 832870007 832473099 832102120 831704736 831311464 830985963
2671.8 830985963 830722988 830479980 830228031 829965770 829700589 829399347 829058051 828746140 828476548 828172863
2692.2 828172863 827827275 827513397 827238262 826905549 826455891 825988352 825560212 825071335 824474752 823852420
2712.6 823852420 823257685 822633088 821977735 821379304 820848882 820320606 819745243 819205344 818851590 818634212
2733 818634212 818425596 818255961 818117619 817896068 817573965 817265511 816989720 816588640 816021204 815473735
2753.4 815473735 815050483 814609230 814041197 813471437 812988341 812446117 811740041 810995281 810311496 809614420
2773.8 809614420 808809578 807923496 807047248 806141555 805111885 804053068 803107381 802182674 801107347
2792.2 801107347 799912751 798759103 797614872 796302378 794857919 793408036 791918576 790315747
2808.5 790315747 788575113 786701679 784681320 782457292 780026257 777399480 774474084 771083891
2824.8 771083891 767090738 762359202 756635785 749559224 740764558 729783535 716031492 699164510
2841.1 699164510 679229856 656406283 631360710 606366396 585806429 574524641 574494898 583344996
2857.4 583344996 596377730 609200716 618841410 624106109 625687599 625891745 627596676 632248461
2873.7 632248461 638768673 644762874 648330808 648753166 646208286 641251385 634489417 626489580
2890.1 626489580 617814600 608935952 600036263 591069758 581947505 572475493 562266588 550840974
2906.4 550840974 537686408 522255599 504041255 482929587 459757388 436544478 416339010
2920.6 416339010 402538836 397463262 401329577 412540197 428730845 447869837 468508095 489210278
2937 489210278 508304715 524173498 535532653 541629970 542496681 539291620 534308016 530279040
2953.3 530279040 529523611 533178210 541029394 552347660 566491842 582706571 599860668 616690218
2969.6 616690218 632254243 645974815 657562792 667183876 675208390 681781471 687073469 691467464
2985.9 691467464 695194244 698280990 700682163 702338398 703393221 703963399 704023004 703741431 703308105
3004.3 703308105 702826858 702475250 702317178 702209353 702016890 701701403 701282799 700828850 700353801 699739337
3024.7 699739337 698893368 697926462 696973741 695999026 694852412 693507373 692127764 690750659 689245105
3043 689245105 687558472 685782611 684067249 682430387 680768490 679053068 677324355 675628603 673997045
3061.4 673997045 672450006 670989096 669529200 667999744 666460752 664999962 663668215 662433207
3077.7 662433207 661107898 659596622 657979310 656319439 654733181 653212070 651559234 649788439
3094 649788439 648060441 646371245 644582391 642637193 640678048 638827205 636967242 634937882 632863343
3112.4 632863343 630926549 628976703 626827180 624449432 621880352 619282067 616775990 614334285
3128.7 614334285 611852407 609269440 606659830 604105294 601523697 598759055 595866203 592990577
3145 592990577 590143800 587350488 584622145 581751764 578602135 575369596 572219253 569143355 566093266
3163.4 566093266 563009381 559870064 556692243 553498387 550301909 547098219 543874860 540659487
3179.7 540659487 537431836 534183681 530989230 527835906 524633288 521357596 518116117 514943659
3196 514943659 511721969 508460760 505307436 502252936 499166846 496037692 492956370 489939690 486935943
3214.3 486935943 483944118 480970621 478028566 475110471 472176313 469278783 466477185 463745385
3230.7 463745385 461036474 458268076 455439419 452658027 449959248 447359890 444875032 442410409
3247 442410409 439862460 437303871 434846461 432446986 430038333 427656591 425330728 423002690 420678616
3265.3 420678616 418449163 416331142 414197624 411931962 409614503 407375634 405204535 403043211
3281.6 403043211 400908113 398807466 396727175 394708842 392764181 390790343 388669699 386457622
3298 386457622 384350359 382420361 380559385 378615618 376514167 374287277 372020274 369833559 367754102
3316.3 367754102 365678012 363571852 361492127 359429359 357302636 355137169 353020638 350954562
3332.6 350954562 348959744 347016931 344998151 342869222 340736717 338642776 336623549 334749877
3348.9 334749877 332829088 330691487 328545094 326585710 324763209 322941482 321112096 319478273
3365.3 319478273 318028629 316437215 314605623 312809378 311311424 310050786 308865428 307737321
3381.6 307737321 306741267 305932134 305395037 305174261 304916382 304296523 303638786 303387940 303425133 303235412
3402 303235412 302714854 302346110 302320331 302448899 302614719 302757829 302920818 303230852 303675771 304166019
3422.4 304166019 304794222 305664331 306698233 307742387 308858901 310159177 311369836 312279373 313210845
3440.7 313210845 314478278 316040069 317785591 319587141 321364731 323158085 325074553 327204823
3457 327204823 329498023 331729531 333957046 336526394 339320093 341804773 343835980 345899284 348339796
3475.4 348339796 351087600 353888959 356531620 359155089 361935049 364731252 367504805 370412409
3491.7 370412409 373454303 376591206 379711062 382807404 385980040 389060915 391992807 395078063
3508 395078063 398467869 402049094 405591309 408968717 412339836 415860951 419636935 423433334 426990867
3526.4 426990867 430605710 434480429 438499629 442677975 446882606 450896323 454964191 459281832
3542.7 459281832 463695854 467936158 472006798 476227701 480728298 485306919 489852130 494485527
3559 494485527 499130100 503547132 508014023 513263702 518949449 524210691 529213011 534363866 539722741
3577.4 539722741 545291483 550961733 556489527 561976254 567798436 573802412 579519331 585279703
3593.7 585279703 591391385 597550690 603652537 609814346 615889192 621756852 627783477 634064019
3610 634064019 640323043 646456063 652297974 658265889 664744437 670828283 676008642 680792511 686374843
3628.4 686374843 692906439 698852241 704258978 709540129 714618981 719510853 724108934 728159487
3644.7 728159487 731851637 736110806 741059422 745418847 749082148 752897382 756794572 760213494
3661 760213494 763130724 765627027 767661393 769632518 771925390 773868918 775591671 777958691 780480862
3679.4 780480862 782679856 784638464 786289811 787673712 789022863 790530443 792186797 793704152
3695.7 793704152 794825673 795624554 796465337 797520339 798451304 798957825 799259961 800048947 801392078
3714 801392078 802459002 802914619 803032339 803122163 803380132 803877592 804412603 804667473 804717541 805011034
3734.4 805011034 805881023 806967020 807508647 807260871 806965411 807330608 807619750 807779908 808555305
3752.8 808555305 809513330 810032308 810303092 810726702 811135948 811314821 811399043 811538696 811899960 812353194
3773.2 812353194 812574744 812593937 812607229 812733412 812940896 813175678 813391984 813547194 813650012 813576102
3793.6 813576102 813321114 813088894 812763989 812571824 812893271 813177407 813437521 813939571 814190626 813882351
3814 813882351 813418329 813245535 813084483 813176215 813695490 814096391 814236462 814148545 813967168 813812673
3834.4 813812673 813491821 813157797 813258410 813720286 814282298 814660430 814538002 813652754 812387347
3852.7 812387347 812410235 813483536 814089417 814025521 813712120 813553751 813447177 813208342 813231349 813589513
3873.1 813589513 813941717 814081013 813872159 813718975 813836217 813892961 813928545 813864410 813659847 813677788
3893.5 813677788 813762069 813511014 813005388 812582910 812552512 813016891 813584030 813861549 813878000 813723922
3913.9 813723922 813436449 813224435 813201010 813203871 813145697 813092768 813012362 812883258 812885940 813072801 813222706
3936.3 813222706 813213944 813062847 812873244 812826574 812888503 812932014 812934041 812906682 812869489 812797606 812744915
3958.8 812744915 812779188 812800229 812746346 812691033 812680304 812705457 812760770 812810302 812789857 812735260 812736988 812770009
3983.2 812770009 812774718 812709749 812571287 812437057 812369585 812431633 812573314
3997.5 812573314
##END=$$ End of the data block
