##TITLE=$$ Begin of the data block
##JCAMP-DX=5.00 $$ ACD/SpecManager v 10.08
##SPECTROMETER/DATA SYSTEM=Alpha
##DATE=14 Apr 2014 11:23:48
##DATA TYPE=INFRARED SPECTRUM
##DATA CLASS=XYDATA
##ORIGIN=
##OWNER=
##NPOINTS=1765
##FIRSTX=399.75695801
##LASTX=3997.56933594
##MAXX=3997.56933594
##MINX=399.75695801
##MAXY=0.86589974
##MINY=0.30291951
##XFACTOR=1.0000000000
##YFACTOR=1.000000000000000e-9
##FIRSTY=0.69382387
##DELTAX=2.03957629
##XUNITS=1/CM
##YUNITS=ARBITRARY UNITS
##XYDATA=(X++(Y..Y))
399.8 693823874 691899478 688065469 686127484 686287880 684796274 682142138 681430042 681590676 679466307
418.1 679466307 676354706 676225901 676800728 674891293 672976255 673691154 674128115 671743095 669374704
436.5 669374704 669578910 669835389 668092549 667216182 668524921 668510199 666473031 665675879 666401327
454.8 666401327 665651679 663401842 662907183 663844943 662998140 660773695 660259843 660736144 659353197
473.2 659353197 657141685 656737685 657171190 656143606 654713571 654991567 655445278 653880477 652033627
491.5 652033627 652071595 652175188 650411308 648518503 648290753 648201764 646716356 645328879 645249188 644883335
511.9 644883335 643233716 641850054 641461968 640439510 638326347 636887729 636545002 635590851 633772969
530.3 633772969 632672608 632394433 631516278 630120635 629542828 629680037 629204154 628054202 627417326
548.6 627417326 627314746 626654148 625484526 624782860 624280870 622992635 621273816 620023727 618791103
567 618791103 616760254 614357769 612300813 610558510 608749449 606858552 605179369 603590548 601738214
585.4 601738214 599773467 597963989 596166492 594250023 592613518 591629088 590832591 589598715 588174164
603.7 588174164 587265909 587098539 587332726 587237597 586477399 585924804 586910546 589563549 592907310 596402466
624.1 596402466 599933326 603349805 606476426 609360814 612152040 614589274 616367519 617554545
640.4 617554545 618013382 617968857 618663728 620634496 622543991 622578382 621038616 621164083 625105739
658.8 625105739 630617619 634856105 637015641 637657285 639645934 643361270 646456242 648843825 650617480
677.1 650617480 652056336 653859377 655916333 657467782 658558965 659845352 661212087 661870539 661847532
695.5 661847532 662113011 663001001 663761914 664321244 665509701 667182922 668435395 669332147 670487344
713.8 670487344 671542168 671723604 671776772 673398137 676470339 679501593 682063818 684708238 687247038
732.2 687247038 688962281 690137625 691537201 693001688 694015861 695064008 696853220 698860526
748.5 698860526 700316608 701742470 703817189 705922723 707297027 708408535 709978044 711614728
764.8 711614728 712815940 714039028 715635240 717011511 717640936 717908919 718222260 718134284 717417896
783.2 717417896 716978371 717436433 718287587 719277322 721127927 724247873 727912188 731496394 735308826
801.6 735308826 739504516 743302643 746197760 748925686 751967907 754597247 756446779 758074284
817.9 758074284 759545863 760050178 759310901 758040726 756469131 753993094 750786364 747909606 745561421
836.2 745561421 742959678 739856541 736905336 734414458 732136548 730607688 731076181 733870804 738214672
854.6 738214672 743703783 750476539 757941663 764896214 770978928 776682794 781904519 785942614
870.9 785942614 788955152 791761577 794314325 795910239 796575725 796897709 796790779 795726776 793991148
889.3 793991148 792463541 791446388 790791631 790695786 791498244 792899430 794237733 795426071 796593070
907.6 796593070 797369123 797245741 796171188 794492245 792313457 789538503 786633611 784366906 782944798
926 782944798 782199264 782168746 782879889 783913016 784784317 785538912 786352038 787034631 787389278 787477851
946.4 787477851 787332475 786702514 785298347 783115923 780225992 776459515 771544874 765388966 757962525
964.7 757962525 749063551 738550246 726712763 714248598 701979101 690633535 680672646 672122359
981 672122359 664621413 657791913 651562870 646017313 641212583 637145579 633750439 630961180 628700018
999.4 628700018 626868129 625220597 623194039 620216310 616151094 611145675 605376482 599151611
1015.7 599151611 592930734 586990058 581282973 575767219 570527136 565586686 560897350 556555212
1032 556555212 552806199 549733639 547138274 544813812 542671978 540608644 538428843 536024094 533642113
1050.4 533642113 531755090 530798495 531134307 532914340 535759211 538747072 540917575 541747510 541036904
1068.7 541036904 538843751 535728216 532494664 529585898 526905537 524197578 521271169 517824531
1085 517824531 513454795 508209109 503022015 499261588 497790754 498648942 501357496 505137980 509131610
1103.4 509131610 512742996 515854001 518511593 520482004 521372676 520852149 518310308 513010263 505950809
1121.8 505950809 500950217 501061797 504742384 508392990 510031164 509872794 509957671 512183845 516533434
1140.1 516533434 521733344 526508093 530173421 532761872 534720480 536447823 538137019 540056288
1156.4 540056288 542702377 546501935 551677525 558463812 567042470 577097237 587771893 598262787
1172.7 598262787 608209133 617384315 625459909 632270157 637878776 642104447 644341052 644229829
1189.1 644229829 642108500 638508499 633853674 628984451 625271797 623740613 624354184 626365960
1205.4 626365960 628981888 631404877 632847011 633061945 632534385 631811202 630938530 629866064 628949940
1223.7 628949940 628498375 628334880 628278971 628603160 629554629 630825877 632052839 633347511 634864390
1242.1 634864390 636301219 637289166 637963355 638600171 639078975 639300168 639692128 640756726 642489433
1260.4 642489433 644750655 647799432 651849747 656529307 661362052 666370213 671718419 677134454
1276.8 677134454 682252347 687228620 692407906 697636247 702520609 707099199 711556911 715600610
1293.1 715600610 718855917 721554816 724116683 726383567 728040636 729371727 730783105 732081413
1309.4 732081413 732934773 733571947 734402359 735342741 736134708 736974001 738130569 739286661 739990234
1327.8 739990234 740359485 740628004 740517020 739795387 738919735 738548100 738668859 738825917 738943517 739181757
1348.1 739181757 739354491 739161491 738714516 738129556 736931801 734422982 730578601 726691604 723919392
1366.5 723919392 721696019 718748927 714251339 708671272 704557002 704065204 706252337 708551168
1382.8 708551168 710338831 712452531 714411736 715122521 714474559 713034868 711371541 709323764 706829607
1401.2 706829607 704178751 701646328 699410856 697315514 695455909 694077492 692943454 691720068
1417.5 691720068 690751553 690362036 689994395 689246237 688113153 686524689 684511304 682228267 679891109
1435.9 679891109 678153634 676866233 675202072 673173606 671168268 669126391 666826487 664135218
1452.2 664135218 661573887 660655499 663140416 667252600 671236873 675855696 682971239 694037735
1468.5 694037735 709631860 728439450 744081378 754093945 760930896 765644968 768585086 770049274
1484.8 770049274 770292103 769422293 767771363 765817761 763186693 759499729 755516827 751820982 748053551
1503.2 748053551 742994845 736495793 731636584 727915525 723925054 719962955 716768742 714516640
1519.5 714516640 712548554 710853755 709516466 708335042 707205534 705789626 704387844 703481078
1535.8 703481078 702386320 700920522 700439095 700933158 701492608 701881289 702328503 703075409 703848720
1554.1 703848720 704170167 704546273 706299424 707857072 708203197 707743645 706663430 705085695 703054249
1572.5 703054249 699967623 695665956 691437483 687016129 681634724 675704062 669423819 662692249
1588.8 662692249 655559182 648284316 640937507 633569241 626246274 618978202 611809194 604730487
1605.1 604730487 597605467 590367079 583223522 576183558 568530738 560413837 553917646 548126459
1621.4 548126459 541732430 535813868 530787408 526447237 522992432 520189106 518351972 518410504 519639671
1639.8 519639671 521438539 523709595 527024388 531411171 535126388 539324284 546237528 552423894
1656.1 552423894 557384968 562837183 569468319 576660991 583031118 589650571 597545743 605070055
1672.4 605070055 612668574 621165574 629082799 636068046 643418372 653126180 662623227 670315802
1688.8 670315802 677573740 683934450 690465450 697997093 706399083 716869950 726176977 733587384
1705.1 733587384 740624964 746708035 751899779 756431401 760483980 764906883 769621253 773528874
1721.4 773528874 776662767 779552937 782316208 784904778 787061691 789316356 792186260 794646084
1737.7 794646084 796593368 798631251 801097095 804123878 807795882 812367082 817663610 822346807
1754 822346807 825980186 828933179 831439793 833876014 836087465 837729096 838973403 840027988 841150224
1772.4 841150224 842647314 844214141 845560849 846639514 847564936 848560393 849646747 850436866 850752413
1790.7 850752413 851323485 852480829 853464425 853976011 854539335 855417252 856199265 856637359 856964886
1809.1 856964886 857511282 858153760 858596921 858912945 859350204 859763622 859908044 860012412 860280275 860584974
1829.5 860584974 861004174 861500204 861912012 862267733 862479687 862430274 862355113 862677336 863147497 863458455
1849.9 863458455 863752723 864073396 864255846 864288330 864419818 864667237 864739239 864505410 864325285 864627421
1870.3 864627421 865089476 865264416 865290165 865417421 865555465 865563869 865535319 865550160 865490079 865397573 865441859
1892.7 865441859 865620375 865791500 865811706 865771532 865826070 865899742 865819991 865687490 865743160 865875781 865782678
1915.1 865782678 865537763 865521967 865670979 865689218 865658343 865728498 865827441 865773976 865572810 865453303 865455031
1937.6 865455031 865316451 865012884 864921927 865071118 865059793 864825308 864672661 864682734 864601195 864320993
1958 864320993 864095867 864075005 864007533 863711596 863461256 863450706 863407075 863153517 862920046 862892032 862868726
1980.4 862868726 862644851 862375200 862270474 862188041 861907423 861625493 861599386 861603379 861363947 861067235
2000.8 861067235 860957623 860886157 860601664 860234380 860077620 860040665 859818995 859464824 859273255 859187126
2021.2 859187126 858950257 858626842 858468175 858434618 858254373 857918918 857720733 857684970 857525110 857238054
2041.6 857238054 857105672 857143164 857068598 856824100 856648922 856624365 856521070 856253982 856086254 856112599
2062 856112599 856076181 855860114 855697453 855732739 855748057 855574012 855431318 855484784 855539083 855437219 855348110
2084.4 855348110 855429590 855504692 855408192 855314136 855402529 855485141 855369806 855249166 855349302 855524600 855505884
2106.9 855505884 855362475 855364382 855501831 855526626 855442166 855492473 855676472 855735838 855661809 855707169 855879843
2129.3 855879843 855947852 855913639 855994105 856166542 856203675 856121123 856168389 856347024 856421351 856380522 856448352
2151.7 856448352 856669843 856814265 856785655 856798589 856981337 857112646 857080221 857133925 857375622 857553840
2172.1 857553840 857554913 857590914 857775807 857948005 857967675 857965052 858109534 858291566 858329713 858309627 858408868
2194.6 858408868 858538806 858534217 858491659 858582377 858692288 858645320 858596146 858724713 858864188 858813524 858705163
2217 858705163 858750999 858875275 858877659 858795166 858817220 858919442 858912766 858818948 858834743 858920336 858860910 858700156
2241.5 858700156 858681560 858773649 858700097 858472764 858357787 858374894 858306468 858115554 857982874 857967317 857928216
2263.9 857928216 857819796 857775569 857829452 857832611 857741058 857738733 857911646 858081996 858103991 858032703 857907593
2286.3 857907593 857671201 857315004 856946528 856663346 856362343 855911613 855407059 854953408 854372203 853502691
2306.7 853502691 852499008 851577222 850799441 849993169 848846853 847338974 845854640 844694376 843744457
2325.1 843744457 842731655 841677785 840864241 840310097 839800537 839330614 838922083 838679731 839348853
2343.5 839348853 841721117 844328582 844671667 842211246 838397264 835036218 832715869 831592679
2359.8 831592679 831754327 833021283 835144222 837829530 840796590 843873322 846833766 849606752
2376.1 849606752 852281392 854752481 856739104 858111382 858962655 859445393 859666049 859724402 859736204
2394.4 859736204 859743595 859709084 859617829 859551430 859570563 859594285 859554410 859509408 859501898 859488487 859410286 859297216
2418.9 859297216 859229684 859174967 859068871 858956456 858873427 858777940 858660340 858581901 858566046 858535886 858423352
2441.3 858423352 858276784 858193636 858153999 858029366 857836187 857726276 857688904 857590318 857439995 857350588
2461.7 857350588 857308865 857185125 857002616 856907904 856856942 856701195 856472135 856307745 856213629 856089413
2482.1 856089413 855935812 855832040 855754912 855610013 855414927 855275035 855178118 855029941 854851246 854717314
2502.5 854717314 854608834 854453564 854254127 854102135 854018569 853884339 853661597 853488624 853396595 853255868
2522.9 853255868 853035092 852833629 852705657 852583945 852411807 852228403 852073252 851917446 851732731 851567268
2543.3 851567268 851463616 851351321 851164043 850961030 850790143 850615084 850403309 850170314 849972308 849796176
2563.7 849796176 849567175 849302948 849087834 848895133 848609924 848268688 847988069 847744465 847475410 847174048
2584.1 847174048 846853435 846511245 846145093 845799267 845502913 845221937 844917953 844588876 844232440 843860090
2604.5 843860090 843487918 843104184 842736185 842412949 842126667 841827154 841457725 841060162 840687811 840320408
2624.9 840320408 839945912 839594841 839298129 839011490 838672757 838301361 837935925 837563157 837165058 836775899
2645.3 836775899 836439073 836118877 835731149 835304499 834937990 834584117 834142506 833664298 833266437 832922459
2665.7 832922459 832518101 832092166 831774592 831539035 831280112 831004500 830766618 830522001 830187023 829802930
2686.1 829802930 829479039 829230845 828958273 828639150 828360915 828084707 827702701 827242494 826798379 826371312
2706.5 826371312 825878620 825262487 824608684 824021101 823409140 822730601 822111428 821588039 821065426 820484400
2726.9 820484400 819968700 819667876 819480181 819252133 819027841 818842173 818607748 818307757 818033457 817794561
2747.3 817794561 817445695 816908598 816339970 815886915 815446615 814896107 814324856 813818336 813246071 812523544
2767.7 812523544 811799109 811169803 810512900 809678733 808738470 807857573 806982756 805997133 804973304
2786 804973304 804001033 802985132 801847517 800695240 799600124 798458099 797138035 795688868 794218659
2804.4 794218659 792698681 791074812 789319873 787448704 785470963 783279777 780827820 778170049
2820.7 778170049 775244117 771860480 767849863 763087332 757348120 750282526 741495788 730498135
2837 730498135 716725767 699833870 679863989 657008708 631924748 606888115 586319864 575044096
2853.3 575044096 574986279 583819211 596893132 609776497 619466960 624781787 626407802 626605272
2869.7 626605272 628254473 632878482 639423370 645452917 649029195 649425745 646845818 641870439
2886 641870439 635113180 627130389 618456542 609577835 600696921 591716766 582546771 573055208 562853456
2904.3 562853456 551422358 538251936 522809386 504565418 483378708 460119307 436870635
2918.6 436870635 416682184 402914673 397869110 401759803 412967682 429128796 448274910 468963057
2934.9 468963057 489711583 508836091 524726808 536121964 542264998 543160498 539946139 534925222
2951.2 534925222 530887842 530151665 533807218 541667402 553032458 567206323 583400786 600561500
2967.6 600561500 617456019 633066416 646796763 658390105 668019652 676067114 682675242 688004613
2983.9 688004613 692409992 696107924 699176967 701599777 703292906 704366624 704932272 704991698 704717278
3002.2 704717278 704305232 703873932 703547120 703363657 703226089 703009009 702707231 702349842 701905489 701389730
3022.6 701389730 700768054 699935973 698992014 698066831 697082281 695887566 694506764 693151712 691835642
3041 691835642 690365255 688675165 686898530 685203671 683557868 681840897 680121362 678446710 676749349
3059.3 676749349 675085247 673549414 672121465 670648932 669050395 667487621 666097581 664854825
3075.6 664854825 663642526 662291467 660756409 659121156 657469749 655893207 654327333 652607024
3092 652607024 650799751 649074852 647429049 645704806 643801093 641844511 639995098 638170004 636166811
3110.3 636166811 634059548 632074594 630129635 628014624 625645101 623054922 620414436 617868841
3126.6 617868841 615415335 612928212 610311091 607661068 605130792 602607250 599840224 596908748
3143 596908748 594040215 591218114 588401198 585628211 582743466 579601228 576375663 573251665 570208907
3161.3 570208907 567151964 564036012 560884774 557727218 554550529 551324606 548080504 544858158
3177.6 544858158 541652799 538419843 535155475 531959951 528837919 525643289 522373140 519131601
3193.9 519131601 515895545 512658894 509468794 506327271 503201902 500061393 496935308 493886411
3210.3 493886411 490913808 487922251 484859645 481793940 478812635 475906461 472995073 470072031
3226.6 470072031 467185915 464386970 461684614 458951503 456153184 453395903 450695843 448054492
3242.9 448054492 445506722 442999959 440437853 437878400 435430557 433073342 430747211 428420722
3259.2 428420722 426052600 423638612 421277672 419055760 416959018 414838612 412553608 410206318
3275.5 410206318 407987356 405879349 403758258 401620358 399496257 397400379 395374656 393387854
3291.8 393387854 391357064 389239460 387038767 384892255 382945299 381104201 379153073 377026290
3308.2 377026290 374787062 372523278 370366693 368325263 366253883 364112943 362031400 360047340
3324.5 360047340 357969135 355728060 353501886 351392329 349392116 347469151 345485568 343377322
3340.8 343377322 341271728 339178354 337094188 335178941 333307266 331204176 328995943 326947033
3357.1 326947033 325078845 323284805 321548134 319975644 318526238 316951990 315153152 313389510
3373.4 313389510 311911583 310644239 309465557 308330923 307295978 306474090 305930346 305661917 305359304
3391.8 305359304 304725617 304091722 303939015 304077655 303887427 303302377 302919507 302954406 303115755 303256303
3412.2 303256303 303375334 303506017 303785861 304251283 304801047 305479616 306367010 307400703 308447987
3430.5 308447987 309567183 310852528 312041253 312957019 313935071 315254152 316826075 318517298 320231199
3448.9 320231199 321987122 323834449 325792938 327917039 330180585 332419336 334703743 337308407
3465.2 337308407 340088576 342544436 344585150 346722126 349206984 351940602 354764611 357433558
3481.5 357433558 360026658 362801462 365652800 368463516 371387392 374457866 377593100 380679637
3497.8 380679637 383763403 386969924 390079439 392973751 396024197 399435103 403040349 406578064
3514.2 406578064 409916729 413286954 416925788 420835704 424682856 428246766 431835204 435657769
3530.5 435657769 439632982 443773866 447956115 451965719 456050009 460419685 464887112 469165802
3546.8 469165802 473287046 477536261 482003361 486541241 491096854 495769829 500448465 504919350
3563.1 504919350 509456575 514704585 520316601 525514185 530490816 535682499 541129351 546761990
3579.4 546761990 552471459 558007777 563455105 569250762 575318396 581164420 586961508 592998624
3595.7 592998624 599168360 605374992 611587286 617592752 623348057 629383624 635805011 642171383
3612.1 642171383 648332357 654180229 660120249 666548491 672636688 677841842 682601571 688142359
3628.4 688142359 694673777 700625718 706043303 711359024 716466188 721385479 726006508 730017900
3644.7 730017900 733621538 737868607 742884517 747264206 750911117 754707634 758576989 761951029
3661 761951029 764823973 767313004 769382000 771379888 773644447 775550544 777280211 779674351 782226145
3679.4 782226145 784438312 786339462 787916005 789267600 790616572 792163610 793819010 795306802
3695.7 795306802 796482205 797338784 798150241 799177587 800129652 800668836 800972342 801732779 803047597
3714 803047597 804109454 804611564 804791987 804887652 805110395 805596948 806151867 806416452 806428730 806637466
3734.4 806637466 807413697 808488309 809088111 808837414 808487415 808863044 809160948 809284270 810069740
3752.8 810069740 811087251 811664402 811970651 812385619 812761068 812897623 812928975 813025832 813396990 813923001
3773.2 813923001 814230740 814296246 814349830 814534247 814716935 814847469 815031469 815253019 815407217 815312266
3793.6 815312266 814968109 814626098 814262748 814131081 814550519 814859271 815061927 815579057 815908790 815627515
3814 815627515 815162182 814957023 814710557 814795494 815384448 815772414 815827310 815710127 815584660 815524518
3834.4 815524518 815257311 814873338 814934671 815408707 815955102 816311896 816175044 815309286 814102232 814103305
3854.8 814103305 815143645 815785110 815769851 815470815 815306127 815231144 815061808 815096200 815373659 815633833
3875.2 815633833 815729916 815518439 815340638 815435231 815528810 815593302 815536261 815343440 815360010 815481782 815348685
3897.6 815348685 814967990 814566314 814473748 814860761 815364242 815622151 815641344 815475702 815209389 815066636
3918 815066636 815043986 814976096 814877272 814801097 814730585 814660609 814693570 814875603 814988852 814889371 814665854
3940.4 814665854 814482272 814482212 814570785 814610004 814632058 814634919 814589322 814552128 814597309 814692199 814737618 814719081
3964.9 814719081 814650595 814539015 814465463 814476788 814519942 814538479 814539671 814552486 814574778 814572155 814492345 814373791
3989.4 814373791 814289272 814241290 814282894 814442754
3997.5 814442754
##END=$$ End of the data block
