##TITLE=$$ Begin of the data block
##JCAMP-DX=5.00 $$ ACD/SpecManager v 10.08
##SPECTROMETER/DATA SYSTEM=Alpha
##DATE=14 Apr 2014 11:23:48
##DATA TYPE=INFRARED SPECTRUM
##DATA CLASS=XYDATA
##ORIGIN=
##OWNER=
##NPOINTS=1765
##FIRSTX=399.75695801
##LASTX=3997.56933594
##MAXX=3997.56933594
##MINX=399.75695801
##MAXY=0.84968960
##MINY=0.28927565
##XFACTOR=1.0000000000
##YFACTOR=1.000000000000000e-9
##FIRSTY=0.63969958
##DELTAX=2.03957629
##XUNITS=1/CM
##YUNITS=ARBITRARY UNITS
##XYDATA=(X++(Y..Y))
399.8F39699578o00993j520574k466500j610935j53303l32117j718223k437711j501501
$$ 639699578 639098585 637578011 635111511 633500576 633347273 633015156 631296933 628859222 627357721
418.1F27357721m0888o67572j780510r90451N63681N48542p30395j581610j157283
$$ 627357721 627316833 626649261 624868751 623878300 624441981 624990523 624260128 622678518 621521235
436.5F21521235o5029N2631p65145r26375j11163M66287n2154j019836j153290m26888
$$ 621521235 621456206 621508837 620743692 619817317 619706154 620172441 620120287 619100451 617947161 617520273
456.9F17520273N9187m94420j260877j106739m95851o45876j533806j759768p65800
$$ 617520273 617579460 617085040 615824163 614717424 614221573 613575697 612041891 610282123 609516323
475.2F09516323n1201m51803j161158j084268j71483J93417p09474j581430j236856
$$ 609516323 609465122 609013319 607852161 606767893 606596410 606789827 606080353 604498923 603262067
493.6F03262067m35591m73857j228511j640976j067102k32338l60251j221299j633287
$$ 603262067 602826476 602352619 601124108 599483132 598416030 598183692 597823441 596602142 594968855
511.9E94968855j106023m66109q27968j675069j807511j256406q90911j247168j715004
$$ 594968855 593862832 593396723 592568755 590893686 589086175 587829769 586938858 585691690 583976686
530.3E83976686j496255p77424n14209r52661j168728o68585j40786l43025j054526
$$ 583976686 582480431 581703007 581188798 580236137 579067409 578398824 578258038 577915013 576860487
548.6E76860487j427650j087248o20723q84354j676023j866818j317382j183569j946270
$$ 576860487 575432837 574345589 573724866 572840512 571164489 569297671 567980289 566796720 564850450
567E64850450k787054k839983k178847j746297k017856k315223j971603j313269j259565
$$ 564850450 562063396 559223413 557044566 555298269 553280413 550965190 548993587 547680318 546420753
585.4E46420753j787603j969159j409411q02219r40442j446724j623094j569211j530946
$$ 546420753 544633150 542663991 541254580 540452361 539511919 538065195 536442101 534872890 533341944
603.7E33341944j307070p61032l2902L14951P6294Q4996J175225K822757L901779L984511
$$ 533341944 532034874 531273842 531240940 531555891 531632185 531717181 532892406 535715163 539616942 543601453
624.1E43601453L435850L198684L468632L739119L462076K648950K017677J722276
$$ 543601453 547037303 550235987 553704619 557443738 560905814 563554764 565572441 567294717
640.4E67294717J170695Q39650J619101K608716K334774O39677r00865J23978L501534
$$ 567294717 568465412 569305062 570924163 573532879 575867653 576507330 575606465 575730443 579231977
658.8E79231977N732894N129755L244281K537071L516019L238439K576948K454877
$$ 579231977 584964871 590094626 593338907 595875978 599391997 602630436 605207384 607662261
675.1F07662261K403497K544642K704203K463937J892209J592636J709163J695037
$$ 607662261 610065758 612610400 615314603 617778540 619670749 621263385 622972548 624667585
691.4F24667585J159847N41567L79265O60240R94564J170039J237452J467287J939595
$$ 624667585 625827432 626368999 626748264 627408504 628403068 629573107 630810559 632277846 634217441
709.8F34217441K215922K112210J883209J825153K094031K472341K528965K326370
$$ 634217441 636433363 638545573 640428782 642253935 644347966 646820307 649349272 651675642
726.1F51675642K224743K355575K339781J857459J355291J378536J768410J836181
$$ 651675642 653900385 656255960 658595741 660453200 661808491 663187027 664955437 666791618
742.4F66791618J485526J308263J602411J980782J935720J491785J301169J676024
$$ 666791618 668277144 669585407 671187818 673168600 675104320 676596105 677897274 679573298
758.7F79573298J945137J610697J084566J005053J296640J356482Q21352M7446k98262
$$ 679573298 681518435 683129132 684213698 685218751 686515391 687871873 688693225 688740671 688442409
777.1F88442409k83003n20587j079976j272858n66780O59704J626968K257169L158986
$$ 688442409 688159406 687638819 686558843 685285985 684719205 685378909 687005877 689263046 692422032
795.4F92422032M522622N551279N651712N164802M663646M409015L967166K953351
$$ 692422032 696944654 702495933 708147645 713312447 717976093 722385108 726352274 729305625
811.7G29305625J896977J344324R37163J46509j050353k278448l062069l420234l886759
$$ 729305625 731202602 732546926 733484089 733630598 732580245 730301797 727239728 723819494 719932735
830.1G19932735m563034m809439m338920l708959l508746l617764l402769k472282
$$ 719932735 715369701 710560262 706221342 702512383 699003637 695385873 691983104 689510822
846.4F89510822r18030R96649K983868M965842O961643Q477450Q898556Q492887Q009374
$$ 689510822 688592792 689589441 692573309 697539151 704500794 712978244 721876800 730369687 738379061
864.8G38379061P529080O603360N109549L562450K564669K093732J667917R16779K2709
$$ 738379061 745908141 752511501 757621050 761183500 763748169 765841901 767509818 768426597 768449306
883.1G68449306m68671o27756j039922j640976j775801j068592R2387Q77500J018345
$$ 768449306 767980635 767352879 766312957 764671981 762896180 761827588 761919975 762797475 763815820
901.5G63815820J070440J363218J399755O65129o74248j865328k459764k891302l565550
$$ 763815820 764886260 766249478 767649233 768314362 767640114 765774786 763315022 760423720 756858170
919.8G56858170m026473l512680k045929n82159J52051M28081P98821J213789J126469
$$ 756858170 752831697 749319017 747273088 746690929 746842980 747271061 748069882 749283671 750410140
938.2G50410140M71890o8248q7797p7069p40946j985251l082574l699362m361868n671382
$$ 750410140 750882030 750813782 750725985 750648916 749907970 747922719 744840145 741140783 736778915 731107533
958.6G31107533p373631q862019j0076761j1430383j3054013j4305949j4359713j3171136
$$ 731107533 723733902 714871883 704795122 693364739 680310726 666004777 651645064 638473928
974.9F38473928j1499524j0041893q799433p552266o482721n809367n391120m899920
$$ 638473928 626974404 616932511 608133078 600580812 594098091 588288724 582897604 577997684
991.2E77997684m150271l330707k827824k656936k467096k235294k433955l343284
$$ 577997684 573847413 570516706 567688882 565031946 562564850 560329556 557895601 554552317
1007.5E54552317m623175n717158o265462o339609o279529o144881n745351n153179
$$ 554552317 549929142 544211984 537946522 531606913 525327384 519182503 513437152 508283973
1023.9E08283973m715383m551769m444629m168510l690600l243834l013224k782672
$$ 508283973 503568590 499016821 494572192 490403682 486713082 483469248 480456024 477673352
1040.2D77673352k428532k126604k057106k161502j993865j150102K30909J643866
$$ 477673352 475244820 473118216 471061110 468899608 466905743 465755641 465986550 467630416
1056.5D67630416K728671L339231L367662K615482J023054j007229k673179l402114
$$ 467630416 470359087 473698318 477065980 479681462 480704516 479697287 477024108 473621994
1072.8D73621994l396064l159135k883464k520621k233684k362371k886653l305912
$$ 473621994 470225930 467066795 464183331 461662710 459429026 457066655 454180002 450874090
1089.1D50874090l092348k105683o97732O11841J577407K241731K605736K492726K029330
$$ 450874090 447781742 445676059 444978327 445590168 447167575 449409306 452015042 454507768 456537098
1107.5D56537098J548975J094819M44650o99848k447188m351169n215168l887683j161068
$$ 456537098 458086073 459180892 459625542 458925694 456478506 452127337 446912169 443024486 441863418
1125.8D41863418R23335J873404J754254P68542M56244J469821K755374L395617L254294
$$ 441863418 442786753 444660157 446414411 447182953 447639197 449109018 451864392 455260009 458514303
1144.2D58514303K651870K095223J935243K129436K448290K855242L537357M558175
$$ 458514303 461166173 463261396 465196639 467326075 469774365 472629607 476166964 480725139
1160.5D80725139N775154P005692Q098632Q963942R514928R614408R248138Q610963
$$ 480725139 486500293 493505985 501604617 510568559 520083487 529697895 538946033 547556996
1176.8E47556996P910669P131577O079674M628241K883791J108528n37634j940429
$$ 547556996 555467665 562599242 568678916 573307157 576190948 577299476 576761842 574821413
1193.1E74821413k789438k756477j896619o47486N18799J300633J580596J364946P58172
$$ 574821413 572031975 569275498 567378879 566731393 567250192 568550825 570131421 571496367 572254539
1211.5E72254539M768o06299q87215q48651p11977o04630l93271K6286N17189Q94427
$$ 572254539 572259307 571653008 570765793 569917142 569205165 568600535 568207264 568233550 568750739 569645166
1231.9E69645166J169205J439929J685441J825690J791239J559913J240134R25839
$$ 569645166 570814371 572254300 573939741 575765431 577556670 579116583 580356717 581282556
1248.2E81282556N85079K40445L4869J11103M83334J036108J659572K343297L069043
$$ 581282556 581867635 582108080 582142949 582254052 582737386 583773494 585433066 587776363 590845406
1266.6E90845406L734767M312575M756332N032480N251050N437731N547405N625426
$$ 590845406 594580173 598892748 603649080 608681560 613932610 619370341 624917746 630543172
1282.9F30543172N719245N798101N741298N473495N075634M655718M280746L909648
$$ 630543172 636262417 642060518 647801816 653275311 658350945 663006663 667287409 671197057
1299.2F71197057L498852L135204K856553K598822K283394J908005J616835J476527
$$ 671197057 674695909 677831113 680687666 683286488 685569882 687477887 689094722 690571249
1315.5F90571249J419127J400232J393258J402319J391888J254975R49264N36501J12534
$$ 690571249 691990376 693390608 694783866 696186185 697578073 698833048 699782312 700318813 700431347
1333.9G00431347j84536k24829L696K85327M52161N69701O03855M84824K79963Q6129
$$ 700431347 700246811 700021982 700025678 700311005 700763166 701332867 701936722 702421546 702701509 702787638
1354.3G02787638j18733m92453j073540j539290j608252j535833j542270j691461k032459
$$ 702787638 702668905 702176452 701102912 699563622 697955370 696419537 694877267 693185806 691153347
1372.6F91153347k147555j677334j067698r08971j231611j358986j019656p95365j044750
$$ 691153347 689005792 687328458 686260760 685351789 684120178 682761192 681741536 680946171 679901421
1391F79901421j462340j646757j683295j989007k414048k837658l085851k872170k609908
$$ 679901421 678439081 676792324 675109029 673120022 670705974 667868316 664782465 661910295 659300387
1409.3F59300387k430856k154887j909494j675308j119673o11902n04136l80695l22401
$$ 659300387 656869531 654714644 652805150 651129842 650010169 649398267 648894131 648513436 648191035
1427.7F48191035m08113m15147l88085r299Q50439J079858Q59141P37846Q52227J286507
$$ 648191035 647782922 647367775 646979690 646970391 647820830 648900688 649759829 650497675 651349902 652636409
1448.1F52636409J652002J608670J749635L588795O472230O267905N340636O049872
$$ 652636409 654288411 655897081 657646716 661235511 667707741 673975646 679316282 685366154
1464.4F85366154P116794P275760P969440R798049R635449P400155N490363M041910
$$ 685366154 692482948 699758708 707728148 717526197 727161646 734561801 740052164 744094074
1480.7G44094074K946794J781046N73695l10421p46012j227856k150535l041923l279030
$$ 744094074 747040868 748821914 749395609 749085188 748339176 747111320 744960785 741918862 738639832
1499.1G38639832l386736l874779n166590o289721m894137m161537m550755m611909
$$ 738639832 735253096 731378317 726211727 719922006 715027869 710866332 706315577 701703668
1515.4G01703668m071772l315032k910316k399504k153874k283990k193451k175271
$$ 701703668 697631896 694316864 691406548 689007044 686853170 684569180 682375729 680200458
1531.7F80200458k056241j723767j930177k089500q82626J88410L64423L20673N31673
$$ 680200458 678144217 676420450 674490273 672400773 671518147 671706557 672070980 672391653 672923326
1550.1F72923326R58324J087964P45534R98497K243996J601577L31283n73755j472950
$$ 672923326 673881650 674969614 675715148 676713645 678957641 680559218 680890501 680316746 678843796
1568.4F78843796k084851k476931l521978m925490n012393n061507n895376o555081
$$ 678843796 676758945 674282014 670760036 665834546 660822153 655760646 649865270 643310189
1584.7F43310189p018983p360876p621944p766902p860720p801831p672250p619620
$$ 643310189 636291206 628930330 621308386 613541484 605680764 597878933 590206683 582587063
1601.1E82587063p553041p441461p414400p462621p295609p041871p439196p808626
$$ 582587063 575034022 567592561 560178161 552715540 545419931 538378060 530938864 523130238
1617.4E23130238o292820n498111n842626n383849m678309m119695l377199k892613
$$ 523130238 516837418 511339307 505496681 500112832 495434523 491314828 487937629 485045016
1633.7D85045016k230525o42121M01825Q36223J182228K094388L163249K786964L339201
$$ 485045016 482814491 482172370 482574195 483410418 484592646 486687034 489850283 492637247 495976448
1652D95976448N860627N486488M550874M973531O048560O739497O166220O581962P866025
$$ 495976448 501837075 507323563 511874437 516847968 522896528 529636025 535802245 542384207 550250232
1670.4E50250232P529259P841647Q792519P955790O956815P675171J0534525J0189832
$$ 550250232 557779491 565621138 574413657 582369447 589326262 597001433 607535958 617725790
1686.7F17725790Q294880Q248925P589877P974744Q889556R255826J1045873R597481
$$ 617725790 626020670 634269595 641859472 649834216 658723772 667979598 679025471 688622952
1703F88622952P799863P660628O494403N316615M552483M189670M765451M907668L938675
$$ 688622952 696422815 704083443 710577846 715894461 720446944 724636614 729402065 734309733 738248408
1721.4G38248408L389776L256261K901375K658904K617061L646433M444778L516078
$$ 738248408 741638184 744894445 747795820 750454724 753071785 756718218 761162996 764679074
1737.7G64679074L500521M058481L957987L588080L352284L756345M216790L491342
$$ 764679074 768179595 772238076 776196063 779784143 783136427 786892772 791109562 794600904
1754G94600904K730966K523601K335727K437293K238930J584887J255155J317084J774668
$$ 794600904 797331870 799855471 802191198 804628491 806867421 808452308 809707463 811024547 812799215
1772.4H12799215K050639J597523J274407J360536J399696J271963J150429R02057
$$ 812799215 814849854 816447377 817721784 819082320 820482016 821753979 822904408 823806465
1788.7H23806465P88211J207531J341045R75072Q05319R87410J112819R31859O94632
$$ 823806465 824594676 825802207 827143252 828118324 828923643 829911053 831023872 831955731 832650363
1807H32650363O39618P82430Q15809O52551N71251O27280N11765K99156L16739L90351
$$ 832650363 833289981 834072411 834888220 835540771 836112022 836739302 837251067 837550223 837866962 838257313
1827.4H38257313N33342Q06153P15673M62413M55796M00007R9242P9453N36323P03156
$$ 838257313 838790655 839596808 840312481 840774894 841230690 841630697 841729939 841809392 842345715 843048871
1847.8H43048871N76078M42505L23713K94984L15845L14056K34426P7426q0466O9797
$$ 843048871 843624949 844067454 844391167 844686151 845001996 845316052 845550478 845627904 845547438 845617235
1868.2H45617235M87268N50449L12447K04444K36034K09690J33931J05679P6950O1452
$$ 845617235 846104503 846654952 846967399 847171843 847407877 847617567 847751498 847857177 847934127 847995579
1888.6H47995579J60694J92523J45972J76728J75834J06394N7280N8711N0365K8730
$$ 847995579 848156273 848348796 848494768 848671496 848847330 848953724 849011004 849069715 849120080 849148810
1909H49148810M5836M3690l9935n3227N7280M7863O8903K07901J62482o199o3777K98
$$ 849148810 849194646 849238336 849198401 849145174 849202454 849250317 849319220 849527121 849689603 849683404 849619627 849619925
1933.5H49619925N4777q107j82390k25663k3127J06633J7107r2209q2969l3856q0704
$$ 849619925 849674702 849666595 849484205 849258542 849235415 849342048 849359155 849266946 849183977 849150121 849069417
1955.9H49069417k04385k12729r7453p6175j51217j64867j13308k4378K2709r2745
$$ 849069417 848865032 848652303 848554850 848478675 848327458 848162591 848049283 848024905 848047614 847954869
1976.3H47954869k10941j49965j2874j1087j68145l04162k28942M173L6895j82152
$$ 847954869 847743928 847593963 847581089 847570002 847401857 847097695 846868753 846872926 846909821 846727669
1996.7H46727669k71082j19507j7643j21474k83957k61724q6128k8193j78457l17633
$$ 846727669 846456587 846337080 846319437 846197963 845914006 845652282 845566154 845537961 845359504 845041871
2017.1H45041871k22921m5777o4850k49385l17753j82986l0160o6519k39908k81036
$$ 845041871 844818950 844773173 844708323 844458938 844141185 843958199 843928039 843861520 843621612 843340576
2037.5H43340576j19806L398j03712k72274k28524j9491M0948j23143k63214j86980
$$ 843340576 843220770 843224168 843120456 842848182 842619658 842600167 842641115 842517972 842254758 842067778
2057.9H42067778%J6749j60515k32041o3777Q9526J7107j51635j67310p331J05321
$$ 842067778 842067778 842084527 841924012 841691971 841628194 841717720 841734827 841583192 841415882 841408551 841513872
2080.3H41513872m172j62006r7394P4864Q1897p8738j56880l1054J31548J22070k9743
$$ 841513872 841509700 841347694 841250300 841325164 841407061 841328323 841171443 841140389 841271937 841394007 841364264
2102.8H41364264j15692k3306J11938P4744n3644n4717M5478Q8811M2916J3113Q4221
$$ 841364264 841248572 841225266 841337204 841411948 841358304 841303587 841349065 841437876 841480792 841493905 841578126
2125.2H41578126J53899J21355N3883L8445R5963J29521Q2016M8757R4115J53363J51813
$$ 841578126 841732025 841853380 841907263 841945708 842041671 842171192 842253208 842301965 842396080 842549443 842701256
2147.7H42701256J11878J06275J13547R2924Q3089J08719J52945J37031O2525M8280
$$ 842701256 842813134 842919409 843032956 843125880 843208969 843317688 843470633 843607664 843670189 843718469
2168H43718469J21534K00927J94490J03832O2823J22964J60158J04010L2663O0976
$$ 843718469 843840003 844040930 844235420 844339252 844402075 844525039 844685197 844789207 844821870 844882846
2188.4H44882846J55270J52349L3141m3095K5928J47343J24812k5630m7207J04011
$$ 844882846 845038116 845190465 845223606 845180511 845206439 845353782 845478594 845452964 845405757 845509768
2208.8H45509768J97947R7692q2076q3983J21832J85668j6331j49310k9206J67131
$$ 845509768 845707715 845805407 845723331 845639348 845761180 845946848 845930517 845781207 845752001 845919132
2229.2H45919132J56224q6904k15053m0710J66297P5102j92046k34843o556J58727
$$ 845919132 846075356 845988452 845773399 845732689 845898986 845974088 845782042 845547199 845540643 845699370
2249.6H45699370M1962j77861j72853O2406J56224o1810k42532q8989J86085J97530
$$ 845699370 845741332 845563471 845390618 845453024 845609248 845547438 845304906 845215917 845402002 845599532
2270H45599532n4717j76132K2412K46167J70708r0540j64628L8147J87814K0862k15054
$$ 845599532 845544815 845368683 845391095 845637262 845807970 845717430 845552802 845590949 845778763 845799625 845584571
2292.5H45584571j57058R7275J71065m1842k32816j60992K5213M0352j28627k16961
$$ 845584571 845427513 845524788 845695853 845654011 845421195 845260203 845285416 845325768 845197141 844980180
2312.9H44980180q8334L4452r9004k85506k03550K8491J27197L2424j55210k04742
$$ 844980180 844891846 844926298 844827294 844541788 844338238 844366729 844493926 844526350 844371140 844166398
2333.3H44166398j252J71960N8949q2910K15232O87361M12464l11196o80029n22435
$$ 844166398 844165146 844337106 844396055 844313145 844528377 845215738 845628202 845317006 844636977 844114542
2353.6H44114542j74522k9028j5259O6340K31564M39525N77390N82278N38349N43595
$$ 844114542 843940020 843910992 843895733 843962073 844193637 844633162 845210552 845792830 846331179 846874774
2374H46874774N37574M54247L25322K32518K46584K64168J57237k98m5180L3021R2446
$$ 846874774 847412348 847866595 848191917 848424435 848671019 848935187 849092424 849092126 849046946 849079967 849172413
2396.5H49172413L8088m7088n1677l457K7299j8597q6069n2214M0114M1306o1214j33037
$$ 849172413 849210501 849163413 849111736 849108279 849135578 849116981 849030912 848978698 849018812 849060118 848998904 848865867
2421H48865867r6560j1384J2576p3910j82628j55211l4690k8371j42873j75297n1677
$$ 848865867 848769307 848757923 848770499 848696589 848513961 848358750 848324060 848295689 848152816 847977519 847925842
2443.4H47925842L7253p5519k41816k26021p2658j312r6440k12073j76370m3989j7225
$$ 847925842 847963095 847887576 847645760 847419739 847347081 847345769 847249329 847037256 846860886 846816897 846799672
2465.8H46799672j40071k29121j59740o0379q6427j98782k36928j22428k8670j24872
$$ 846799672 846659601 846430480 846270740 846210361 846123934 845925152 845688224 845565796 845537126 845412254
2486.2H45412254k72631k58386r8050k0921j29521k52187k21611r0539n2690j70351
$$ 845412254 845139623 844881237 844783187 844762266 844632745 844380558 844158947 844068408 844015718 843845367
2506.6H43845367k50458j52350m6193q4699j81496k17080j52230o3598r7633k19822
$$ 843845367 843594909 843442559 843396366 843311667 843130171 842913091 842760861 842697263 842599630 842379808
2527H42379808k33709j26899o1333j21534k16782k21073j41860q6426j33634k00093
$$ 842379808 842146099 842019200 841957867 841836333 841619551 841398478 841256618 841170192 841036558 840836465
2547.4H40836465j87158j34647j25349j77502k11835j84119j68443k05576k11120j74105
$$ 840836465 840649307 840514660 840389311 840211809 839999974 839815855 839647412 839441836 839230716 839056611
2567.8H39056611j92225k48670k58029k56598k74539k52545k23338k56002l22283l47018
$$ 839056611 838864386 838615716 838357687 838101089 837826550 837574005 837350667 837094665 836772382 836425364
2588.2H36425364l27110l25024l38972l30269l26455l60906l83973l74198l73066l93569
$$ 836425364 836098254 835773230 835434258 835103989 834777534 834416628 834032655 833658457 833285391 832891822
2608.6H32891822m23372m31716m12345l93153l85880l79920l76821l68475l75271m36187
$$ 832891822 832468450 832036734 831624389 831231236 830845356 830465436 830088615 829720140 829344869 828908682
2629H28908682m60923m15981l82721l76344l79264l63171l39568l53694l86059m02570
$$ 828908682 828447759 828031778 827649057 827272713 826893449 826530278 826190710 825837016 825450957 825048387
2649.4H25048387m04477l96669l89755l86774l79443l60251l56197l94225m03464l70562
$$ 825048387 824643910 824247241 823857486 823470712 823091269 822731018 822374821 821980596 821577132 821206570
2669.8H21206570l66569l67343l41177l47436l98457m34875m19379l95059m00305l91006
$$ 821206570 820840001 820472658 820131481 819784045 819385588 818950713 818531334 818136275 817735970 817344964
2690.2H17344964l95060m23372m47154m64082m55856m64261m88042m89295n06997n48542
$$ 817344964 816949904 816526532 816079378 815615296 815159440 814695179 814207137 813717842 813210845 812662303
2710.6H12662303n69462n53310n21600n28038n51701n21719m89652n17190n44965n36382
$$ 812662303 812092841 811539531 811017931 810489893 809938192 809416473 808926821 808409631 807864666 807328284
2731H07328284n07534m42803l90708m07517m42147m54009m39823m45723n14209n65708
$$ 807328284 806820750 806377947 805987239 805579722 805137575 804683566 804243743 803798020 803283811 802718103
2751.4H02718103n32031m89295n13136n64635n91397o29246o55890o21498o28530o79434
$$ 802718103 802186072 801696777 801183641 800619006 800027609 799398363 798742473 798120975 797492445 796813011
2771.8G96813011o83427p01368p54654p96199q24094q18848q11100q42870q98242r49561
$$ 796813011 796129584 795428216 794673562 793877363 793053269 792234421 791423321 790580451 789682209 788732648
2792.2G88732648r53794r51230j020372j097441j096844j102031j175463j246095j292109
$$ 788732648 787778854 786827624 785807252 784709811 783612967 782510936 781335473 780089378 778797269
2810.5G78797269j336098j378238j401901j449168j555026j635849j737356j974166
$$ 778797269 777461171 776082933 774681032 773231864 771676838 770040989 768303633 766329467
2826.8G66329467k244889k525926k924860l455102m169881n136669o235123p342159
$$ 766329467 764084578 761558652 758633792 755178690 751008809 745872140 739637017 732294858
2843.1G32294858q543969r612918r705305q073210m851759j144469J710415K919197
$$ 732294858 723750889 714137971 704432666 696359456 691507697 690363228 692073643 694992840
2859.5F94992840K563060J325726j45972j370310j853824j384616m77910J11341J46211
$$ 694992840 697555900 698881626 698735654 697365344 695511520 694126904 693648994 693760335 693906546
2877.8F93906546k39015q74639j629352k382517k992809l366232l529906l610969l710687
$$ 693906546 693667531 692792892 691163540 688781023 685788214 682421982 678892076 675281107 671570420
2896.2F71570420l829539l916084m012168m260897m731715n440653o422758p669925
$$ 671570420 667740881 663824797 659812629 655551732 650820017 645379364 638956606 631286681
2912.5F31286681q997858r887993r758175q370638n845844k625764O65844L420114
$$ 631286681 622288823 612400830 602642655 594272017 588426173 585800409 586466253 589886367
2928.8E89886367N289316O429256P059574P172465O845593O184400N102813L548741
$$ 589886367 595175683 601604939 608664513 615836978 622682571 628866971 633969784 637518525
2945.1F37518525J766145K66850n37455o51717j62423Q14021J952708K927422L553272
$$ 637518525 639284670 639551520 639014065 638362348 638199925 639013946 640966654 643894076 647447348
2963.5F47447348L904879M099726M135430M057169L889919L637313L456355L367781
$$ 647447348 651352227 655451953 659587383 663644552 667534471 671171784 674628139 677995920
2979.8F77995920L137231K754629K382397K092779J890063J587630J034021N04255
$$ 677995920 681133151 683887780 686270177 688362956 690253019 691840649 692874670 693378925
2996.1F93378925K02716m649k00510l93868n17607m93645m21167n40018q58068j092732
$$ 693378925 693581641 693576992 693376482 692982614 692465007 691971362 691550195 691010177 690152109 689059377
3016.5F89059377j143098j145005j216591j376033j499772j453221j348853j355827
$$ 689059377 687916279 686771274 685554683 684178650 682678878 681225657 679876804 678520977
3032.8F78520977j505732j645029j591801j529813j679957j899421j958549j856387
$$ 678520977 677015245 675370216 673778415 672248602 670568645 668669224 666710675 664854288
3049.1F64854288j798510j890600j954436j889587j823187j792729j764893j694978
$$ 664854288 663055778 661165178 659210742 657321155 655497968 653705239 651940346 650245368
3065.5F50245368j628220j685857j777053j749397j574158j423180j555384j799345
$$ 650245368 648617148 646931291 645154238 643404841 641830683 640407503 638852119 637052774
3081.8F37052774j839220j759112j721442j798391j955748j974106j832604j754463
$$ 637052774 635213554 633454442 631733000 629934609 627978861 626004755 624172151 622417688
3098.1F22417688j858770k063334k119363j999974j984716k136945k198696k072394
$$ 622417688 620558918 618495584 616376221 614376247 612391531 610254586 608055890 605983496
3114.4F05983496k028585k228141k524435k673626k586007k477706k498805k582252
$$ 605983496 603954911 601726770 599202335 596528709 593942702 591464996 588966191 586383939
3130.7E86383939k625287k594411k581000k661586k793908k829493k788066k817274
$$ 586383939 583758652 581164241 578583241 575921655 573127747 570298254 567510188 564692914
3147E64692914k830326k797544k905965l073692l089369l048837l034711l017127l013432
$$ 564692914 561862588 559065044 556159079 553085387 549996018 546947181 543912470 540895343 537881911
3165.4E37881911l033757l103853l131270l050268l029108l124893l144383l062487
$$ 537881911 534848154 531744301 528613031 525562763 522533655 519408762 516264379 513201892
3181.7E13201892l023982l043651l051758l037334l052771l093212l102631l072321
$$ 513201892 510177910 507134259 504082501 501045167 497992396 494899184 491796553 488724232
3198D88724232l008187k943367k925813k920955k903760k846241k781481k809345k837152
$$ 488724232 485716045 482772678 479846865 476925910 474022150 471175909 468394428 465585083 462747931
3216.4D62747931k792626k747059k724409k721131k719015k667010k555579k476006
$$ 462747931 459955305 457208246 454483837 451762706 449043691 446376681 443821102 441345096
3232.7D41345096k543778k639323k569467k435595k361923k307832k276391k274841
$$ 441345096 438801318 436161995 433592528 431156933 428795010 426487178 424210787 421935946
3249D21935946k245844k202689k182395k163469k133698k120137k121687k080500j986802
$$ 421935946 419690102 417487413 415305018 413141549 411007851 408887714 406766027 404685527 402698725
3267.4D02698725j918494j962960k054781k059042j991481j956403j964450j945197
$$ 402698725 400780231 398817271 396762490 394703448 392711967 390755564 388791114 386845917
3283.7C86845917j919538j897633j831264j800209j878649j950115j949757j946301
$$ 386845917 384926379 383028746 381197482 379397273 377518624 375568509 373618752 371672451
3300C71672451j890391j761555j760602j951784k137453k147614k034128j971871j997441
$$ 371672451 369782060 368020505 366259903 364308119 362170666 360023052 357988924 356017053 354019612
3318.4C54019612k026379j980752j906305j931399k012641k044081k023429j949757
$$ 354019612 351993233 350012481 348106176 346174777 344162136 342118055 340094626 338144869
3334.7C38144869j881540j936078k049744k075702k045453j962692j832365j849980
$$ 338144869 336263329 334327251 332277507 330201805 328156352 326193660 324361295 322511315
3351C22511315j999586k032787j902521j785665j792849j795917j644224j502544j592845
$$ 322511315 320511729 318478942 316576421 314790756 312997907 311201990 309557766 308055222 306462377
3369.3C06462377j806110j790047j499652j301378j293749j297653j174003r74208
$$ 306462377 304656267 302866220 301366568 300065190 298771441 297473788 296299785 295325577
3385.7B95325577p66098n30362n24730p88987q12679m24773j55985l96788o84708m84646
$$ 295325577 294559479 294029117 293504387 292715400 291902721 291477948 291321963 290925175 290240467 289755821
3406.1B89755821j47044o3658r6917j06395o6161P4804K30283L11642M60655O98686
$$ 289755821 289608777 289545119 289448202 289341807 289275646 289350450 289580733 289892375 290353030 291051716
3426.5B91051716Q75353Q70556R06944J064182R64582P06017P49260J057118J343906
$$ 291051716 291927069 292797625 293704569 294768751 295733333 296439350 297188610 298245728 299589634
3444.8B99589634J526028J572341J578003J629531J712024J867593K026111K004802
$$ 299589634 301115662 302688003 304266006 305895537 307607561 309475154 311501265 313506067
3461.1C13506067K040356K333701K472460K180964J816094J884222K213836K475649
$$ 313506067 315546423 317880124 320352584 322533548 324349642 326233864 328447700 330923349
3477.4C30923349K538293K360672K317876K539485K627880K583325K663076K774238
$$ 330923349 333461642 335822314 338140190 340679675 343307555 345890880 348553956 351328194
3493.8C51328194K840132K806812K779961K891123K904415K756536K800316L077298
$$ 351328194 354168326 356975138 359755099 362646222 365550637 368307173 371107489 374184787
3510.1C74184787L302753L277302L068209K992511L185182L517688L557920L337801
$$ 374184787 377487540 380764842 383833051 386825562 390010744 393528432 397086352 400424153
3526.4D00424153L365695L565610L685474L831148L880560L737838L823369M112959
$$ 400424153 403789848 407355458 411040932 414872080 418752640 422490478 426313847 430426806
3542.7D30426806M233271M069060L890962M029393M317671M395783M426032M583687
$$ 430426806 434660077 438729137 442620099 446649492 450967163 455362946 459788978 464372665
3559D64372665M575669M338652M447580N276799N659163N181760M963398N156844N344808
$$ 464372665 468948334 473286986 477734566 483011365 488670528 493852288 498815686 503972530 509317338
3577.4E09317338N521894N583644N363285N359292N963445O227970N743206N681276
$$ 509317338 514839232 520422876 525786161 531145453 537108898 543336868 549080074 554761350
3593.7E54761350O025434O188333O290793O270707N892336N577326N960464O366253
$$ 554761350 560786784 566975117 573265910 579536617 585428953 591006279 596966743 603332996
3610F03332996O259382O076872N791843O106317O875933O361544N115926M615843N904794
$$ 603332996 609592378 615669250 621461093 627567410 634443343 640804887 645920813 650536656 656441450
3628.4F56441450P107198N999089N245089N227447N160391N082429M659056L842175
$$ 656441450 663548648 669547737 674792826 680020273 685180664 690263093 694922149 698764324
3644.7F98764324L586769M830599N716443M471123L690064M295290M286468L502428
$$ 698764324 702351093 707181692 712898135 717369258 721059322 725354612 729641080 733143508
3661G33143508K964914K520621K116501K441109K851247K262712K543986L229976K673089
$$ 733143508 736108422 738629043 740745544 743186653 746037900 748300612 750844598 754074574 756747663
3679.4G56747663K184272J837015J416147J626432K267420K252996J809001J459360
$$ 756747663 758931935 760768950 762185097 763811529 766078949 768331945 770140946 771600306
3695.7G71600306J216829J134813J343846J381695Q58248L61919N41866J385808J613855
$$ 771600306 772817135 773951948 775295794 776677489 777535737 777897656 778439522 779825330 781439185
3714G81439185J026750O15179N30899N22852N55813P65205P11202K14517j8716N02527
$$ 781439185 782465935 783081114 783612013 784134865 784690678 785455883 786167085 786381602 786362886 786865413
3734.4G86865413J334787J175642M1723m59969M05788P24793J43945O69241J385987
$$ 786865413 788200200 789375842 789417565 788957596 789363384 790088177 790232122 790901363 792287350
3752.8G92287350Q47280K37524M03643P25448M68195J74283J61887M12643P13884N21780
$$ 792287350 793134630 793372154 793775797 794501245 794969440 795143723 795305610 795718253 796432137 796953917
3773.2G96953917J64568J48892L90172M01020J43290J98424M13060L53694J16825j20699
$$ 796953917 797118485 797267377 797657549 798058569 798201859 798400283 798813343 799167037 799283862 799163163
3793.6G99163163j23799j02878j32501L31581M83155L17752O89209N22435k46525n42939
$$ 799163163 799039364 798936486 798803985 799135566 799618721 799936473 800625682 801148117 800901592 800358653
3814H00358653j35362L0398N1797O75082O67393K01523J4544j45435k32518j99616
$$ 800358653 800223291 800253689 800305486 800980568 801647961 801849484 801864028 801718593 801486075 801286459
3834.4H01286459j1623K88665L91484L96132M26054J29104n99444j229346m72844J313091
$$ 801286459 801274836 801563501 801954985 802351117 802777171 802906275 802306831 801077485 800604641 801917732
3854.8H01917732J081466L7432l76344k15530J41442l8147j72913K70664M37022K98917
$$ 801917732 802999198 803036630 802660286 802444756 802586198 802548051 802375138 802645802 803082824 803381741
3875.2H03381741k5868k31445Q94J19388K73883K43962j06037P3970K67327j87576
$$ 803381741 803355873 803124428 803125322 803244710 803518593 803762555 803656518 803730488 803997815 803810239
3895.5H03810239n81920m74096m6491M28557O65307M90308K05398m8995k98739k67804
$$ 803810239 803228319 802754223 802707732 803136289 803801596 804291904 804497302 804448307 804149568 803881764
3915.9H03881764M2499J56044l3855o6102J19508O7770o5267P8261K18093J02759o7949
$$ 803881764 803924263 804080307 804046452 803980350 804099858 804167628 804102361 804180622 804398715 804501474 804433525
3938.4H04433525r8884K9802J06513N0307O8664J11938O3419J9670K4616L2127N9903
$$ 804433525 804334641 804364443 804470956 804521263 804589927 804701865 804765284 804784954 804809570 804841697 804901600
3960.8H04901600P4148L8147P8499J38581R0838M0829P0691P6473L4809N1260P1585
$$ 804901600 804975748 805013895 805092394 805230975 805321813 805362642 805433333 805509806 805544615 805595875 805667460
3983.2H05667460M3929M1782P5698O5029R000J5438Q5235
$$ 805667460 805711389 805753171 805828869 805893898 805902898 805918336 806003571
3997.5H06003571
$$ 806003571
##END=$$ End of the data block
