##TITLE=$$ Begin of the data block
##JCAMP-DX=5.00 $$ ACD/SpecManager v 10.08
##SPECTROMETER/DATA SYSTEM=Alpha
##DATE=14 Apr 2014 11:23:48
##DATA TYPE=INFRARED SPECTRUM
##DATA CLASS=XYDATA
##ORIGIN=
##OWNER=
##NPOINTS=1765
##FIRSTX=399.75695801
##LASTX=3997.56933594
##MAXX=3997.56933594
##MINX=399.75695801
##MAXY=0.84991527
##MINY=0.28948668
##XFACTOR=1.0000000000
##YFACTOR=1.000000000000000e-9
##FIRSTY=0.63900715
##DELTAX=2.03957629
##XUNITS=1/CM
##YUNITS=ARBITRARY UNITS
##XYDATA=(X++(Y..Y))
399.8F39007151K47359j573264k861560k138972n19991p3314j398742k340078j159668
418.1F27188921L95894n60999j982570j477181K98798R07242m96209j886129j405716
436.5F20982051n4836J64449o67095r07898r1493M87446K7359q11100j010001l53157
456.9F17765725J58250o38962j608074j306533m03405m15206j551270j990557p97331
475.2F09212637J9312n23031j196980r54986j31726N6326p70151j479447j127184m58240
495.6F02646530n88239j311659j657010j062750k65003l62277j100659j467347j105964
514E93725622o61314r69052j708210j863241j253903p22229j076758j724065j591742
532.3E82155108q14437n11229r90272j203418o71565j73033m13537j162171j417518
$$ y = [639007151, 639254510, 637681246, 634819686, 632680714, 632160723, 632087409, 630688667, 628348589, 627188921, 627584815, 627023816, 625041246, 623564065, 623862863, 624770105, 624273896, 622387767, 620982051, 620927215, 621091664, 620424569, 619516671, 619425178, 619912624, 619939983, 619128883, 618118882, 617765725, 617923975, 617285013, 615676939, 614370406, 613967001, 613551795, 612000525, 610009968, 609212637, 609231949, 608708918, 607511938, 606556952, 606425226, 606481552, 605711401, 604231954, 603104770, 602646530, 602058291, 600746632, 599089622, 598026872, 597761869, 597399592, 596298933, 594831586, 593725622, 593064308, 592095256, 590387046, 588523805, 587269902, 586547673, 585470915, 583746850, 582155108, 581340671, 580829442, 579839170, 578635752, 577964187, 577791154, 577377617, 576215446, 574797928]
550.7E74797928q99076n51522j049399j781524j728594j188218j201690j936614k641559
569E61819732k599776k068877j858592k148211k344489j944900j287341j279473j795530
587.4E44492543j950562j507342r80735r16600j244962j548589j518488j393258j277805
605.8E32154202q43763j19448K76685R0122J31846J218855K822221L849268L926992
624.1E43506980L416061L151358L425717L742754L448665K670765K083540J809776
640.4E67255616J307547Q89421J564741K561450K264321O19530q44538J43647L574074
658.8E79335809N893171N194723L180266K397418L384471L264188K698720K602219
675.1F07950985K486289K512395K596379K362966J862347J619161J663982J578868
$$ y = [574797928, 573898852, 573347330, 572297931, 570516407, 568787813, 567599595, 566397905, 564461291, 561819732, 559219956, 557151079, 555292487, 553144276, 550799787, 548854887, 547567546, 546288073, 544492543, 542541981, 541034639, 540053904, 539137304, 537892342, 536343753, 534825265, 533432007, 532154202, 531310439, 531190991, 531467676, 531557798, 531689644, 532908499, 535730720, 539579988, 543506980, 546923041, 550074399, 553500116, 557242870, 560691535, 563362300, 565445840, 567255616, 568563163, 569452584, 571017325, 573578775, 575843096, 576462626, 575618088, 575761735, 579335809, 585228980, 590423703, 593603969, 596001387, 599385858, 602650046, 605348766, 607950985, 610437274, 612949669, 615546048, 617909014, 619771361, 621390522, 623054504, 624633372]
691.4F24633372J175225O31749L77357O74248J065552J186967J259327J521707J914322
709.8F34439826K174973K150715J924693J836122K124190K480566K447009K228559
726.1F51806653K246201K445936K331376J775145J321495J363575J735926J846969
742.4F66873276J506567J318932J663029K032816J916767J466453J317501J711368
758.7F79806709J974821J592040J060307J097978J444935J361847O82414o9201l45767
777.1F88606083k82228n15699j121819j292348n17130P04527J612127K243757L182054
795.4F92619324M499197N497157N642534N151689M620552M380405L969669K940893
811.7G29321420J827121J341641J089632K87235j026749k259791l014505l439069l954828
$$ y = [624633372, 625808597, 626440346, 626817703, 627491951, 628557503, 629744470, 631003797, 632525504, 634439826, 636614799, 638765514, 640690207, 642526329, 644650519, 647131085, 649578094, 651806653, 654052854, 656498790, 658830166, 660605311, 661926806, 663290381, 665026307, 666873276, 668379843, 669698775, 671361804, 673394620, 675311387, 676777840, 678095341, 679806709, 681781530, 683373570, 684433877, 685531855, 686976790, 688338637, 689021051, 688951850, 688606083, 688323855, 687808156, 686686337, 685393989, 684876859, 685581386, 687193513, 689437270, 692619324, 697118521, 702615678, 708258212, 713409901, 718030453, 722410858, 726380527, 729321420, 731148541, 732490182, 733579814, 733867049, 732840300, 730580509, 727566004, 724126935, 720172107]
830.1G20172107m572987m794956m349827l663242l451109l680170l532409k487481
846.4F89639926q27313J019121K999782N068839O973922Q307457Q733571Q435905Q001804
864.8G38353014P569194O652295N121410L560067K563476K132773J685918Q23974m8220
883.1G68413901l97384n21183j001060j653969j817644j111924P7486Q94487J044929
901.5G63927639J071870J348913J371860O22928o67572j831114k491355k947509l555656
919.8G56850004l953695l429532k033532o43790Q9825L67403P49826J206458J138448
938.2G50341415M76540p6116j00195p7963p18117j958310l057361l665686m371404
956.6G36792803n743146p433355q855462j0040343j1438668j3099968j4325202j4335632
$$ y = [720172107, 715599120, 710804164, 706454337, 702791095, 699339986, 695659816, 692127407, 689639926, 688812613, 689831734, 692831516, 697900355, 704874277, 713181734, 721915305, 730351210, 738353014, 745922208, 752574503, 757695913, 761255980, 763819456, 765952229, 767638147, 768462121, 768413901, 768016517, 767495334, 766494274, 764840305, 763022661, 761910737, 761988223, 762882710, 763927639, 764999509, 766348422, 767720282, 768343210, 767675638, 765844524, 763353169, 760405660, 756850004, 752896309, 749466777, 747433245, 746789455, 746879280, 747246683, 747996509, 749202967, 750341415, 750817955, 750741839, 750641644, 750563681, 749845564, 747887254, 744829893, 741164207, 736792803, 731049657, 723616302, 714760840, 704720497, 693281829, 680181861, 665856659, 651521027]
972.9F51521027j3131916j1477948j0031223q761704p489383o432831n798400n432606
989.2E82965016m943490m132926l297567k818525k667010k495945k250969k444267
1005.5E57914317l401518m697919n726397o220460o317437o285429o147444n752444
1021.8E13365269n142868m676044m540384m460007m147917l666013l255725l004253
1038.1D80472058k746582k371907k050787k024621k149552j972169j180857J81436
1054.5D66157019J644880K722293L291845L338963K599835R81838j016051k645999
1070.8D77074623l403813l404378l166974k915144k536714k210110k324671k843499
1087.1D54269320l259123l060132k087057p08192N57780J545042K249330K607912K504289
$$ y = [651521027, 638389111, 626911163, 616879940, 608118236, 600628853, 594196022, 588397622, 582965016, 578021526, 573888600, 570591033, 567772508, 565105498, 562609553, 560358584, 557914317, 554512799, 549814880, 544088483, 537868023, 531550586, 525265157, 519117713, 513365269, 508222401, 503546357, 499005973, 494545966, 490398049, 486732036, 483476311, 480472058, 477725476, 475353569, 473302782, 471278161, 469128609, 467156440, 465975583, 466157019, 467801899, 470524192, 473816037, 477155000, 479754835, 480736673, 479720622, 477074623, 473670810, 470266432, 467099458, 464184314, 461647600, 459437490, 457112819, 454269320, 451010197, 447950065, 445863008, 445154816, 445712596, 447257638, 449506968, 452114880, 454619169]
1105.4D54619169K047688J552403J095116M47780o81162k427369m374981n268157l937184
1123.8D43073303j217008Q82387J891702J819045Q33064M82887J442343K696276L355592
1142.2D55259591L264666K683878K116591J951486K129644K430051K845705L544003
1158.5D76225615M576563N798102P002681Q065373Q928061R494960R612560R240866
1174.8E38944781Q570969P862031P129610O091475M611075K889097J148760n08487
1191.1E76739311j922905k770126k761245j920462o53326N30958J307845J584292J376867
1209.5E71511209P58171j6212o02186q33988q20101p59184o66499m12405L7074N34356
1229.9E68730235R21488J183212J426100J696706J869381J801610J532316J218736
$$ y = [454619169, 456666857, 458219260, 459314376, 459762156, 459080994, 456653625, 452278644, 447010487, 443073303, 441856295, 442738682, 444630384, 446449429, 447282493, 447765380, 449207723, 451903999, 455259591, 458524257, 461208135, 463324726, 465276212, 467405856, 469835907, 472681612, 476225615, 480802178, 486600280, 493602961, 501668334, 510596395, 520091355, 529703915, 538944781, 547515750, 555377781, 562507391, 568598866, 573209941, 576099038, 577247798, 576739311, 574816406, 572046280, 569285035, 567364573, 566711247, 567242205, 568550050, 570134342, 571511209, 572269380, 572253168, 571650982, 570816994, 569996893, 569237709, 568571210, 568158805, 568195879, 568730235, 569651723, 570834935, 572261035, 573957741, 575827122, 577628732, 579161048, 580379784]
1246.2E80379784R17077N91397K58804M6789J20342M97520J046717J662374K339005
1264.5E87859809L054500L713608M283190M716634N014062N264640N444050N546331
1280.8F24896824N632162N710364N782902N755067N501449N087435M672826M310548
1297.2F67349577L928721L510892L138900K846480K584517K277433J918853J623690
1313.5F89179063J457631J407326J425862J434386J429319J384020J225710R28461
1329.8F99871778N16475Q6367j84000j90854L1591K98142M56393N60641N91815M83393
1350.2G02521741K74539P8798r6560m50849j040757j534402j627386j548290j536668
1368.5F95040166j668930k010703k153814j695811j085639r36985j242519j355588
$$ y = [580379784, 581296861, 581888258, 582147062, 582193851, 582314193, 582811713, 583858430, 585520804, 587859809, 590914309, 594627917, 598911107, 603627741, 608641803, 613906443, 619350493, 624896824, 630528986, 636239350, 642022252, 647777319, 653278768, 658366203, 663039029, 667349577, 671278298, 674789190, 677928090, 680774570, 683359087, 685636520, 687555373, 689179063, 690636694, 692044020, 693469882, 694904268, 696333587, 697717607, 698943317, 699871778, 700388253, 700474620, 700290620, 700099766, 700131357, 700429499, 700885892, 701446533, 702038348, 702521741, 702796280, 702875078, 702778518, 702327669, 701286912, 699752510, 698125124, 696576834, 695040166, 693371236, 691360533, 689206719, 687510908, 686425269, 685488284, 684245765, 682890177]
1384.9F82890177j037717q16226j040042j446664j637578j674533j980543k423108
1401.2F70833766k854228l078162k850592k613247k461552k172828j900792j680672
1417.5F51221693j126469n75900m61101l75271l50833m20630l94404l74913j4484Q39353
1437.9F47967041J050472Q28862P45296Q90375J304865J618087J552760J707197L576517
1456.2F61241472O503224O293357N338251O038010P111550P283210P975340R788931
1472.6G17573345R624541P410883N524397M078091K969145J787961N49078l61502p73907
1490.9G48382032j227617k149701l040731l269256l379881l883243n202591o319642
1507.2G19909370m880190m157126m549742m587054m040122l313720k925575k373516
$$ y = [682890177, 681852460, 681036234, 679996192, 678549528, 676911950, 675237417, 673256874, 670833766, 667979538, 664901376, 662050784, 659437537, 656975985, 654803157, 652902365, 651221693, 650095224, 649519324, 649058223, 648682952, 648332119, 647911489, 647517085, 647142172, 647127688, 647967041, 649017513, 649846375, 650591671, 651482046, 652786911, 654404998, 655957758, 657664955, 661241472, 667744696, 674038053, 679376304, 685414314, 692525864, 699809074, 707784414, 717573345, 727197886, 734608769, 740133166, 744211257, 747180402, 748968363, 749517441, 749155939, 748382032, 747154415, 745004714, 741963983, 738694727, 735314846, 731431603, 726229012, 719909370, 715029180, 710872054, 706322312, 701735258, 697695136, 694381416, 691455841, 689082325]
1523.6F89082325k121330k276063k180576k162635k045632j698673j910209k085090
1539.9F72602117q86917J80125L70741L43502N64515R94921J104653P11620R38654
1558.2F76923931K265632J645624L31462n94318j490831k067209k453625l525019m927575
1576.6F66108072m998028n038381n887449o573617p055462p396340p613242p744074
1592.9F13801479p892549p845759p671714p610321p576764p478952p436931p474661
1609.2E52813828p311821p065654p451892p799744o277085n504548n875468n399526
1625.5E00128090m678070m122138l388316k931118k268344o30736M38690Q74072J219124
1643.9D84641254K126545L185600K798229L323943N836069N507291M602491N017817
$$ y = [689082325, 686960995, 684684932, 682504356, 680341721, 678296089, 676597416, 674687207, 672602117, 671715200, 671895325, 672266066, 672609568, 673174083, 674169004, 675273657, 675985277, 676923931, 679189563, 680835187, 681166649, 680572331, 679081500, 677014291, 674560666, 671035647, 666108072, 661110044, 656071663, 650184214, 643610597, 636555135, 629158795, 621545553, 613801479, 605908930, 598063171, 590391457, 582781136, 575204372, 567725420, 560288489, 552813828, 545502007, 538436353, 530984461, 523184717, 516907632, 511403084, 505527616, 500128090, 495450020, 491327882, 487939566, 485008448, 482740104, 482109368, 482548058, 483422130, 484641254, 486767799, 489953399, 492751628, 496075571, 501911640, 507418931, 512021422, 517039239]
1660.2E17039239O051243O742298O204725O602466P845759P523000P855595Q788406
1676.5E74652731P938028O934106P651031J0531187J0195673Q301854Q269906P614136
1692.8F42088652P981538Q867860R236157J1046410R588182P793426P680416O504894
1709.2G10787535N297422M523337M168570M756570M924357L988504L431618L261209
1725.5G45139122K892733K652049K602994L625095M445016L532827L511370M068911
1741.8G72470117L959536L565252L317833L733993M225909L523171K741218K494812
1758.1H00031841K314448K451003K254426J581431J243114J301527J766384K058923
1774.4H15003097J619935J297057J363396J394093J269579J154483R06467P76589J211643
$$ y = [517039239, 523090482, 529832780, 536037505, 542639971, 550485730, 558008730, 565864325, 574652731, 582590759, 589524865, 597175896, 607707083, 617902756, 626204610, 634474516, 642088652, 650070190, 658938050, 668174207, 679220617, 688808799, 696602225, 704282641, 710787535, 716084957, 720608294, 724776864, 729533434, 734457791, 738446295, 741877913, 745139122, 748031855, 750683904, 753286898, 756911993, 761357009, 764889836, 768401206, 772470117, 776429653, 779994905, 783312738, 787046731, 791272640, 794795811, 797537029, 800031841, 802346289, 804797292, 807051718, 808633149, 809876263, 811177790, 812944174, 815003097, 816623032, 817920089, 819283485, 820677578, 821947157, 823101640, 824008107, 824784696, 825996339]
1792.8H25996339J368821R86278Q07524R96828J115978R24527O83129O25432P70032
1811.1H34274888Q06987O54459N92232O49870N16891K76148K77162L79682N48303Q16643
1831.5H39793265P12335M44949M34219L87729J11699J10984N62429P15733N74588M39764
1851.9H44287694L32772L01481L04520L10123K59339J03295p9870N7221M74751N27322
1872.3H46878648L02493K29240K58267K03669J14381J01507R5546Q7977J81913J98483
1892.7H48652124J32680J42753J37032Q5175N8531Q0943Q4877M7088M8936N4895l1888
1915.1H49493146o1810M7028N0068P5221J85907J25706p331m5836O616M6253l2663
1937.6H49882305j99974k21014J2577J33395k3961j50740j03474l8624p3254j66714
$$ y = [825996339, 827365160, 828351438, 829158962, 830155790, 831271768, 832196295, 832879424, 833504856, 834274888, 835081875, 835736334, 836328566, 836978436, 837495327, 837771475, 838048637, 838428319, 838976622, 839793265, 840505600, 840950549, 841384768, 841772497, 841884196, 841995180, 842557609, 843273342, 843847930, 844287694, 844620466, 844921947, 845226467, 845536590, 845795929, 845899224, 845819354, 845876575, 846351326, 846878648, 847181141, 847410381, 847668648, 847872317, 847986698, 848088205, 848183751, 848271728, 848453641, 848652124, 848784804, 848927557, 849064589, 849149764, 849208295, 849289238, 849374115, 849421203, 849470139, 849525034, 849493146, 849431336, 849478364, 849528432, 849603653, 849789560, 849915266, 849907935, 849862099, 849868715, 849914968, 849882305, 849682331, 849461317, 849473894, 849607289, 849583328, 849432588, 849329114, 849290490, 849217236, 849050522]
1958H49050522j81735j07586r0599j50860j59561j01566k8611J610r1732j86860j43946
1980.4H47809076l4749l1591j67668k83241j98841L3617M9412j86622k62201r4294
2000.8H46632898k802j35064l21746k97248q9109l1650k25961l45588j93119k3484
2021.2H44967127o9797k43843k87115j49846l4988q5473k36392k87056j24634K5153
2041.6H43473136r9241k80440k17498k0146K9028j18018k47895j72675r596m053j63377
2064H42169225k40624p8797J06335M0769j65105j80781J2756J27613j311j64926j09792
2086.5H41515362M4585O6936o3837j32263M77J45078R2566o9797j27256j4424J11341
2108.9H41568768O1095m8876k2471N9247P1883M7207M7386R3937J33216J22309Q0705
$$ y = [849050522, 848868787, 848761201, 848670602, 848519742, 848360181, 848258615, 848230004, 848231614, 848139882, 847953022, 847809076, 847774327, 847742736, 847575068, 847291827, 847092986, 847126603, 847176015, 846989393, 846727192, 846632898, 846630096, 846495032, 846173286, 845876038, 845786929, 845755279, 845529318, 845183730, 844990611, 844967127, 844897330, 844653487, 844366372, 844216526, 844181538, 844096065, 843859673, 843572617, 843447983, 843473136, 843373895, 843093455, 842875957, 842855811, 842884839, 842766821, 842518926, 842346251, 842336655, 842332602, 842169225, 841928601, 841849804, 841956139, 841996908, 841831803, 841651022, 841663778, 841791391, 841790080, 841625154, 841515362, 841559947, 841626883, 841563046, 841430783, 841431260, 841576338, 841668904, 841599107, 841471851, 841457427, 841568768, 841629863, 841580987, 841558516, 841617763, 841689646, 841736853, 841784239, 841878176, 842011392, 842133701, 842214406]
2131.3H42214406M5239O3360R5964Q3863O5029J03653J58727J40428R4056J05679J33753
2153.8H43304157J35660J08660Q2016J08123J20222P4387N8949J21116J99855K09212
2174.2H44522357J31905P6532J14024J49310R6440L6657R2626J84416J43290Q94n5134
2196.6H45493317M0531J50561J07885k5213k8074R5427J62423P0870p2897n1916J27495
2219H46070409J80900r954j54436k8550J76489J39892j12891k06471p212J82569P4268
2241.5H46305013j98007k30193K8133J76609J3590k04027j63615R5666J85787n0902
2261.9H45958054k42770r4175J73330J60873j14798k05279N6148K93910J85371r2149
2282.3H46078515j71781J7584J92463N0187k01642j50323J12057J79052o0678k66671
$$ y = [842214406, 842259645, 842323005, 842418969, 842502832, 842567861, 842671514, 842830241, 842970669, 843064725, 843170404, 843304157, 843439817, 843548477, 843630493, 843738616, 843858838, 843933225, 843992174, 844113290, 844313145, 844522357, 844654262, 844730794, 844844818, 844994128, 845090568, 845127225, 845219851, 845404267, 845547557, 845548451, 845493317, 845533848, 845684409, 845792294, 845767081, 845739007, 845834434, 845996857, 846067727, 845994830, 845942914, 846070409, 846251309, 846241355, 846086919, 846058369, 846234858, 846374750, 846261859, 846055388, 846048176, 846230745, 846305013, 846107006, 845876813, 845904946, 846081555, 846095145, 845891118, 845727503, 845823169, 846008956, 845958054, 845715284, 845621109, 845794439, 845955312, 845840514, 845635235, 845691383, 845985293, 846170664, 846078515, 845906734, 845924318, 846116781, 846166968, 845965326, 845815003, 845927060, 846106112, 846045434, 845778763]
2302.7H45778763j76012N1379P6354j39773k36690n8294O3241j18673l02196j85549
2323.1H44752550L0398R3580K6464q6903j13726K5272J09494l040o2346K32935O33180
2345.5H45637858L97742k42293n83470m63665j84297p6115p4566J16647L85046M63009
2365.9H45375896M47452M44591M59075N05685N20647M45425L22462K49326K66909K71082
2386.3H49308550J64807M769n6148J7703Q2373K4259o9618p1168J3471P6234j073j08182
2410.8H49385977o4969N4538P6234m3869j58786j18316J967J6153j13606k03312j13785
2433.2H48718226J430l9339j72257k06232p8976L9279l1769k06590k36690r9778j3769
2455.6H47673535q4817j94252j83940p3432l2187j32978k31862j71185m7147o7353
$$ y = [845778763, 845602751, 845654130, 845730484, 845590711, 845354021, 845295727, 845358968, 845240295, 844938099, 844752550, 844782948, 844876528, 844902992, 844816089, 844702363, 844727635, 844837129, 844834089, 844771743, 845004678, 845637858, 846035600, 845793307, 845209837, 844746172, 844561875, 844485760, 844411194, 844527841, 844912887, 845375896, 845823348, 846267939, 846727014, 847232699, 847753346, 848198771, 848521233, 848770559, 849037468, 849308550, 849473357, 849478126, 849421978, 849439681, 849522054, 849546313, 849476695, 849405527, 849418998, 849495232, 849494159, 849385977, 849321008, 849375546, 849451780, 849407911, 849249125, 849130809, 849132776, 849148929, 849035323, 848832011, 848718226, 848719656, 848680317, 848508060, 848301828, 848222852, 848262131, 848230362, 848023772, 847787082, 847687304, 847673535, 847588718, 847394466, 847210526, 847137094, 847104907, 846971929, 846740067, 846568882, 846521735, 846454382]
2476H46454382k10047k60889j48952o0618j29462k20298j84179p5519m0769j26183
2496.4H44997466k34545k28047q6546j8537j49548k74658k04087p1227q4162j90079
2516.8H43456030k15292j34826p2241j13308j98364k13623j31250p4446j47402k18869
2537.2H41936409j63912j08183j36673j67132j47402j21534j36614j68383k00331k24888
2557.6H40361357k05755j67430j67429j98841k27988k26259k17200k42650k71559k76029
2578H38160217k53976k36868k71380l28303l35634k96354k82168l25024l74377l67284
2598.4H35088849l39091l58104l92735l84748l70682l83615l94643m01198m14432m18722
2618.8H31230879m00067l78549l80158m06683m31954m19915l94821l86358l90112l82125
$$ y = [846454382, 846244335, 845983446, 845834494, 845773876, 845644414, 845424116, 845239937, 845164418, 845123649, 844997466, 844762921, 844534874, 844448328, 844429791, 844280243, 844005585, 843801498, 843730271, 843646109, 843456030, 843240738, 843105912, 843033671, 842920363, 842721999, 842508376, 842377126, 842302680, 842155278, 841936409, 841772497, 841664314, 841527641, 841360509, 841213107, 841091573, 840954959, 840786576, 840586245, 840361357, 840155602, 839988172, 839820743, 839621902, 839393914, 839167655, 838950455, 838707805, 838436246, 838160217, 837906241, 837669373, 837397993, 837069690, 836734056, 836437702, 836155534, 835830510, 835456133, 835088849, 834749758, 834391654, 833998919, 833614171, 833243489, 832859874, 832465231, 832064033, 831649601, 831230879, 830830812, 830452263, 830072105, 829665422, 829233468, 828813553, 828418732, 828032374, 827642262, 827260137]
2639.2H27260137l57509l47257l56376l95775m36187m31180m14371l79801l25858l27945
2659.6H23487878l58462l93212m48168m28021l60250l25561k93731k99931l71575m39883
2680H19769084m65214m47094l96729l77059m09186m27186m06146m09246m41849m49538
2700.4H15539837m59492m99189m96924m68075n08607n73635n93603n79714n59450n40316
2720.8H10260832n04911m77254n02527n48184n51521m85302m02450m02153m40538m44531
2741.2H05501461m49538m44830m32670m77314n59449n82397n19991m87387n55277o20603
2761.6H00372005o33777o14345n83291o15597o79850p00414p25091p93278q49605q40425
2782G93336332p83026p50363q06153r05693r63151r70543r56892r83179j068890j125396
$$ y = [827260137, 826902628, 826555371, 826198995, 825803220, 825367033, 824935853, 824521482, 824141681, 823815823, 823487878, 823129416, 822736204, 822288036, 821860015, 821499765, 821174204, 820880473, 820580542, 820208967, 819769084, 819303870, 818856776, 818460047, 818082988, 817673802, 817246616, 816840470, 816431224, 815989375, 815539837, 815080345, 814581156, 814084232, 813616157, 813107550, 812533915, 811940312, 811360598, 810801148, 810260832, 809755921, 809278667, 808776140, 808227956, 807676435, 807191133, 806788683, 806386530, 805945992, 805501461, 805051923, 804607093, 804174423, 803697109, 803137660, 802555263, 802035272, 801547885, 800992608, 800372005, 799738228, 799123883, 798540592, 797924995, 797245145, 796544731, 795819640, 795026362, 794176757, 793336332, 792553306, 791802943, 790996790, 790091097, 789127946, 788157403, 787200511, 786217332, 785148442, 784023046]
2802.3G84023046j142859j181483j239360j295387j325727j332998j377762j491487
2818.7G73635983j590728j628101j738787j998305k279341k531112k853810l367961
2835G55647838m163086n215586o315946p355034q509636r590447r704590q054376m824221
2853.3F91914916j129866J697302K852381K513647J356780r5427j354575j864433j401365
2871.7F94489360m81725J15991J45972k30611q68857j646816k412796l006578l355622
2890.1F82748318l506124l572643l688276l850341l944278m009127m236639m725098
2906.4F51215792n465567o450355p682205q988797r858549r735703q385778n894840
2922.7E88753998k651095O80387L441214N308152O429851P039189P160485O867528
$$ y = [784023046, 782880187, 781698704, 780459344, 779163957, 777838230, 776505232, 775127470, 773635983, 772045255, 770417154, 768678367, 766680062, 764400721, 761869609, 759015799, 755647838, 751484752, 746269166, 739953220, 732598186, 724088550, 714498103, 704793513, 696739137, 691914916, 690785050, 692482352, 695334733, 697848380, 699205160, 699109733, 697755158, 695890725, 694489360, 694007635, 694123626, 694269598, 694038987, 693170130, 691523314, 689110518, 686103940, 682748318, 679242194, 675669551, 671981275, 668130934, 664186656, 660177529, 655940890, 651215792, 645750225, 639299870, 631617665, 622628868, 612770319, 603034616, 594648838, 588753998, 586102903, 586783290, 590224504, 595532656, 601962507, 609001696, 616162181, 623029709]
2939F23029709O218135N098641L525555J784981L24666m90725o32346j72197P75039
2957.4F39461458J893162K885938L567755L930033M097938M107654M020512L893674
2973.7F67858124L672778L495157L423095L180921K744734K353430K075434J860559
2990F90664232J560867J060366N73635K51115J251j91748l76403n26965n07593m27246
3010.4F92081511n67138r04381j125932j124323j105010j212001j381040j473307j411438
3028.7F81776941j345575j408637j556873j659691j579285j502633j668453j897991
3045.1F69157803j934349j819313j799047j918674j942277j848816j810909j812637
3061.4F54271781j778245j685559j603246j662076j773715j737952j558721j451254
$$ y = [623029709, 629247844, 634346485, 637872040, 639657021, 639981687, 639490962, 638858616, 638686419, 639461458, 641354620, 644240558, 647808313, 651738346, 655836284, 659943938, 663964450, 667858124, 671530902, 675026059, 678449154, 681630075, 684374809, 686728239, 688803673, 690664232, 692225099, 693285465, 693859100, 694110215, 694111466, 693919718, 693543315, 693016350, 692508757, 692081511, 691514373, 690609992, 689484060, 688359737, 687254727, 686042726, 684661686, 683188379, 681776941, 680431366, 679022729, 677465856, 675806165, 674226880, 672724247, 671055794, 669157803, 667223454, 665404141, 663605094, 661686420, 659744143, 657895327, 656084418, 654271781, 652493536, 650807977, 649204731, 647542655, 645768940, 644030988, 642472267, 641021013]
3077.7F41021013j593411j814723j864195j776635j689255j735449j925290k010226
3094F26611829j865685j720607j830876k092123k155841k008676j981855k164364k237379
3112.4F08554423k091468k037405k211094k480448k645492k590955k466321k463519
3128.7E89567721k583504k654493k582371k521872k628029k826273k899707k846062
3145E68025410k803624k767682k763688k882600l073871l164411l133714l047943k961814
3163.4E41426063k979339l082931l143072l101110l034771l056705l130018l125132
3179.7E16772985l074765l053665l051281l042936l015101l031314l090411l111631
3196D92301881l083527l017396k938210k901227k903998k916485k914786k870083k805769
$$ y = [641021013, 639427602, 637612879, 635748684, 633972049, 632282794, 630547345, 628622055, 626611829, 624746144, 623025537, 621194661, 619102538, 616946697, 614938021, 612956166, 610791802, 608554423, 606462955, 604425550, 602214456, 599734008, 597088516, 594497561, 592031240, 589567721, 586984217, 584329724, 581747353, 579225481, 576597452, 573771179, 570871472, 568025410, 565221786, 562454104, 559690416, 556807816, 553733945, 550569534, 547435820, 544387877, 541426063, 538446724, 535363793, 532220721, 529119611, 526084840, 523028135, 519898117, 516772985, 513698220, 510644555, 507593274, 504550338, 501535237, 498503923, 495413512, 492301881, 489218354, 486200958, 483262748, 480361521, 477457523, 474541038, 471626252, 468756169, 465950400]
3214.3D65950400k773852k782851k755493k728283k765328k733767k603710k490997
3230.7D44316119k485186k624750k677172k494514k362997k389759k357214k268434
3247D24656093k298742k333820k225906k141714k173007k174079k106816k071917k080977
3265.3D05049115k036660j933188j935541k050668k075255j997739j943559j925766
3281.6C89150739j927674j926750j875013j811773j834064j904190j939207j977146
3298C73954922k005369j918345j744092j732290j955181k157271k169460k039909j943171
3316.3C56289834j961678j989484j968712j952469j992554k064347k079636k011865
3332.6C40269089j931966j878142j889259j996338k065390k050698j984805j865983
$$ y = [465950400, 463176548, 460393697, 457638204, 454909921, 452144593, 449410826, 446807116, 444316119, 441830933, 439206183, 436529011, 434034497, 431671500, 429281741, 426924527, 424656093, 422357351, 420023531, 417797625, 415655911, 413482904, 411308825, 409202009, 407130092, 405049115, 403012455, 401079267, 399143726, 397093058, 395017803, 393020064, 391076505, 389150739, 387223065, 385296315, 383421302, 381609529, 379775465, 377871275, 375932068, 373954922, 371949553, 370031208, 368287116, 366554826, 364599645, 362442374, 360272914, 358233005, 356289834, 354328156, 352338672, 350369960, 348417491, 346424937, 344360590, 342280954, 340269089, 338337123, 336458981, 334569722, 332573384, 330507994, 328457296, 326472491, 324606508]
3348.9C24606508j881719k040445k081335j931340j773536j748681j741498j626701
3365.3C09781253j550913j670509j834452j770467j516878j335919j271844j215369
3381.6B97614902j083553r40978p90566n67943n47499p99209q20100m30137j81019
3399.9B91453898m23968o96272n16682j91808n5760q136k1249n3347K7985J90675L53098
3422.4B90058434N20140O92338Q26537Q36641R08434J081556R73732O90132P58320
3440.7B97346264J130074J377792J453995J481891J552939J685530J793087J885533
3457C09707105J997709J994521K005070K255023K447009K240509J895606J905829K177268
3475.4C28625649K445102K542019K403706K364487K537906K595097K545505K622456
$$ y = [324606508, 322724789, 320684344, 318603009, 316671669, 314898133, 313149452, 311407954, 309781253, 308230340, 306559831, 304725379, 302954912, 301438034, 300102115, 298830271, 297614902, 296531349, 295590371, 294799805, 294231862, 293684363, 292885154, 292065054, 291634917, 291453898, 291029930, 290333658, 289816976, 289625168, 289569408, 289561272, 289540023, 289486676, 289514661, 289705336, 290058434, 290578574, 291270912, 292097449, 292934090, 293842524, 294924080, 295897812, 296587944, 297346264, 298476338, 299854130, 301308125, 302790016, 304342955, 306028485, 307821572, 309707105, 311704814, 313699335, 315704405, 317959428, 320406437, 322646946, 324542552, 326448381, 328625649, 331070751, 333612770, 336016476, 338380963, 340918869, 343513966, 346059471, 348681927]
3491.7C48681927K781629K911151K861798K789944K884775K847582K666384K776623
3508C71201813L116906L347278L280550L057003L041655L241479L513843L535688L343671
3526.4D00679886L402680L614903L696769L804148L893792L772319L793776M064083
3542.7D30722356M262119M138232L924131M049152M356831M417003M386693M536062
3559D64792579M588873M359483M401297N239963N704105N220950M971653N194247N400240
3577.4E09873390N557955N609631N366564N335033N931258O209552N766571N737483
3593.7E55387437O100715O237924O256640O202697N847633N566240O005048O434441
3610F04038775O322205O124675N798459O086529O841600O297350N033075M587353N953967
$$ y = [348681927, 351463556, 354374707, 357236505, 360026449, 362911224, 365758806, 368425190, 371201813, 374318719, 377665997, 380946547, 384003550, 387045205, 390286684, 393800527, 397336215, 400679886, 404082566, 407697469, 411394238, 415198386, 419092178, 422864497, 426658273, 430722356, 434984475, 439122707, 443046838, 447095990, 451452821, 455869824, 460256517, 464792579, 469381452, 473740935, 478142232, 483382195, 489086300, 494307250, 499278903, 504473150, 509873390, 515431345, 521040976, 526407540, 531742573, 537673831, 543883383, 549649954, 555387437, 561488152, 567726076, 573982716, 580185413, 586033046, 591599286, 597604334, 604038775, 610360980, 616485655, 622284114, 628370643, 635212243, 641509593, 646542668, 651130021, 657083988]
3628.4F57083988P157803O045997N295753N236090N126893N044162M629255L827154
3644.7F99447095L598869M891515N811811M504263L610849M177034M271865L592849
3661G33906150L047883K529145K061486K360284K775610K173483K499521L333211K801776
3679.4G57488549K241790J848936J383782J536905K217770K304912J856684J459241
3695.7G72338569J178205J111388J373411J381754Q05319L22461N26369J379788J648902
3714G82066166J088322O30140N05030N42045N91635P13349O16967K01524M8876N25295
3734.4G87529349J268864J124918N2631m49895L94582P30396J17421O32286J406133
3752.8G92806685R02772L30031M73797P20382M46021J40906J10984M17947P90179N78523
$$ y = [657083988, 664241791, 670287788, 675583541, 680819631, 685946524, 690990686, 695619941, 699447095, 703045964, 707937479, 713749290, 718253553, 721864402, 726041436, 730313301, 733906150, 736954033, 739483178, 741544664, 743904948, 746680558, 748854041, 751353562, 754686773, 757488549, 759730339, 761579275, 762963057, 764499962, 766717732, 769022644, 770879328, 772338569, 773516774, 774628162, 776001573, 777383327, 778188646, 778511107, 779037476, 780417264, 782066166, 783154488, 783784628, 784289658, 784831703, 785423338, 786136687, 786753654, 786955178, 787004054, 787529349, 788798213, 789923131, 789975762, 789525867, 789920449, 790650845, 790768266, 791400552, 792806685, 793709457, 794039488, 794513285, 795233667, 795679688, 795820594, 795931578, 796349525, 797139704, 797718227]
3773.2G97718227J56760J05620L48687L80456J55032K22802M46498M18485J58727j57595
3793.6G99953699k05040j54734j87397K36452M60684L64066P00175N30839j80065m91381
3814H01027298j47939R954L3021O55413O39737J71065J1861j09613j49369j85490j91271
3836.4H01764667J36495M68015N49555N41747J79112o09637j292467n80311J289547
3854.8H02446723J166463J19626l41594k09033J56164j5915j59680K88486M66824K74241
3875.2H04192305j39892l44396k1994J26123K68400K70009j01864N4121L21328j20342
3895.5H04503798o04867n40793p4208M57227P01129M55142J45793J3470j73032k88546
3915.9H04595113p3075J36971M9353j014O4612l8743r9302J46926L36766J82390p3790
$$ y = [797718227, 797874987, 797980607, 798329294, 798709750, 798864782, 799087584, 799534082, 799952567, 800111294, 799953699, 799748659, 799593925, 799406528, 799642980, 800103664, 800467730, 801167905, 801698744, 801518679, 801027298, 800879359, 800889313, 800922334, 801577747, 802217484, 802388549, 802400410, 802290797, 802141428, 801955938, 801764667, 801901162, 802369177, 802918732, 803460479, 803639591, 803029954, 801737487, 801157176, 802446723, 803613186, 803732812, 803391218, 803182185, 803338349, 803322434, 803162754, 803451240, 803918064, 804192305, 804052413, 803708017, 803686023, 803812146, 804080546, 804350555, 804248691, 804302812, 804624140, 804503798, 803898931, 803358138, 803283930, 803741157, 804442286, 804897428, 805043221, 805056691, 804883659, 804595113, 804522038, 804659009, 804708362, 804707348, 804771960, 804733217, 804633915, 804780841, 805117607, 805299997, 805226207]
3938.4H05226207j79708o3598N9008M4048J08123K02656J36673K5571j4723l9458r835
3960.8H05494964Q5890J07706P5340P0095M5479L8623J08541J22845O4432M4346P1407
3983.2H06329668J09732Q3565K2591J5437K8730K9504P8976
3997.5H06698203
$$ y = [805226207, 805046499, 804982901, 805041909, 805085957, 805194080, 805396736, 805533409, 805558980, 805544257, 805504799, 805494964, 805580854, 805688560, 805763900, 805833995, 805879474, 805918097, 806026638, 806149483, 806213915, 806258261, 806329668, 806439400, 806522965, 806545556, 806560993, 806589723, 806619227, 806698203]
##END=$$ End of the data block
