##TITLE=$$ Begin of the data block
##JCAMP-DX=5.00 $$ ACD/SpecManager v 10.08
##SPECTROMETER/DATA SYSTEM=Alpha
##DATE=14 Apr 2014 11:23:48
##DATA TYPE=INFRARED SPECTRUM
##DATA CLASS=XYDATA
##ORIGIN=
##OWNER=
##NPOINTS=1765
##FIRSTX=399.75695801
##LASTX=3997.56933594
##MAXX=3997.56933594
##MINX=399.75695801
##MAXY=0.85030717
##MINY=0.28980246
##XFACTOR=1.0000000000
##YFACTOR=1.000000000000000e-9
##FIRSTY=0.63904268
##DELTAX=2.03957629
##XUNITS=1/CM
##YUNITS=ARBITRARY UNITS
##XYDATA=(X++(Y..Y))
$$ plain form
399.8 639042675 639031053 637164891 633974433 632165790 632040203 631383002 629457533 627215624 626065075
418.1 626065075 626509786 626435220 624923766 623448908 623226464 623558819 623136401 621623933 620148361
436.5 620148361 619805276 619836569 619294941 618612945 618536413 618962169 619030714 618235171 617282450 617145658
456.9 617145658 617304385 616434038 614810586 613647461 613331079 612994730 611662567 609885156 609052181
475.2 609052181 608929098 608286977 606968284 605819285 605481505 605618656 605219662 603986442 602896869
493.6 602896869 602504253 601932287 600483239 598685682 597590744 597367406 597075999 595986366 594454408
511.9 594454408 593353570 592764795 591763377 589915514 588036239 586868525 586081684 584822059 582976520
530.3 582976520 581431806 580832303 580538034 579566300 578271270 577665865 577620566 577284813 576215386
$$ packed form
399.8F39042675j1622j866162l190458j808643j25587o57201j925469k241909j150549
418.1F26065075M44711p4566j511454j474858k22444L32355m22418j512468j475572
436.5F20148361l43085L1293n41628o81996p6532M25756O8545p95543r52721j36792
456.9F17145658J58727q70347j623452j163125l16382l36349j332163j777411q32975
475.2F09052181j23083o42121j318693j148999l37780J37151l98994j233220j089573
493.6F02896869l92616n71966j449048j797557j094938k23338k91407j089633j531958
511.9E94454408j100838n88775j001418j847863j879275j167714p86841j259625j845539
530.3E82976520j544714n99503k94269r71734j295030o05405m5299l35753j069427
$$ plain form
548.6 576215386 574702084 573533058 572966874 572214365 570594251 568601608 567012787 565724492 563968003
567 563968003 561468184 558837831 556677282 554907382 552898049 550479829 548449337 547249675 546097279
585.4 546097279 544366121 542445660 540987909 540033519 538998187 537601471 536116958 534763932 533434689
603.7 533434689 532143354 531225085 531018794 531312287 531530738 531789720 533093452 535945594 539773107
622.1 539773107 543730319 547166169 550239623 553586364 557262838 560626209 563245356 565373659
638.4 565373659 567252398 568587601 569561541 571203947 573795021 576102436 576657116 575693846 575830996
656.7 575830996 579431474 585234404 590296328 593445182 595947325 599491000 602755189 605405092
673.1 605405092 608002186 610493958 613051116 615778804 618279934 620168090 621734142 623412013
$$ packed form
548.6E76215386j513302j169026n66184p52509j620114j992643j588821j288295j756489
567E63968003k499819k630353k160549j769900k009333k418220k030492j199662j152396
585.4E46097279j731158j920461j457751r54390j035332j396716j484513j353026j329243
603.7E33434689j291335r18269k06291K93493K18451K58982J303732K852142L827513
622.1E39773107L957212L435850L073454L346741L676474L363371K619147K128303
638.4E65373659J878739J335203R73940J642406K591074K307415N54680r63270J37150
656.7E75830996L600478N802930N061924L148854K502143L543675L264189K649903
673.1F05405092K597094K491772K557158K727688K501130J888156J566052J677871
$$ plain form
689.4 623412013 625078440 626279771 626899242 627275229 627899528 628935575 630150080 631359458 632778883
707.7 632778883 634701848 636947036 639087677 640914202 642655849 644799113 647380292 649900675
724 649900675 652158022 654384673 656788886 659108818 660899222 662243128 663651824 665414393 667215228
742.4 667215228 668701708 670044482 671668053 673623860 675505280 677006006 678356230 680028379
758.7 680028379 681981146 683645904 684776008 685823441 687128723 688381910 689061105 689077556 688819885
777.1 688819885 688553810 688020289 686919987 685664713 685145497 685795963 687332213 689570010 692829788
795.4 692829788 697394907 702927291 708572268 713659465 718204618 722562253 726551890 729521692
811.7 729521692 731354594 732586503 733482599 733702242 732711494 730481565 727506995 724117994 720236897
$$ packed form
689.4F23412013J666427J201331O19471L75987O24299J036047J214505J209378J419425
707.7F32778883J922965K245188K140641J826525J741647K143264K581179K520383
724F49900675K257347K226651K404213K319932J790404J343906J408696J762569J800835
742.4F67215228J486480J342774J623571J955807J881420J500726J350224J672149
758.7F80028379J952767J664758J130104J047433J305282J253187O79195J6451k57671
777.1F88819885k66075n33521j100302j255274n19216O50466J536250K237797L259778
795.4F92829788M565119N532384N644977N087197M545153M357635L989637K969802
811.7G29521692J832902J231909Q96096K19643r90748k229929k974570l389001l881097
$$ plain form
830.1 720236897 715749562 711029828 706705272 702972829 699411988 695718825 692284882 689834177
846.4 689834177 688972533 690011561 693035245 698064566 705011785 713358164 722145140 730569601 738481164
864.8 738481164 745994270 752693832 757881999 761480331 764020085 766043603 767692626 768601358 768600345
883.1 768600345 768148541 767536759 766480565 764811099 763015687 761941254 762024701 762932301 764036119
901.5 764036119 765113711 766383529 767707407 768317640 767604828 765721858 763261199 760416865 756902158
919.8 756902158 752900422 749410510 747356474 746744812 746855021 747212231 747983038 749205172 750316799
938.2 750316799 750765264 750674784 750566483 750466168 749729455 747786045 744739830 741054416 736678958
956.6 736678958 730982780 723577678 714666367 704557955 693129480 680080175 665768206 651439607
$$ packed form
830.1G20236897m487335m719734m324556l732443l560841l693163l433943k450705
846.4F89834177q61644J039028L023684N029321O947219Q346379Q786976Q424461P911563
864.8G38481164P513106O699562N188167L598332K539754K023518J649023R08732j013
883.1G68600345m51804o11782j056194j669466j795412j074433Q3447R07600J103818
901.5G64036119J077592J269818J323878O10233p12812j882970k460659k844334l514707
919.8G56902158m001736l489912k054036o11662J10209L57210P70807J222134J111627
938.2G50316799M48465r0480j08301j00315p36713j943410l046215l685414m375458
956.6G36678958n696178p405102q911311j0108412j1428475j3049305j4311969j4328599
$$ plain form
972.9 651439607 638355374 626918793 616877615 608069301 600542068 594100654 588308811 582893074
989.2 582893074 577979624 573847890 570478737 567587256 564926982 562465727 560194314 557694137
1005.5 557694137 554277062 549601376 543879271 537645221 531354904 525133729 519025087 513289154
1021.8 513289154 508171082 503541529 499054670 494615614 490468413 486805081 483553380 480566978
1038.1 480566978 477843583 475461930 473366380 471322745 469191462 467229009 466068447 466284811
1054.5 466284811 467920899 470625907 473943651 477280706 479827881 480763674 479728669 477106690
1070.8 477106690 473735064 470316589 467138410 464254588 461732060 459515303 457235247 454463333
1087.1 454463333 451232523 448162198 446041673 445312321 445901096 447489232 449751139 452338248 454825640
$$ packed form
972.9F51439607j3084233j1436581j0041178q808314p527233o441414n791843n415737
989.2E82893074m913450m131734l369153k891481k660274k461255k271413k500177
1005.5E57694137l417075m675686n722105o234050o290317o221175o108642n735933
1021.8E13289154n118072m629553m486859m439056m147201l663332l251701k986402
1038.1D80566978k723395k381653k095550k043635k131283j962453j160562K16364
1054.5D66284811J636088K705008L317744L337055K547175R35793j035005k621979
1070.8D77106690l371626l418475l178179k883822k522528k216757k280056k771914
1087.1D54463333l230810l070325k120525p29352N88775J588136K261907K587109K487392
$$ plain form
1105.4 454825640 456887484 458452016 459537119 459941864 459189564 456711501 452343047 447121650 443250090
1123.8 443250090 442076832 442919225 444749922 446572065 447436869 447939754 449389637 452101678 455476761
1142.2 455476761 458709568 461337686 463449091 465407699 467508942 469923943 472788692 476338416
1158.5 476338416 480893999 486671060 493664801 501719058 510638475 520147145 529775321 539002419
1174.8 539002419 547548056 555402875 562533259 568620801 573201358 576033831 577152550 576652110
1191.1 576652110 574753642 572016358 569308341 567438304 566779315 567276001 568580210 570179820 571552455
1209.5 571552455 572292447 572261512 571656823 570829391 569995046 569213510 568564653 568211973 568304718 568856180
1229.9 568856180 569763184 570933998 572374940 574088573 575947940 577747285 579318821 580579638
$$ packed form
1105.4D54825640K061844J564532J085103M04745p52300k478063m368454n221397l871560
1123.8D43250090j173258Q42393J830697J822143Q64804N02885J449883K712041L375083
1142.2D55476761L232807K628118K111405J958608K101243K415001K864749L549724
1158.5D76338416M555583N777061O993741Q054257Q919417R508670R628176R227098
1174.8E39002419Q545637P854819P130384O087542M580557K832473J118719n00440
1191.1E76652110j898468k737284k708017j870037o58989M96686J304209J599610J372635
1209.5E71552455P39992l0935o04689q27432q34345p81536o48857l52680R2745N51462
1229.9E68856180R07004J170814J440942J713633J859367J799345J571536J260817
$$ plain form
1246.2 580579638 581516981 582127333 582389534 582409620 582501173 582974851 583993375 585633039 587945282
1264.5 587945282 590979755 594700694 598983884 603680313 608674645 613925219 619355381 624877691
1280.8 624877691 630493104 636214614 642006993 647744775 653219044 658288836 662955582 667269170
1297.2 667269170 671218693 674768090 677937806 680788696 683371544 685662389 687616587 689286947
1313.5 689286947 690761387 692162573 693596601 695031226 696424603 697787702 699051857 700027168
1329.8 700027168 700557470 700645924 700448692 700225353 700248003 700566530 701026082 701561570 702146173 702650130
1350.2 702650130 702931702 702999473 702889800 702425182 701362073 699803650 698167682 696620405 695094705
1368.5 695094705 693441570 691423535 689258039 687583029 686529875 685610056 684369326 683010757
$$ packed form
1246.2E80579638R37343O10352K62201K0086R1553M73678J018524J639664K312243
1264.5E87945282L034473L720939M283190M696429M994332N250574N430162N522310
1280.8F24877691N615413N721510N792379N737782N474269N069792M666746M313588
1297.2F67269170L949523L549397L169716K850890K582848K290845J954198J670360
1313.5F89286947J474440J401186J434028J434625J393377J363099J264155R75311
1329.8G00027168N30302Q8454j97232k23339K2650L18527M59552N35488N84603N03957
1350.2G02650130K81572O7771j09673m64618j063109j558423j635968j547277j525700
1368.5F95094705j653135k018035k165496j675010j053154r19819j240730j358569
$$ plain form
1384.9 683010757 681966484 681151927 680129766 678698719 677065969 675381124 673382998 670958519
1401.2 670958519 668107450 665028095 662196875 659617543 657172799 654983699 653056383 651370049
1417.5 651370049 650237024 649636090 649164557 648812652 648498476 648093164 647690237 647307575 647286415 648123860
1437.9 648123860 649186373 650016189 650740862 651602864 652884841 654504716 656078041 657788217 661340117
1456.2 661340117 667846441 674173713 679524779 685560644 692674637 699955165 707922757 717711627
1472.6 717711627 727354109 734778762 740288138 744336367 747284234 749065101 749613523 749248862 748469830
1490.9 748469830 747250438 745101154 742027283 738750041 735409260 731553674 726353884 720018268
1507.2 720018268 715139151 711022854 706487179 701854765 697782516 694497108 691614568 689266920
$$ packed form
1384.9F83010757j044273q14557j022161j431047j632750j684845j998126k424479
1401.2F70958519k851069l079355k831220k579332k444744k189100j927316j686334
1417.5F51370049j133025o00934m71533l51905l14176m05312m02927l82662k1160Q37445
1437.9F48123860J062513Q29816P24673Q62002J281977J619875J573325J710176L551900
1456.2F61340117O506324O327272N351066O035865P113993P280528P967592R788870
1472.6G17711627R642482P424653N509376M048229K947867J780867N48422l64661p79032
1490.9G48469830j219392k149284l073871l277242l340781l855586n199790o335616
1507.2G20018268m879117m116297m535675m632414m072249l285408k882540k347648
$$ plain form
1523.6 689266920 687177718 684940696 682774127 680591643 678523958 676823378 674911380 672822833
1539.9 672822833 671950161 672155142 672562361 672950268 673537433 674514949 675592780 676300228 677241981
1558.2 677241981 679509521 681168437 681504309 680908442 679423988 677347481 674887359 671373308 666445315
1576.6 666445315 661440015 656388879 650484443 643909037 636882603 629530132 621922195 614148736
1592.9 614148736 606247842 598398924 590678096 583012640 575429916 567961633 560505569 552998960
1609.2 552998960 545684934 538626313 531151712 523325026 517034471 511489213 505565941 500156939
1625.5 500156939 495478839 491359204 487982124 485050231 482782662 482173264 482629865 483513296 484729648
1643.9 484729648 486851186 490058929 492885113 496229947 502102852 507636607 512232184 517245352
$$ packed form
1523.6F89266920k089202k237022k166569k182484k067685j700580j911998k088547
1539.9F72822833q72672K04981M07219L87907N87165R77516J077831P07448R41753
1558.2F77241981K267540J658916L35872n95867j484454k076507k460122l514051m927993
1576.6F66445315n005300n051136n904436o575406p026434p352471p607937p773459
1592.9F14148736p900894p848918p720828p665456p582724p468283p456064p506609
1609.2E52998960p314026p058621p474601p826686o290555n545258n923272n409002
1625.5E00156939m678100m119635l377080k931893k267569o09398M56601Q83431J216352
1643.9D84729648K121538L207743K826184L344834N872905N533755M595577N013168
$$ plain form
1660.2 517245352 523331046 530106366 536292911 542865992 550738931 558301151 566153288 574938595
1676.5 574938595 582900047 589848578 597480774 608001173 618215144 626510799 634756863 642352760
1692.8 642352760 650304556 659124732 668321669 679381967 688994050 696752429 704418063 710974514
1709.2 710974514 716318905 720864654 725025356 729748487 734673321 738690555 742151439 745426595
1725.5 745426595 748314977 750959277 753547609 757169306 761646152 765207052 768718898 772749901
1741.8 772749901 776658058 780210257 783546448 787298083 791538179 795064688 797805786 800311565
1758.1 800311565 802643120 805099785 807337463 808900356 810146272 811467648 813241303 815281868
1774.4 815281868 816881895 818178236 819561362 820986331 822272718 823416054 824318707 825101912 826289117
$$ packed form
1660.2E17245352O085694O775320O186545O573081P872939P562220P852137Q785307
1676.5E74938595P961452O948531P632196J0520399J0213971Q295655Q246064P595897
1692.8F42352760P951796Q820176R196937J1060298R612083P758379P665634O556451
1709.2G10974514N344391M545749M160702M723131M924834M017234L460884L275156
1725.5G45426595K888382K644300K588332L621697M476846L560900L511846M031003
1741.8G72749901L908157L552199L336191L751635M240096L526509K741098K505779
1758.1H00311565K331555K456665K237678J562893J245916J321376J773655K040565
1774.4H15281868J600027J296341J383126J424969J286387J143336R02653P83205J187205
$$ plain form
1792.8 826289117 827636421 828640878 829474449 830478430 831590176 832512558 833205044 833843291 834604263
1811.1 834604263 835396111 836062372 836674452 837316036 837800503 838058054 838356912 838752210 839295030 840138614
1831.5 840138614 840887845 841342688 841768205 842130244 842199564 842279375 842850924 843584180 844159663 844596922
1851.9 844596922 844934523 845239460 845538974 845831096 846066833 846165597 846105158 846192539 846677780 847180188
1872.3 847180188 847452998 847673059 847929060 848135173 848265111 848380744 848478675 848552823 848714113 848900557
1892.7 848900557 849050343 849242806 849408507 849481523 849522233 849590540 849665344 849715590 849761546 849796176 849749684
1915.1 849749684 849678934 849731326 849807322 849898160 850112379 850295365 850307167 850230694 850207388 850237787 850201547
1937.6 850201547 850006878 849777997 849767208 849898517 849895000 849755466 849648416 849609375 849544764 849376798
$$ packed form
1792.8H26289117J347304J004457Q33571J003981J111746R22382O92486O38247P60972
1811.1H34604263P91848O66261O12080O41584M84467K57551K98858L95298N42820Q43584
1831.5H40138614P49231M54843M25517L62039O9320P9811N71549P33256N75483M37259
1851.9H44596922L37601L04937K99514K92122K35737R8764o0439Q7381M85241N02408
1872.3H47180188K72810K20061K56001K06113J29938J15633R7931P4148J61290J86444
1892.7H48900557J49786J92463J65701P3016M0710O8307P4804N0246M5956L4630m6492
1915.1H49749684p0750N2392P5996R0838K14219J82986J1802p6473k3306L0399l6240
1937.6H50201547j94669k28881j0789J31309l517j39534j07050l9041o4611j67966
$$ plain form
1958 849376798 849195600 849114358 849043250 848881066 848697364 848577738 848559856 848589003 848490834 848278642 848156452
1980.4 848156452 848181427 848170340 847954690 847620547 847418189 847460628 847516477 847336233 847059727 846952796
2000.8 846952796 846968889 846865773 846564531 846269965 846165001 846107781 845879614 845564008 845379949 845335007
2021.2 845335007 845262647 845028639 844734967 844576538 844542265 844445348 844181061 843883753 843772471 843810320
2041.6 843810320 843727112 843454659 843230546 843222082 843253672 843102515 842835546 842672229 842672646 842667758 842508972
2064 842508972 842283547 842206955 842302442 842347383 842207253 842043281 842037916 842125297 842108548 841963589 841865599
2086.5 841865599 841907978 841992974 841957211 841826081 841789663 841887951 841964543 841921031 841840625 841848850 841945887
2108.9 841945887 842001319 841957271 841930032 842011869 842122853 842171192 842184782 842247069 842376709 842493832 842538238
$$ packed form
1958H49376798j81198q1242p1108j62184j83702j19626j7882K9147r8169k12192j22190
1980.4H48156452K4975j1087k15650l34143k02358M2439N5849j80244k76506j06931
2000.8H46952796J6093j03116l01242k94566j04964n7220k28167l15606j84059m4942
2021.2H45335007p2360k34008k93672j58429l4273r6917k64287k97308j11282L7849
2041.6H43810320q3208k72453k24113q464L1590j51157k66969j63317M17m888j58786
2064H42508972k25425p6592R5487M4941j40130j63972n365Q7381j6749j44959r7990
2086.5H41865599M2379Q4996l5763j31130l6418R8288P6592m3512q0406Q225R7037
2108.9H41945887N5432m4048k7239Q1837J10984M8339J3590O2287J29640J17123M4406
$$ plain form
2131.3 842538238 842563570 842662096 842804849 842891693 842927277 843005419 843162954 843333006 843446136 843532562 843650401
2153.8 843650401 843788326 843897104 843988955 844120264 844260395 844352126 844413340 844511986 844683766 844867408
2174.2 844867408 844983518 845066845 845223367 845428348 845557213 845600247 845665455 845802724 845927596 845949471
2194.6 845949471 845904887 845927835 846073568 846205235 846193135 846152186 846242070 846399248 846467972 846408665 846360683
2217 846360683 846470177 846623242 846611619 846492589 846500278 846690118 846837223 846731544 846511006 846482217 846653402
2239.4 846653402 846724629 846539617 846318483 846326351 846469939 846463561 846262813 846120656 846231520 846407592
2259.8 846407592 846340775 846096396 846015334 846200883 846366107 846272767 846095741 846151292 846425593 846605659
2280.2 846605659 846522808 846360922 846371472 846525550 846549094 846354246 846210957 846315920 846493661 846457422
$$ packed form
2131.3H42538238K5332R8526J42753Q6844L5584P8142J57535J70052J13130Q6426J17839
2153.8H43650401J37925J08778R1851J31309J40131R1731O1214R8646J71780J83642
2174.2H44867408J16110Q3327J56522K04981J28865M3034O5208J37269J24872K1875
2194.6H45949471m4584K2948J45733J31667j2100m0949Q9884J57178O8724n9307m7982
2217H46360683J09494J53065j1623j19030P689J89840J47105j05679k20538k8789J71185
2239.4H46653402P1227j85012k21134P868J43588o378k00748j42157J10864J76072
2259.8H46407592o6817k44379q1062J85549J65224r3340j77026N5551K74301J80066
2280.2H46605659q2851j61886J0550J54078K3544j94848j43289J04963J77741l6239
$$ plain form
2300.6 846457422 846217990 846051037 846100390 846174717 846060693 845877707 845838189 845870018 845743358 845479310
2321 845479310 845332623 845404983 845525980 845491171 845299780 845160067 845225930 845369995 845382929 845341086 845627904
2343.5 845627904 846300066 846663535 846364260 845701993 845138848 844972432 845019281 845006406 845104039 845444679
2363.8 845444679 845869005 846292078 846719682 847171426 847701728 848259330 848716795 849045694 849298537 849542439
2384.2 849542439 849792421 849946499 849926591 849859595 849892735 849984229 850011289 849963427 849917710 849903941 849922061
2406.7 849922061 849922299 849852741 849793673 849834442 849880099 849794626 849627316 849537611 849570155 849609017 849523485 849315822
2431.2 849315822 849154532 849128544 849090695 848920882 848719060 848646343 848686218 848648608 848447800 848236144
2451.5 848236144 848164976 848158419 848060310 847857893 847664595 847576857 847512960 847342491 847140133 847042501 847018838
$$ packed form
2300.6H46457422k39432j66953M9353P4327j14024j82986l9518L1829j26660k64048
2321H45479310j46687P2360J20997l4809j91391j39713O5863J44065J2934m1843K86818
2343.5H45627904O72162L63469k99275o62267n63145j66416M6849j2875R7633L40640
2363.8H45444679M24326M23073M27604M51744N30302N57602M57465L28899K52843K43902
2384.2H49542439K49982J54078j9908o6996L3140R1494K7060m7862m5717j3769J8120
2406.7H49922061K38o9558n9068M0769M5657q5473j67310q9705L2544L8862q5532k07663
2431.2H49315822j61290k5988l7849j69813k01822p2717L9875l7610k00808k11656
2451.5H48236144p1168o557r8109k02417j93298q7738o3897j70469k02358r7632k3663
$$ plain form
2474 847018838 846923232 846691012 846441388 846308410 846247435 846120834 845891714 845678747 845594585 845580518 845479786
2496.4 845479786 845246255 845020413 844916463 844842672 844671428 844449818 844303727 844223738 844106793 843918443
2516.8 843918443 843718827 843596995 843529940 843392551 843160570 842952609 842860520 842796743 842630446 842392564
2537.2 842392564 842189074 842055082 841944635 841793716 841610193 841452360 841329098 841191769 841007173 840801239
2557.6 840801239 840625465 840484083 840314329 840084493 839841306 839621902 839420855 839193702 838909209 838612676
2578 838612676 838360250 838120043 837824464 837481558 837164342 836910546 836647630 836316407 835967302 835632920
2598.4 835632920 835277915 834890723 834505737 834122896 833722472 833307683 832907200 832520366 832119524 831727386
2618.8 831727386 831357360 830978513 830571115 830138743 829688787 829265237 828896224 828535438 828146100 827745616
$$ packed form
2474H47018838r5606k32220k49624j32978o0975j26601k29120k12967q4162j4067j00732
2496.4H45479786k33531k25842j03950p3791j71244k21610j46091p9989j16945j88350
2516.8H43918443j99616j21832o7055j37389k31981k07961r2089o3777j66297k37882
2537.2H42392564k03490j33992j10447j50919j83523j57833j23262j37329j84596k05934
2557.6H40801239j75774j41382j69754k29836k43187k19404k01047k27153k84493k96533
2578H38612676k52426k40207k95579l42906l17216k53796k62916l31223l49105l34382
2598.4H35632920l55005l87192l84986l82841m00424m14789m00483l86834m00842l92138
2618.8H31727386l70026l78847m07398m32372m49956m23550l69013l60786l89338m00484
$$ plain form
2639.2 827745616 827367604 827005684 826631665 826222003 825795829 825398684 825014234 824630678 824268937 823914051
2659.6 823914051 823554754 823186457 822783828 822388291 822051585 821743190 821401894 821017563 820638239 820255876
2680 820255876 819835722 819419682 819052160 818683565 818273783 817848444 817416370 816961110 816495359 816053391
2700.4 816053391 815608680 815106869 814569592 814042568 813503087 812937319 812375963 811841547 811330795 810804665
2720.8 810804665 810270429 809765935 809244573 808690429 808179736 807737947 807333946 806922138 806467593 805999875
2741.2 805999875 805553734 805125594 804695666 804230690 803714514 803157747 802591205 802037537 801467896 800862432
2761.6 800862432 800240457 799620271 799005985 798375070 797743022 797116160 796407938 795590758 794747174 793931544
2782 793931544 793140829 792345107 791512132 790619254 789662659 788694859 787756443 786778688 785713494 784607112
$$ packed form
2639.2H27745616l78012l61920l74019m09662m26174l97145l84450l83556l61741l54886
2659.6H23914051l59297l68297m02629l95537l36706l08395l41296l84331l79324l82363
2680H20255876m20154m16040l67522l68595m09782m25339m32074m55260m65751m41968
2700.4H16053391m44711n01811n37277n27024n39481n65768n61356n34416n10752n26130
2720.8H10804665n34236n04494n21362n54144n10693m41789m04001m11808m54545m67718
2741.2H05999875m46141m28140m29928m64976n16176n56767n66542n53668n69641o05464
2761.6H00862432o21975o20186o14286o30915o32048o26862p08222q17180q43584q15630
2782G93931544p90715p95722q32975q92878r56595r67800r38416r77755j065194j106382
$$ plain form
2802.3 784607112 783462822 782248259 780982494 779687047 778372347 777035058 775639772 774166048
2818.7 774166048 772610247 770964682 769201279 767240882 765024185 762490690 759547174 756083488
2835 756083488 751910567 746783197 740547538 733173370 724600375 715006828 705344260 697267234 692365587
2853.3 692365587 691189945 692895949 695800185 698369861 699747801 699630857 698250473 696411252
2869.7 696411252 695053756 694570780 694648862 694773316 694558680 693699837 692038059 689621568 686634123
2888 686634123 683298945 679797828 676220238 672532618 668678284 664712191 660694957 656477690 651761532
2906.4 651761532 646285832 639835775 632167995 623188019 613342643 603629947 595248818 589338779
2922.7 589338779 586681008 587378085 590837181 596126854 602503955 609523356 616759062 623701334
$$ packed form
2802.3G84607112j144290j214563j265765j295447j314700j337289j395286j473724
2818.7G74166048j555801j645565j763403j960397k216697k533495k943516l463686
2835G56083488m172921n127370o235659p374168q572995r593547r662568q077026m901647
2853.3F92365587j175642J706004K904236K569676J377940j16944j380384j839221
2869.7F96411252j357496m82976P8082J24454k14636q58843j661778k416491k987445
2888F86634123l335178l501117l577590l687620l854334l966093m017234m217267m716158
2906.4F51761532n475700o450057p667780q979976r845376r712696q381129n910039
2922.7E89338779k657771O97077L459096N289673O377101P019401P235706O942272
$$ plain form
2939 623701334 629879773 634928048 638493240 640325546 640625000 640092432 639471173 639329135 640108645
2957.4 640108645 641992629 644888639 648482680 652431190 656533659 660636961 664658248 668556869
2973.7 668556869 672224224 675698519 679112971 682307065 685062706 687416375 689488769 691387117
2990 691387117 693009436 694068611 694593847 694808066 694765627 694508195 694109678 693638027 693184257 692767441
3010.4 692767441 692232370 691390157 690293431 689150691 688000679 686747789 685355783 683876574 682457924
3028.7 682457924 681148112 679807723 678303301 676662803 675056100 673491836 671801448 669962704
3045.1 669962704 668083072 666225076 664358914 662432134 660508275 658668041 656864762 655043840
3061.4 655043840 653264284 651614010 650019765 648315668 646504164 644754112 643199027 641755402
$$ packed form
2939F23701334O178439N048275L565192J832306K99454n32568o21259j42038P79510
2957.4F40108645J883984K896010L594041L948510M102469M103302M021287L898621
2973.7F68556869L667355L474295L414452L194094K755641K353669K072394J898348
2990F91387117J622319J059175N25236K14219m2439k57432l98517m71651m53770m16816
3010.4F92767441n35071q42213j096726j142740j150012j252890j392006j479209j418650
3028.7F82457924j309812j340389j504422j640498j606703j564264j690388j838744
3045.1F69962704j879632j857996j866162j926780j923859j840234j803279j820922
3061.4F55043840j779556j650274j594245j704097j811504j750052j555085j443625
$$ plain form
3077.7 641755402 640165627 638359785 636515558 634743750 633018970 631242514 629326344 627371848
3094 627371848 625530064 623755157 621881247 619823575 617713034 615714312 613749504 611641705 609462976
3112.4 609462976 607388437 605317891 603058457 600553632 597890854 595274448 592787743 590323567
3128.7 590323567 587773800 585160911 582567692 579985797 577337146 574562430 571699560 568832159
3145 568832159 565991879 563210666 560463428 557594538 554530442 551387727 548262119 545207858 542247355
3163.4 542247355 539269388 536194801 533062935 529941380 526883423 523840189 520731688 517597675
3179.7 517597675 514502406 511440158 508360922 505264342 502196789 499159366 496111631 493009388
3196 493009388 489896953 486868858 483941704 481054544 478157878 475269109 472429872 469612002 466754735
$$ packed form
3077.7F41755402j589775j805842j844227j771808j724780j776456j916170j954496
3094F27371848j841784j774907j873910k057672k110541j998722j964808k107799k178729
3112.4F09462976k074539k070546k259434k504825k662778k616406k486705k464176
3128.7E90323567k549767k612889k593219k581895k648651k774716k862870k867401
3145E68832159k840280k781213k747238k868890l064096l142715l125608l054261k960503
3163.4E42247355k977967l074587l131866l121555l057957l043234l108501l134013
3179.7E17597675l095269l062248l079236l096580l067553l037423l047735l102243
3196D93009388l112435l028095k927154k887160k896666k888769k839237k817870k857267
$$ plain form
3214.3 466754735 463879824 461046875 458275735 455527067 452792048 450124323 447529346 444981545
3230.7 444981545 442449063 439825326 437140644 434591442 432181627 429795533 427446365 425185323
3247 425185323 422963291 420721531 418474555 416239679 414050817 411935776 409846514 407745600 405648381
3265.3 405648381 403609037 401675373 399739057 397696376 395641237 393655479 391688257 389718533
3281.6 389718533 387777776 385862470 383985192 382149637 380309790 378425568 376487076 374503046
3298 374503046 372522056 370649129 368912011 367129296 365126014 362975448 360850871 358822048 356842577
3316.3 356842577 354855597 352846444 350850314 348895669 346902639 344852358 342826754 340830415
3332.6 340830415 338882536 336992234 335030675 332973421 330943048 328920662 326914102 325046837
$$ packed form
3214.3D66754735k874911k832949k771140k748668k735019k667725k594977k547801
3230.7D44981545k532482k623737k684682k549202k409815k386094k349168k261042
3247D25185323k222032k241760k246976k234876k188862k115041k089262k100914k097219
3265.3D05648381k039344j933664j936316k042681k055139j985758j967222j969724
3281.6C89718533j940757j915306j877278j835555j839847j884222j938492j984030
3298C74503046j980990j872927j737118j782715k003282k150566k124577k028823j979471
3316.3C56842577j986980k009153j996130j954645j993030k050281k025604j996339
3332.6C40830415j947879j890302j961559k057254k030373k022386k006560j867265
$$ plain form
3348.9 325046837 323200047 321190417 319122225 317177206 315353423 313547939 311793745 310221761
3365.3 310221761 308746815 307115525 305272073 303478330 301929653 300541818 299227417 297956914
3381.6 297956914 296790779 295820892 295065343 294509619 293966234 293222278 292446852 292002410 291832656
3399.9 291832656 291462988 290789664 290260375 290053427 289990038 289950579 289872974 289802462 289872468 290085107
3420.3 290085107 290396035 290882885 291577756 292410642 293272734 294224590 295296848 296232343 296960026
3438.7 296960026 297766536 298862487 300223380 301740199 303272873 304807752 306433946 308211476
3455 308211476 310161799 312197685 314135641 316097736 318411887 320944965 323200405 325049043 326927722
3473.4 326927722 329144686 331652105 334167242 336470723 338810056 341410190 344049454 346584380
$$ packed form
3348.9C25046837j846790k009630k068192j945019j823783j805484j754194j571984
3365.3C10221761j474946j631290j843452j793743j548677j387835j314401j270503
3381.6B97956914j166135r69887p55549n55724n43385p43956p75426m44442j69754
3399.9B91832656l69668o73324n29289k06948o3389l9459p7605p0512P0006K12639
3420.3B90085107L10928M86850O94871Q32886Q62092R51856J072258R35495P27683
3438.7B96960026Q06510J095951J360893J516819J532674J534879J626194J777530
3455C08211476J950323K035886J937956J962095K314151K533078K255440J848638J878679
3473.4C26927722K216964K507419K515137K303481K339333K600134K639264K534926
$$ plain form
3489.7 346584380 349187702 351960659 354857087 357702285 360512018 363450110 366341978 369032145
3506 369032145 371806920 374917805 378243595 381489217 384549260 387609839 390871376 394428015 397983134
3524.4 397983134 401282132 404623449 408228487 411975652 415821165 419703603 423472196 427305251
3540.7 427305251 431387037 435616314 439744920 443718195 447806835 452149540 456545562 460908026
3557 460908026 465407878 470005810 474413961 478860766 484131992 489869416 495130450 500118136 505305648
3575.3 505305648 510697365 516226411 521779299 527128696 532513499 538491189 544717133 550501108
3591.7 550501108 556261778 562356234 568541288 574786782 581066430 586990356 592572272 598539352
3608 598539352 604932547 611233592 617309928 623062611 629197717 636190057 642637074 647736609 652300000
$$ packed form
3489.7C46584380K603322K772957K896428K845198K809733K938092K891868K690167
3506C69032145K774775L110885L325790L245622L060043L060579L261537L556639L555119
3524.4C97983134L298998L341317L605038L747165L845513L882438L768593L833055
3540.7D27305251M081786M229277M128606L973275M088640M342705M396022M362464
3557D60908026M499852M597932M408151M446805N271226N737424N261034M987686N187512
3575.3E05305648N391717N529046N552888N349397N384803N977690O225944N783975
3591.7E50501108N760670O094456O185054O245494O279648N923926N581916N967080
3608E98539352O393195O301045O076336N752683O135106O992340O447017N099535M563391
$$ plain form
3626.3 652300000 658182263 665295660 671338737 676627815 681854844 687003255 692068696 696691453
3642.6 696691453 700513363 704094172 708933294 714727759 719247639 722850561 727048516 731354237
3659 731354237 734914422 737932384 740486205 742557526 744903505 747712970 749931514 752379835 755629659
3677.3 755629659 758459926 760773003 762634337 764005244 765529215 767708838 770003259 771918714
3693.6 771918714 773455024 774645329 775696278 777019858 778398693 779215157 779551864 780086696 781471491
3712 781471491 783137977 784206331 784763336 785201192 785734713 786380470 787163436 787818193 787982225 787952304
3732.4 787952304 788458228 789732337 790839970 790876269 790427685 790863216 791655540 791824043 792466402
3750.7 792466402 793866634 794777334 795064270 795462430 796142101 796545684 796690226 796909451 797370017
$$ packed form
3626.3F52300000N882263P113397O043077N289078N227029N148411N065441M622757
3642.6F96691453L821910L580809M839122N794465M519880L602922M197955M305721
3659G31354237L560185L017962K553821K071321K345979K809465K218544K448321L249824
3677.3G55629659K830267K313077J861334J370907J523971K179623K294421J915455
3693.6G71918714J536310J190305J050949J323580J378835Q16464L36707N34832J384795
3712G81471491J666486J068354N57005M37856N33521O45757P82966O54757J64032k9921
3732.4G87952304N05924J274109J107633L6299m48584M35531P92324J68503O42359
3750.7G92466402J400232R10700K86936L98160O79671M03583J44542K19225M60566
$$ plain form
3769.1 797370017 798071742 798599720 798784018 798944116 799343824 799754143 799910069 800084949 800470531 800881624
3789.5 800881624 801077068 800923944 800664127 800445914 800265908 800606430 801162720 801528454 802184045 802697957
3809.9 802697957 802496910 801949263 801743031 801725209 801738441 802378237 803072274 803342044 803410053 803267419
3830.3 803267419 803053439 802889228 802781403 802901924 803265572 803795755 804391384 804592311 803987622 802752495
3850.7 802752495 802220464 803425014 804501951 804626107 804298639 804013133 804094791 804099083 803950191 804220200
3871.1 804220200 804692984 804995716 804905593 804587424 804564834 804733872 805044651 805301607 805187047 805234551
3891.5 805234551 805529058 805410683 804849386 804340124 804292202 804797530 805517673 805952072 806075752 806025028
3911.9 806025028 805760741 805459619 805430055 805578411 805610061 805615485 805723727 805736423 805681109 805822909 806057096
$$ packed form
3769.1G97370017P01725N27978J84298J60098L99708M10319J55926J74880L85582M11093
3789.5H00881624J95444j53124k59817k18213j80006L40522N56290L65734O55591N13912
3809.9H02697957k01047n47647k06232j7822J3232O39796O94037K69770O8009j42634
3830.3H03267419k13980j64211j07825J20521L63648N30183N95629K00927o04689j235127
3850.7H02752495n32031J204550J076937J24156l27468k85506Q1658M292j48892K70009
3871.1H04220200M72784L02732r0123l18169k2590J69038L10779K56956j14560M7504
3891.5H05234551K94507j18375n61297n09262m7922N05328P20143M34399J23680n0724
3911.9H06025028k64287l01122k9564J48356L1650N424J08242J2696n5314J41800K34187
$$ plain form
3934.3 806057096 806088746 805950701 805874944 805965006 806045115 806031823 806098998 806243360 806347787 806390345 806384623
3956.7 806384623 806401193 806480229 806549489 806597829 806693077 806791186 806792259 806765676 806873858 807065368 807195842
3979.2 807195842 807267129 807320595 807358444 807407022 807489157 807561994 807590902 807604134 807658672
3997.5 807658672
$$ packed form
3934.3H06057096L1650j38045p5757R0062Q0109j3292O7175J44362J04427M2558n722
3956.7H06384623J6570P9036O9260M8340R5248R8109J073k6583J08182J91510J30474
3979.2H07195842P1287N3466L7849M8578Q2135P2837K8908J3232N4538
3997.5H07658672
##END=$$ End of the data block
