##TITLE=$$ Begin of the data block
##JCAMP-DX=5.00 $$ ACD/SpecManager v 10.08
##SPECTROMETER/DATA SYSTEM=Alpha
##DATE=14 Apr 2014 11:23:48
##DATA TYPE=INFRARED SPECTRUM
##DATA CLASS=XYDATA
##ORIGIN=
##OWNER=
##NPOINTS=1765
##FIRSTX=399.75695801
##LASTX=3997.56933594
##MAXX=3997.56933594
##MINX=399.75695801
##MAXY=0.85071039
##MINY=0.29031932
##XFACTOR=1.0000000000
##YFACTOR=1.000000000000000e-9
##FIRSTY=0.63901645
##DELTAX=2.03957629
##XUNITS=1/CM
##YUNITS=ARBITRARY UNITS
##XYDATA=(X++(Y..Y))
$$ plain form
399.8 639016449 638820589 637501657 634869158 632717848 632096529 632036626 630939960 628641129 627021968
418.1 627021968 627286851 627035439 625085890 623501837 623789132 624583662 624099016 622325718 620878220
436.5 620878220 620841384 621010780 620202065 619216919 619149268 619613886 619439304 618418992 617569089 617458224
456.9 617458224 617409945 616553962 615168095 614236951 613999963 613558710 612128258 610363007 609582841
475.2 609582841 609523177 608879805 607471049 606415987 606402159 606691003 606025577 604346633 602989912
493.6 602989912 602537811 602089107 600861251 599143565 598022282 597805560 597487211 596374154 594844282
511.9 594844282 593719780 593076110 591964006 590145290 588434458 587291062 586379707 585082948 583393395
530.3 583393395 581968606 581316173 580976307 580092669 578827858 578048408 577891767 577549636 576353252
$$ packed form
399.8F39016449j95860j318932k632499k151310o21319n9903j096666k298831j619161
418.1F27021968K64883k51412j949549j584053K87295P94530m84646j773298j447498
436.5F20878220l6836J69396q08715r85146o7651M64618j74582j020312q49903j10865
456.9F17458224m8279q55983j385867r31144k36988m41253j430452j765251p80166
475.2F09582841n9664o43372j408756j055062j3828K88844o65426j678944j356721
493.6F02989912m52101m48704j227856j717686j121283k16722l18349j113057j529872
511.9E94844282j124502o43670j112104j818716j710832j143396r11355j296759j689553
530.3E83393395j424789o52433l39866q83638j264811p79450j56641l42131j196384
$$ plain form
548.6 576353252 574853599 574006319 573602915 572670519 570835948 568831682 567466915 566350341 564489484
567 564489484 561840355 559266090 557271421 555527866 553483605 551156998 549083948 547590196 546215236
585.4 546215236 544476509 542614162 541176915 540294766 539432287 538191259 536744416 535317838 533877194
603.7 533877194 532518864 531596303 531398475 531645179 531785905 532039642 533411980 536349237 540213823
622.1 540213823 544167936 547691286 550897837 554261982 557943225 561443865 564187646 566238046
638.4 566238046 567929208 569155931 570025384 571501374 573978961 576336622 577087343 576299250 576547980
656.7 576547980 580157995 585912347 591031194 594249249 596702218 600177944 603496552 606200993
673.1 606200993 608798265 611271262 613829315 616540968 618983686 620834947 622330606 623916864
$$ packed form
548.6E76353252j499653q47280m03404r32396j834571k004266j364767j116574j860857
567E64489484k649129k574265j994669j743555k044261k326607k073050j493752j374960
585.4E46215236j738727j862347j437247q82149q62479j241028j446843j426578j440644
603.7E33877194j358330r22561j97828K46704J40726K53737J372338K937257L864586
622.1E40213823L954113L523350L206551L364145L681243L500640K743781K050400
638.4E66238046J691162J226723Q69453J475990K477587K357661P50721p88093K48730
656.7E76547980L610015N754352N118847L218055K452969L475726L318608K704441
673.1F06200993K597272K472997K558053K711653K442718J851261J495659J586258
$$ plain form
689.4 623916864 625604928 626874447 627510250 627899170 628539801 629573643 630786836 631985426 633413970
707.7 633413970 635422945 637772381 639947832 641785145 643554807 645653486 648081839 650445819
724 650445819 652646124 654924989 657383978 659694850 661479235 662838697 664258063 666049302 667855322
742.4 667855322 669290304 670624375 672307909 674331248 676244497 677692950 678976953 680618107
758.7 680618107 682518244 684124351 685245991 686338544 687688887 688944638 689571679 689539671 689321935
777.1 689321935 689134121 688643217 687541068 686225772 685642481 686329186 687992871 690292120 693483770
795.4 693483770 697974205 703472257 709096014 714188933 718778968 723184705 727165282 730110884
811.7 730110884 731933177 733184159 734147370 734386384 733343542 731032491 727972627 724524498 720609605
$$ packed form
689.4F23916864J688064J269519O35803L88920O40631J033842J213193J198590J428544
707.7F33413970K008975K349436K175451J837313J769662K098679K428353K363980
724F50445819K200305K278865K458989K310872J784385J359462J419366J791239J806020
742.4F67855322J434982J334071J683534K023339J913249J448453J284003J641154
758.7F80618107J900137J606107J121640J092553J350343J255751O27041l2008k17736
777.1F89321935j87814m90904j102149j315296n83291O86705J663685K299249L191650
795.4F93483770M490435N498052N623757N092919M590035M405737L980577K945602
811.7G30110884J822293J250982R63211K39014j042842k311051l059864l448129l914893
$$ plain form
830.1 720609605 716076493 711305082 706986547 703293443 699785769 696149051 692766666 690419316
846.4 690419316 689664781 690713882 693658650 698621750 705549061 713877380 722630024 731029153 738930464
864.8 738930464 746378958 753001153 758171678 761768699 764353454 766456842 768083334 768889070 768838108
883.1 768838108 768425882 767901599 766905546 765240848 763408899 762300014 762405455 763306439 764313042
901.5 764313042 765316606 766560793 767856181 768463731 767800748 766002715 763578594 760683596 757122099
919.8 757122099 753139913 749699295 747661769 747023821 747103214 747427821 748140395 749302745 750389934
938.2 750389934 750869572 750841260 750755429 750647664 749904633 747919619 744800568 741063714 736691415
956.6 736691415 731023490 723634243 714746356 704656541 693202734 680122912 665853560 651607454
$$ packed form
830.1G20609605m533112m771411m318535l693104l507674l636718l382385k347350
846.4F90419316p54535J049101K944768M963100O927311Q328319Q752644Q399129P901311
864.8G38930464P448494O622195N170525L597021K584755K103388J626492Q05736n0962
883.1G68838108m12226n24283r96053j664698j831949j108885J05441R00984J006603
901.5G64313042J003564J244187J295388O07550o62983j798033k424121k894998l561497
919.8G57122099l982186l440618k037526o37948P9393L24607P12574J162350J087189
938.2G50389934M79638k8312q5831j07765p43031j985014l119051l736854m372299
956.6G36691415n667925p389247q887887j0089815j1453807j3079822j4269352j4246106
$$ plain form
972.9 651607454 638566554 627149343 617128253 608319521 600765824 594297588 588495016 583080113
989.2 583080113 578144848 573975086 570613027 567746639 565041542 562463939 560103297 557595015
1005.5 557595015 554198503 549519181 543802440 537618220 531360686 525123119 519018710 513352275
1021.8 513352275 508298218 503667533 499179363 494789988 490687788 487035334 483811289 480873197
1038.1 480873197 478188485 475812495 473694444 471646190 469518572 467549741 466395050 466629237
1054.5 466629237 468268037 470936686 474187434 477474123 480014056 480958164 479931355 477327883
1070.8 477327883 473977894 470565677 467399925 464578688 462151468 459976196 457633168 454772115
1087.1 454772115 451512694 448458165 446374208 445692837 446297616 447866648 450114042 452696502 455192238
$$ packed form
972.9F51607454j3040900j1417211j0021090q808732p553697o468236n802572n414903
989.2E83080113m935265m169762l362059k866388k705097k577603k360642k508282
1005.5E57595015l396512m679322n716741o184220o257534o237567o104409n666435
1021.8E13352275n054057m630685m488170m389375m102200l652454l224045k938092
1038.1D80873197k684712k375990k118051k048254k127618j968831j154691K34187
1054.5D66629237J638800K668649L250748L286689K539933R44108j026809k603472
1070.8D77327883l349989l412217l165752k821237k427220k175272k343028k861053
1087.1D54772115l259421l054529k083957o81371O04779J569032K247394K582460K495736
$$ plain form
1105.4 455192238 457284451 458881229 459982902 460393339 459630430 457102418 452658862 447405308 443532020
1123.8 443532020 442322373 443134338 444972545 446795642 447648376 448168248 449657887 452377707 455728471
1142.2 455728471 458950430 461598814 463730872 465704530 467842728 470274746 473113805 476644695
1158.5 476644695 481184691 486931324 493896157 501927376 510832965 520331442 529941022 539138615
1174.8 539138615 547646046 555478573 562618852 568724632 573325694 576181829 577300012 576780975
1191.1 576780975 574870706 572126150 569399953 567510903 566874802 567421854 568739533 570312560 571674705
1209.5 571674705 572445214 572448492 571836889 570973516 570149422 569445014 568849802 568467736 568496585 569008946
1229.9 569008946 569905639 571092010 572565854 574301362 576173007 577982068 579555511 580838919
$$ packed form
1105.4D55192238K092213J596778J101673M10437p62909k528012m443556n253554l873288
1123.8D43532020j209647Q11965J838207J823097Q52734N19872J489639K719820L350764
1142.2D55728471L221959K648384K132058J973658K138198K432018K839059L530890
1158.5D76644695M539996N746633O964833Q031219Q905589R498477R609580R197593
1174.8E39138615Q507431P832527P140279O105780M601062K856135J118183n19037
1191.1E76780975j910269k744556k726197j889050o36101N47052J317679J573027J362145
1209.5E71674705P70509L278o11603q63373q24094p04408n95212l82066K8849N12361
1229.9E69008946Q96693J186371J473844J735508J871645J809061J573443J283408
$$ plain form
1246.2 580838919 581813931 582420409 582663476 582699895 582809985 583293617 584334850 585991025 588297486
1264.5 588297486 591297090 594962776 599190950 603838086 608803749 614040017 619460583 624985635
1280.8 624985635 630600929 636316001 642102480 647837758 653324306 658425927 663132906 667463124
1297.2 667463124 671398282 674934030 678099275 680957377 683556259 685842931 687774539 689449608
1313.5 689449608 690968513 692404389 693840206 695265055 696665406 698045075 699296355 700256884
1329.8 700256884 700809181 700918019 700715959 700480580 700489044 700803518 701286495 701866448 702477217 702977121
1350.2 702977121 703261971 703335822 703215659 702745199 701695442 700151861 698505163 696935177 695392132
1368.5 695392132 693718612 691712737 689605892 687940180 686837018 685896814 684669256 683308303
$$ packed form
1246.2E80838919R75012O06478K43067L6419J10090M83632J041233J656175K306461
1264.5E88297486K999604L665686M228174M647136M965663N236268N420566N525052
1280.8F24985635N615294N715072N786479N735278N486548N101621M706979M330218
1297.2F67463124L935158L535748L165245K858102K598882K286672J931608J675069
1313.5F89449608J518905J435876J435817J424849J400351J379669J251280R60529
1329.8G00256884N52297J08838k02060k35379Q464L14474M82977N79953O10769M99904
1350.2G02977121K84850P3851j20163m70460j049757j543581j646698j569986j543045
1368.5F95392132j673520k005875k106845j665712j103162r40204j227558j360953
$$ plain form
1384.9 683308303 682250917 681431055 680391431 678934157 677286327 675596118 673612297 671235919
1401.2 671235919 668433487 665360391 662510812 659922898 657479644 655300200 653383970 651711941
1417.5 651711941 650616944 650058329 649607956 649240255 648883998 648475766 648106575 647725523 647665918 648455560
1437.9 648455560 649483562 650295019 651013792 651880324 653189778 654848158 656447411 658176839 661719441
1456.2 661719441 668162107 674450457 679805160 685836852 692944884 700245798 708220065 717976332
1472.6 717976332 727585137 734998703 740504980 744560063 747526705 749314547 749859929 749501467 748739421
1490.9 748739421 747528315 745375812 742303967 739007950 735634089 731778026 726605833 720283389
1507.2 720283389 715372443 711226583 706723928 702168226 698134899 694841862 691947103 689578474
$$ packed form
1384.9F83308303j057386q19862j039624j457274j647830j690209j983821k376378
1401.2F71235919k802432l073096k849579k587914k443254k179444j916230j672029
1417.5F51711941j094997n58615m50373l67701l56257m08232l69191l81052n9605P89642
1437.9F48455560J028002Q11457P18773Q66532J309454J658380J599253J729428L542602
1456.2F61719441O442666O288350N354703O031692P108032P300914P974267R756267
1472.6G17976332R608805P413566N506277M055083K966642J787842N45382l58462p62046
1490.9G48739421j211106k152503l071845l296017l373861l856063n172193o322444
1507.2G20283389m910946m145860m502655m555702m033327l293037k894759k368629
$$ plain form
1523.6 689578474 687484860 685270131 683110893 680948257 678941488 677275121 675359607 673277855
1539.9 673277855 672427595 672644615 673046887 673417389 673993707 674985349 676078498 676778436 677717030
1558.2 677717030 680019498 681703687 682025433 681411564 679930687 677867889 675425291 671914160 666979194
1576.6 666979194 661979139 656930983 651037872 644476414 637418985 630006850 622362375 614554942
1592.9 614554942 606600225 598730981 591036081 583383799 575793505 568319321 560868859 553376079
1609.2 553376079 546045959 538945854 531450689 523610115 517292380 511748374 505838931 500407636
1625.5 500407636 495691985 491544306 488162428 485251844 482986808 482343942 482781768 483668804 484918326
1643.9 484918326 487095237 490328699 493152976 496489465 502358675 507894695 512493551 517530262
$$ packed form
1523.6F89578474k093614k214729k159238k162636k006769j666367j915514k081752
1539.9F73277855q50260K17020M02272L70502N76318R91642J093149O99938R38594
1558.2F77717030K302468J684189L21746o13869j480877k062798k442598l511131m934966
1576.6F66979194n000055n048156n893111o561458p057429p412135p644475p807433
1592.9F14554942p954717p869244p694900p652282p590294p474184p450462p492780
1609.2E53376079p330120p100105p495165p840574o317735n544006n909443n431295
1625.5E00407636m715651m147679l381878k910584k265036o42866M37826Q87036J249522
1643.9D84918326K176911L233462K824277L336489N869210N536020M598856N036711
$$ plain form
1660.2 517530262 523666561 530508995 536749005 543330848 551171422 558724761 566609859 575398445
1676.5 575398445 583316863 590248227 597910643 608447850 618648052 626936972 635163963 642735541
1692.8 642735541 650705099 659576356 668781996 679806769 689418495 697207272 704869449 711396158
1709.2 711396158 716731787 721271813 725426197 730181396 735141635 739153504 742593706 745873570
1725.5 745873570 748793900 751464307 754069269 757703483 762161255 765683591 769173861 773226738
1741.8 773226738 777176797 780730903 784030497 787753582 791982532 795510471 798258066 800760806
1758.1 800760806 803082526 805529475 807761848 809321225 810556591 811872363 813660860 815728307
1774.4 815728307 817348897 818635106 819975317 821366131 822649479 823806584 824725807 825528979 826749623
$$ packed form
1660.2E17530262O136299O842434O240010O581843P840574P553339P885098Q788586
1676.5E75398445P918418O931364P662416J0537207J0200202Q288920Q226991P571578
1692.8F42735541P969558Q871257R205640J1024773R611726P788777P662177O526709
1709.2G11396158N335629M540026M154384M755199M960239M011869L440202L279864
1725.5G45873570K920330K670407K604962L634214M457772L522336L490270M052877
1741.8G73226738L950059L554106L299594L723085M228950L527939K747595K502740
1758.1H00760806K321720K446949K232373J559377J235366J315772J788497K067447
1774.4H15728307J620590J286209J340211J390814J283348J157105R19223Q03172J220644
$$ plain form
1792.8 826749623 828114629 829095840 829880059 830840886 831946075 832885146 833584249 834226727 835019410
1811.1 835019410 835846305 836506844 837093949 837736785 838245690 838520169 838800669 839167595 839699924 840527594
1831.5 840527594 841255486 841691494 842131793 842550993 842650712 842720449 843290091 844031096 844604254 845035195
1851.9 845035195 845368326 845665336 845955491 846255541 846509933 846610069 846539557 846621871 847111523 847636759
1872.3 847636759 847937584 848155916 848385334 848564446 848694086 848839164 848947823 849003375 849148631 849326134
1892.7 849326134 849462330 849655330 849839866 849930048 849991024 850063086 850108504 850145638 850220382 850280821 850237608
1915.1 850237608 850172281 850218594 850252926 850305259 850505590 850668609 850669920 850635588 850664496 850710392 850691855
1937.6 850691855 850512147 850270867 850246072 850367188 850367188 850250602 850157976 850106478 850021362 849850178 849667847
$$ packed form
1792.8H26749623J365006R81211P84219R60827J105189R39071O99103O42478P92683
1811.1H35019410Q26895O60539N87105O42836N08905K74479K80500L66926N32329Q27670
1831.5H40527594P27892M36008M40299M19200R9719O9737N69642P41005N73158M30941
1851.9H45035195L33131K97010K90155L00050K54392J00136p0512Q2314M89652N25236
1872.3H47636759L00825K18332K29418J79112J29640J45078J08659N5552J45256J77503
1892.7H49326134J36196J93000J84536R0182O0976P2062M5418L7134P4744O0439m3213
1915.1H50237608o5327M6313L4332N2333K00331J63019J311l4332K8908M5896j8537
1937.6H50691855j79708k41280k4795J21116%j16586r2626n1498q5116j71184j82331
$$ plain form
1960 849667847 849572062 849499464 849337459 849141777 849039316 849043131 849055588 848950326 848744988 848591447 848574817
1982.5 848574817 848560333 848378062 848075390 847870052 847890556 847924650 847751498 847511053 847425342 847432911 847302258
2004.9 847302258 846980572 846689880 846613944 846598566 846381247 846035242 845835984 845805943 845738709 845488727
2025.3 845488727 845163703 844987333 844965339 844870210 844610035 844355226 844283521 844313800 844192147 843908727
2045.7 843908727 843701780 843691945 843711257 843558073 843294859 843141913 843159497 843154848 842975855 842752635 842715502
2068.1 842715502 842835069 842856705 842687964 842524886 842530787 842607796 842568338 842418849 842337847 842393935 842462540
2090.5 842462540 842408359 842287481 842276216 842395782 842472374 842416525 842332363 842353404 842463553 842503667 842431903
2113 842431903 842399359 842492700 842601120 842631340 842653275 842749119 842883766 842984974 843030453 843061626 843149543
$$ packed form
1960H49667847r5785p2598j62005j95682j02461L815J2457j05262k05338j53541j6630
1982.5H48574817j4484j82271l02672k05338K0504L4094j73152k40445q5711P569j30653
2004.9H47302258l21686k90692p5936j5378k17319l46005j99258l0041o7234k49982
2025.3H45488727l25024j76370k1994r5129k60175k54809p1705L0279j21653k83420
2045.7H43908727k06947r835J9312j53184k63214j52946J7584m649j78993k23220l7133
2068.1H42715502J19567K1636j68741j63078N901P7009l9458j49489q1002N6088O8605
2090.5H42462540n4181j20878j1265J19566P6592n5849q4162K1041J10149M0114p1764
2113H42431903l2544R3341J08420L0220K1935R5844J34647J01208M5479L1173Q7917
$$ plain form
2135.4 843149543 843275845 843364835 843420804 843515575 843673289 843835175 843943179 844034195 844158590 844298482
2155.8 844298482 844413459 844496727 844606638 844742417 844840586 844919562 845044732 845221758 845381677 845465779
2176.2 845465779 845533550 845691442 845897853 846022725 846057594 846128523 846288085 846424460 846442103 846401751
2196.6 846401751 846451819 846606493 846709430 846692622 846685529 846805274 846975207 847020984 846927345 846889853 847035229
2219 847035229 847196460 847162366 847029328 847026944 847187519 847302616 847184300 846989810 847006798 847194433 847250164
2241.5 847250164 847055256 846847236 846861601 846997499 846993566 846798718 846665502 846790016 846966088 846894264
2261.9 846894264 846658289 846599162 846788526 846917510 846799195 846637607 846693456 846945941 847118258 847027600
2282.3 847027600 846865952 846910894 847095430 847116113 846918702 846800745 846944034 847124040 847050667 846801639
$$ packed form
2135.4H43149543J26302Q8990N5969R4771J57714J61886J08004R1016J24395J39892
2155.8H44298482J14977Q3268J09911J35779R8169P8976J25170J77026J59919Q4102
2176.2H45465779O7771J57892K06411J24872L4869P0929J59562J36375J7643m0352
2196.6H46401751N0068J54674J02937j6808p093J19745J69933M5777r3639l7492J45376
2219H47035229J61231l4094j33038k384J60575J15097j18316j94490J6988J87635N5731
2241.5H47250164j94908k08020J4365J35898l933j94848j33216J24514J76072p1824
2261.9H46894264k35975n9127J89364J28984j18315j61588N5849K52485J72317r0658
2282.3H47027600j61648M4942J84536K0683j97411j17957J43289J80006p3373k49028
$$ plain form
2302.7 846801639 846671462 846743047 846815765 846719801 846539497 846469820 846509993 846417069 846118569 845906258 845971346
2325.1 845971346 846129417 846140921 845982254 845869303 845971465 846145153 846157730 846071124 846279144 846911490
2345.5 846911490 847283840 846999168 846432626 846045494 845911026 845855594 845830202 845967293 846322060 846781194
2365.9 846781194 847204804 847575009 847974598 848441899 848917305 849326491 849639177 849892259 850149214 850388944
2386.3 850388944 850523233 850519836 850476623 850498259 850573599 850608826 850553930 850481212 850486636 850557625 850576937 850508690
2410.8 850508690 850454986 850495517 850530088 850413084 850213468 850111067 850143611 850175142 850076079 849887669 849769831
2433.2 849769831 849754572 849695981 849519610 849342942 849303484 849354744 849313915 849101067 848868072 848777294 848758101
2455.6 848758101 848656595 848472476 848323524 848256350 848160863 847947955 847714484 847591996 847567201 847502887
$$ packed form
2302.7H46801639j30177P1585P2718r5964j80304o9677M0173r2924k98500k12311O5088
2325.1H45971346J58071J1504j58667j12951J02162J73688J2577q6606K08020O32346
2345.5H46911490L72350k84672n66542l87132j34468n5432k5392J37091L54767M59134
2365.9H46781194M23610L70205L99589M67301M75406M09186L12686K53082K56955K39730
2386.3H50388944J34289l397m3213K1636P5340L5227n4896p2718N424P0989J9312o8247
2410.8H50508690n3704M0531L4571j17004j99616j02401L2544L1531r9063j88410j17838
2433.2H49769831j5259n8591j76371j76668l9458N1260m0829k12848k32995r0778j9193
2455.6H48758101j01506j84119j48952o7174r5487k12908k33471j22488k4795o4314
$$ plain form
2476 847502887 847297072 847045004 846899092 846830130 846708953 846485615 846249640 846130133 846091211 845980048
2496.4 845980048 845759988 845558703 845473170 845409155 845247149 845041394 844903111 844813287 844687164 844498932
2516.8 844498932 844307423 844192266 844126403 844001114 843791425 843583047 843463421 843395770 843231916 842959523
2537.2 842959523 842741966 842641592 842557669 842408419 842239678 842112899 841995955 841843426 841643393 841417670
2557.6 841417670 841216564 841041803 840853512 840641975 840417743 840195358 839982629 839754045 839492321 839224219
2578 839224219 838979959 838742256 838458478 838126242 837805629 837530613 837244332 836886466 836519420 836194634
2598.4 836194634 835853934 835474491 835085511 834685028 834272742 833872795 833497941 833128989 832739413 832333326
2618.8 832333326 831916630 831506968 831138134 830762208 830307782 829837561 829432428 829052031 828658044 828274786
$$ packed form
2476H47502887k05815k52068j45912o8962j21177k23338k35975j19507l8922j11163
2496.4H45980048k20060k01285q5533o4015j62006k05755j38283q9824j26123j88232
2516.8H44498932j91509j15157o5863j25289k09689k08378j19626o7651j63854k72393
2537.2H42959523k17557j00374q3923j49250j68741j26779j16944j52529k00033k25723
2557.6H41417670k01106j74761j88291k11537k24232k22385k12729k28584k61724k68102
2578H39224219k44260k37703k83778l32236l20613k75016k86281l57866l67046l24786
2598.4H36194634l40700l79443l88980m00483m12286l99947l74854l68952l89576m06087
2618.8H32333326m16696m09662l68834l75926m54426m70221m05133l80397l93987l83258
$$ plain form
2639.2 828274786 827927232 827610016 827270031 826865137 826436281 826035082 825656354 825289071 824928880 824571848
2659.6 824571848 824217856 823837161 823418617 823012233 822653651 822339118 822010100 821608782 821186304 820796490
2680 820796490 820403636 819996417 819607079 819218159 818808734 818384051 817953527 817515433 817067146 816615760
2700.4 816615760 816150248 815674484 815197408 814692795 814141095 813569248 813021004 812500238 811967611 811421037
2720.8 811421037 810904801 810416102 809908867 809380949 808860779 808366299 807923794 807512820 807072520 806623042
2741.2 806623042 806211054 805803478 805344880 804828584 804286420 803751409 803236127 802702546 802110076 801498771
2761.6 801498771 800899148 800295293 799691200 799050212 798355758 797671020 796976388 796200156 795365930 794535697
2782 794535697 793724000 792909980 792079866 791205466 790255547 789278507 788344085 787387669 786312759 785177767
$$ packed form
2639.2H28274786l47554l17216l39985m04894m28856m01199l78728l67283l60191l57032
2659.6H24571848l53992l80695m18544m06384l58582l14533l29018m01318m22478l89814
2680H20796490l92854m07219l89338l88920m09425m24683m30524m38094m48287m51386
2700.4H16615760m65512m75764m77076n04613n51700n71847n48244n20766n32627n46574
2720.8H11421037n16236m88699n07235n27918n20170m94480m42505m10974m40300m49478
2741.2H06623042m11988m07576m58598n16296n42164n35011n15282n33581n92470o11305
2761.6H01498771n99623o03855o04093o40988o94454o84738o94632p76232q34226q30233
2782G94535697q11697q14020q30114q74400r49919r77040r34422r56416j074910j134992
$$ plain form
2802.3 785177767 784046650 782887399 781659007 780347645 779003680 777662873 776281238 774809897
2818.7 774809897 773249805 771600485 769793630 767769039 765537560 763055086 760180235 756743789
2835 756743789 752545357 747371376 741100490 733728528 725205600 715643883 705961704 697886884 693019450
2853.3 693019450 691845894 693519592 696417511 699013174 700399637 700267136 698867738 697010756
2869.7 697010756 695641696 695167363 695282936 695426464 695178270 694302797 692671895 690274239 687265337
2888 687265337 683895588 680367887 676777363 673087478 669255257 665346086 661362350 657118380 652358294
2906.4 652358294 646871269 640434146 632764161 623763084 613876879 604137719 595818281 590030909
2922.7 590030909 587438822 588111758 591528773 596800268 603174746 610187292 617378712 624295235
$$ packed form
2802.3G85177767j131117j159251j228392j311362j343965j340807j381635j471341
2818.7G74809897j560092j649320j806855k024591k231479k482474k874851l436446
2835G56743789m198432n173981o270886p371962q522928r561717r682179q074820m867434
2853.3F93019450j173556J673698K897919K595663J386463j32501j399398j856982
2869.7F97010756j369060m74333J15573J43528k48194q75473j630902k397656l008902
2888F87265337l369749l527701l590524l689885l832221l909171l983736m243970m760086
2906.4F52358294n487025o437123p669985r001077r886205r739160q319438n787372
2922.7E90030909k592087O72936L417015N271495O374478P012546P191420O916523
$$ plain form
2939 624295235 630539179 635642946 639166534 640938520 641232789 640721738 640095651 639934182 640732348
2957.4 640732348 642675161 645591795 649143100 653042018 657113969 661227465 665304184 669239461
2973.7 669239461 672898889 676375985 679819047 683020234 685747087 688078284 690185130 692136824
2990 692136824 693763852 694796622 695282519 695467234 695460975 695287466 694937646 694456995 693990350 693574667
3010.4 693574667 693024635 692172885 691097558 689958274 688800752 687580705 686219752 684729576 683274686
3028.7 683274686 681923330 680562019 679078043 677491486 675936580 674397826 672690034 670788527
3045.1 670788527 668865561 667033732 665226877 663328528 661382973 659509301 657701254 655912638
3061.4 655912638 654169440 652532279 650941074 649236739 647415757 645645082 644068062 642600477
$$ packed form
2939F24295235O243944N103767L523588J771986K94269n11051o26087j61469P98166
2957.4F40732348J942813K916634L551305L898918M071951M113496M076719L935277
2973.7F69239461L659428L477096L443062L201187K726853K331197K106846J951694
2990F92136824J627028J032770M85897J84715o259j73509l49820m80651m66645m15683
3010.4F93574667n50032q51750j075327j139284j157522j220047j360953j490176j454890
3028.7F83274686j351356j361311j483976j586557j554906j538754j707792j901507
3045.1F70788527j922966j831829j806855j898349j945555j873672j808047j788616
3061.4F55912638j743198j637161j591205j704335j820982j770675j577020j467585
$$ plain form
3077.7 642600477 640980601 639169633 637363374 635632217 633910835 632122040 630212009 628260136
3094 628260136 626413584 624656498 622801304 620747864 618643403 616648316 614661634 612496912 610269010
3112.4 610269010 608200669 606168270 603919148 601397216 598751187 596192420 593726933 591218114
3128.7 591218114 588611901 585981548 583412886 580867410 578239560 575452626 572587729 569772184
3145 569772184 566960514 564131200 561330974 558443010 555357814 552194476 549081445 546057701 543108404
3163.4 543108404 540117502 537021875 533887386 530782759 527714431 524625897 521495998 518396437
3179.7 518396437 515344381 512301922 509246707 506160259 503081977 500055611 497030854 493936986
3196 493936986 490803242 487725168 484749854 481829017 478906155 476002008 473141283 470271111 467357188
$$ packed form
3077.7F42600477j619876j810968j806259j731157j721382j788795j910031j951873
3094F28260136j846552j757086j855194k053440k104461j995087j986682k164722k227902
3112.4F10269010k068341k032399k249122k521932k646029k558767k465487k508819
3128.7E91218114k606213k630353k568662k545476k627850k786934k864897k815545
3145E69772184k811670k829314k800226k887964l085196l163338l113031l023744k949297
3163.4E43108404k990902l095627l134489l104627l068328l088534l129899l099561
3179.7E18396437l052056l042459l055215l086448l078282l026366l024757l093868
3196D93936986l133744l078074k975314k920837k922862k904147k860725k870172k913923
$$ plain form
3214.3 467357188 464486450 461749643 459091187 456372321 453575939 450804979 448154807 445653260
3230.7 445653260 443181455 440575093 437918961 435394883 432968348 430563122 428206235 425907671
3247 425907671 423616916 421347737 419155568 416995227 414809823 412620783 410457462 408326358 406249315
3265.3 406249315 404266477 402359635 400411844 398377866 396323681 394283295 392268836 390303344
3281.6 390303344 388401836 386522949 384624779 382750988 380896002 379001021 377068847 375104338
3298 375104338 373127371 371238977 369496465 367740214 365767360 363605857 361431539 359380513 357435256
3316.3 357435256 355453819 353401542 351380706 349431634 347465843 345395863 343303472 341300696
3332.6 341300696 339379013 337504387 335595459 333594590 331566304 329513639 327500612 325640947
$$ packed form
3214.3D67357188k870738k736807k658456k718866k796382k770960k650172k501547
3230.7D45653260k471805k606362k656132k524078k426535k405226k356887k298564
3247D25907671k290755k269179k192169k160341k185404k189040k163321k131104k077043
3265.3D06249315j982838j906842j947791k033978k054185k040386k014459j965492
3281.6C90303344j901508j878887j898170j873791j854986j894981j932174j964509
3298C75104338j976967j888394j742512j756251j972854k161503k174318k051026j945257
3316.3C57435256j981437k052277k020836j949072j965791k069980k092391k002776
3332.6C41300696j921683j874626j908928k000869k028286k052665k013027j859665
$$ plain form
3348.9 325640947 323745877 321689934 319644570 317712963 315872371 314085871 312365055 310768098
3365.3 310768098 309231341 307568729 305750310 303995490 302458584 301061422 299721986 298452377
3381.6 298452377 297313958 296347260 295605868 295085579 294513643 293674499 292835742 292402804 292253762
3399.9 292253762 291876465 291204214 290689111 290496528 290448904 290419132 290357202 290319324 290402949 290616304
3420.3 290616304 290930092 291390896 292067021 292917997 293768227 294649094 295682311 296652377 297409356
3438.7 297409356 298218817 299331754 300696254 302183270 303700984 305249751 306883872 308626026
3455 308626026 310527235 312572837 314585328 316609204 318915993 321434796 323711753 325566977 327449560
3473.4 327449560 329675406 332153320 334674388 337030113 339365482 341930002 344565958 347128779
$$ packed form
3348.9C25640947j895070k055943k045364j931607j840592j786500j720816j596957
3365.3C10768098j536757j662612j818419j754820j536906j397162j339436j269609
3381.6B98452377j138419r66698p41392n20289n71936q39144q38757m32938j49042
3399.9B92253762l77297o72251n15103j92583m7624k9772o1930l7878Q3625K13355
3420.3B90616304L13788M60804O76125Q50976Q50230Q80867J033217R70066P56979
3438.7B97409356Q09461J112937J364500J487016J517714J548767J634121J742154
3455C08626026J901209K045602K012491K023876K306789K518803K276957J855224J882583
3473.4C27449560K225846K477914K521068K355725K335369K564520K635956K562821
$$ plain form
3489.7 347128779 349758029 352519393 355395913 358282834 361133397 364027828 366875678 369582027
3506 369582027 372393012 375538737 378875732 382094234 385117799 388167143 391463757 395077199 398666948
3524.4 398666948 401986271 405332476 408919156 412670881 416550010 420454353 424237937 428076923
3540.7 428076923 432172567 436419219 440513343 444435626 448515743 452874333 457278401 461684704
3557 461684704 466274440 470923573 475303382 479681343 484904379 490643054 495955050 500986755 506175578
3575.3 506175578 511577725 517142415 522757113 528184950 533581495 539490759 545704782 551524699
3591.7 551524699 557244956 563317478 569606781 575937331 582193613 588071644 593638301 599640429
3608 599640429 606101692 612450480 618587852 624387085 630469024 637351930 643734634 648865759 653521061
$$ packed form
3489.7C47128779K629250K761364K876520K886921K850563K894431K847850K706349
3506C69582027K810985L145725L336995L218502L023565L049344L296614L613442L589749
3524.4C98666948L319323L346205L586680L751725L879129L904343L783584L838986
3540.7D28076923M095644M246652M094124L922283M080117M358590M404068M406303
3557D61684704M589736M649133M379809M377961N223036N738675N311996N031705N188823
3575.3E06175578N402147N564690N614698N427837N396545N909264O214023N819917
3591.7E51524699N720257O072522O289303O330550O256282N878031N566657O002128
3608E99640429O461263O348788O137372N799233O081939O882906O382704N131125M655302
$$ plain form
3626.3 653521061 659438670 666503251 672503293 677801490 683088183 688279629 693347812 697964907
3642.6 697964907 701765895 705292523 710041583 715782464 720361233 724085033 728346467 732615471
3659 732615471 736117005 739094913 741630673 743714929 746077418 748881876 751126587 753624499 756865501
3677.3 756865501 759619296 761856973 763715923 765152037 766755879 768962860 771186531 773007751
3693.6 773007751 774507701 775725603 776816666 778127134 779469192 780273199 780594170 781121612 782516301
3712 782516301 784154892 785205543 785859764 786406755 786885023 787434042 788223803 788912058 789111733 789121270
3732.4 789121270 789625227 790921986 792078733 792121530 791635215 791998923 792761207 792950034 793621480
3750.7 793621480 795010328 795872390 796159387 796568692 797216713 797638118 797838628 798039854 798434794
$$ packed form
3626.3F53521061N917609P064581O000042N298197N286693N191446N068183M617095
3642.6F97964907L800988L526628M749060N740881M578769L723800M261434M269004
3659G32615471L501534K977908K535760K084256K362489K804458K244711K497912L241002
3677.3G56865501K753795K237677J858950J436114J603842K206981K223671J821220
3693.6G73007751J499950J217902J091063J310468J342058Q04007L20971N27442J394689
3712G82516301J638591J050651O54221N46991M78268N49019P89761O88255J99675R537
3732.4G89121270N03957J296759J156747M2797m86315L63708P62284J88827O71446
3750.7G93621480J388848Q62062K86997M09305O48021M21405K00510K01226L94940
$$ plain form
3769.1 798434794 799110413 799646914 799830317 799952388 800341427 800795078 800972700 801169515 801572978 801947534
3789.5 801947534 802105129 801953316 801720798 801556051 801409006 801692069 802148879 802460492 803111434 803642988
3809.9 803642988 803516507 803121209 803030312 802999139 802956879 803560436 804199457 804388821 804406881 804257572
3830.3 804257572 804028809 803823769 803714931 803943038 804434240 804963529 805456996 805584311 804988861 803793430
3850.7 803793430 803258121 804447830 805564046 805750310 805489123 805259347 805345535 805304646 805107057 805336595
3871.1 805336595 805803955 806147635 806087852 805767953 805747867 805947840 806280673 806481242 806249678 806215525
3891.5 806215525 806500435 806383133 805809498 805306911 805260777 805714428 806417644 806927502 807135105 807133734
3911.9 807133734 806893289 806604385 806599021 806749105 806738496 806691349 806748509 806746960 806719959 806876063 807141900
$$ packed form
3769.1G98434794O75619N36501J83403J22071L89039M53651J77622J96815M03463L74556
3789.5H01947534J57595j51813k32518j64747j47045K83063M56810L11613O50942N31554
3809.9H03642988j26481l95298r0897l1173m2260O03557O39021J89364J8060j49309
3830.3H04257572k28763k05040j08838K28107M91202N29289M93467J27315n95450j195431
3850.7H03793430n35309J189709J116216J86264k61187k29776Q6188m0889j97589K29538
3871.1H05336595M67360L43680n9783l19899k0086J99973L32833K00569k31564l4153
3891.5H06215525K84910j17302n73635n02587m6134M53651P03216N09858K07603j371
3911.9H07133734k40445k88904n364J50084j0609m7147N7160j549k7001J56104K65837
$$ plain form
3934.3 807141900 807237208 807095110 806915402 806924522 807052076 807117164 807195961 807349741 807484567 807526469 807497144
3956.7 807497144 807483494 807530522 807625353 807744801 807863295 807956815 807992935 808017075 808147967 808285117 808311701
3979.2 808311701 808364272 808471501 808525741 808540106 808570206 808590233 808546841 808525324 808647275
3997.5 808647275
$$ packed form
3934.3H07141900R5308j42098j79708R120J27554O5088P8797J53780J34826M1902k9325
3956.7H07497144j3650M7028R4831J19448J18494R3520L6120K4140J30892J37150K6584
3979.2H08311701N2571J07229N4240J4365L0100K0027m3392k1517J21951
3997.5H08647275
##END=$$ End of the data block
