##TITLE=$$ Begin of the data block
##JCAMP-DX=5.00 $$ ACD/SpecManager v 10.08
##SPECTROMETER/DATA SYSTEM=Alpha
##DATE=14 Apr 2014 11:23:48
##DATA TYPE=INFRARED SPECTRUM
##DATA CLASS=XYDATA
##ORIGIN=
##OWNER=
##NPOINTS=1765
##FIRSTX=399.75695801
##LASTX=3997.56933594
##MAXX=3997.56933594
##MINX=399.75695801
##MAXY=0.85118157
##MINY=0.29061931
##XFACTOR=1.0000000000
##YFACTOR=1.000000000000000e-9
##FIRSTY=0.63648826
##DELTAX=2.03957629
##XUNITS=1/CM
##YUNITS=ARBITRARY UNITS
##XYDATA=(X++(Y..Y))
399.8F36488259N54859j335978k799153k122999m69148j86682j488745k066076r49502
418.1F25624835K59698n26249j851082j616717q6367O14047l26097j369774r08971
436.5F19813323K13623R0599r85920j177907r0003N87463q5652j000702j011551k38001
456.9F16115272J71661o41346j341104r06706k40326m61340j493037j835644q25882
475.2F08541548j95145o88434j232445r87292l9637L59953o43790j712084j416325
493.6F01986349n53072n26667j211822j527488q58247o6578l67701j306236j604677
511.9E93963861j062989o03318j038671j801490j802266j163423p53224j107812j720011
530.3E82910657j535416o20603l14653r68933j310766p24554q8513l17037j169562
$$ plain form
399.8 636488259 637043118 635707140 632907987 630784988 630315840 630129158 628640413 626574337 625624835
418.1 625624835 625884533 625358284 623507202 621890485 621804118 622418165 622092068 620722294 619813323
436.5 619813323 620026946 620117545 619131625 617953718 617863715 618451178 618365526 617364824 616353273 616115272
456.9 616115272 616286933 615645587 614304483 613397777 613157451 612696111 611203074 609367430 608541548
475.2 608541548 608346403 607657969 606425524 605438232 605398595 605758548 605114758 603402674 601986349
493.6 601986349 601433277 600906610 599694788 598167300 597309053 597242475 596874774 595568538 593963861
511.9 593963861 592900872 592297554 591258883 589457393 587655127 586491704 585738480 584630668 582910657
530.3 582910657 581375241 580754638 580439985 579471052 578160286 577435732 577347219 577030182 575860620
548.6E75860620j492560r21786m45783r04084j745641j900494j444399j278997j872360
567E63854516k653182k654433j973450j640261k016186k382517k042711j309812j224041
585.4E45957923j736105j853108j354098r30906j063764j422345j516521j356542j268566
603.7E33455968j176775q47816k49744K10286J76072K67029J319825K868474L841996
622.1E39865315L947556L563046L345192L524363L731012L389180K649128K075553
638.4E66090345J740456J219153Q33035J541793K643049K445102P44819p91430J67847
656.7E76634169L503918N764902N144119L190816K479732L595829L333926K607047
673.1F06254458K515436K497315K604425K711356K424538J855969J599074J689255
$$ plain form
548.6 575860620 574368060 573446274 573000491 572096407 570350766 568450272 567005873 565726876 563854516
567 563854516 561201334 558546901 556573451 554933190 552917004 550534487 548491776 547181964 545957923
585.4 545957923 544221818 542368710 541014612 540083706 539019942 537597597 536081076 534724534 533455968
603.7 533455968 532279193 531431377 531181633 531391919 531567991 531835020 533154845 536023319 539865315
622.1 539865315 543812871 547375917 550721109 554245472 557976484 561365664 564014792 566090345
638.4 566090345 567830801 569049954 569882989 571424782 574067831 576512933 577257752 576466322 576634169
656.7 576634169 580138087 585902989 591047108 594237924 596717656 600313485 603647411 606254458
673.1 606254458 608769894 611267209 613871634 616582990 619007528 620863497 622462571 624151826
689.4F24151826J677453J246334O66677M59612P27832J032233J091660J165449J563609
707.7F33782685K069413K243877K041995J757145J760781K134204K532423K517879
724F50840402K240538K213955K476394K391994J767695J307607J416862J730084J706362
742.4F68091893J419008J404464J778841K044738J865565J403273J233398J652956
758.7F80894136J941383J552940J060903J096964J367807J277030O49988o4730l00229
777.1F89476192k33650m81367j083255j261532m70698P30037J561880K191067L190041
795.4F93618715M584908N615354N639374N031586M532575M327178L939689K969205
811.7G30258584J807451J185000R19223K10762j064241k291143l013015l395259l921270
$$ plain form
689.4 624151826 625829279 627075613 627742290 628201902 628929734 629961967 631053627 632219076 633782685
707.7 633782685 635852098 638095975 640137970 641895115 643655896 645790100 648322523 650840402
724 650840402 653080940 655294895 657771289 660163283 661930978 663238585 664655447 666385531 668091893
742.4 668091893 669510901 670915365 672694206 674738944 676604509 678007782 679241180 680894136
758.7 680894136 682835519 684388459 685449362 686546326 687914133 689191163 689841151 689776421 689476192
777.1 689476192 689242542 688761175 687677920 686416388 685945690 686675727 688237607 690428674 693618715
795.4 693618715 698203623 703818977 709458351 714489937 719022512 723349690 727289379 730258584
811.7 730258584 732066035 733251035 734170258 734381020 733316779 731025636 728012621 724617362 720696092
830.1G20696092m588664m758656m258692l643453l458500l579080l345371k355694
846.4F90707982p80344J033425K994299N034327O925404Q290708Q689523Q298576P838249
864.8G39032149P432461O567121N091488L551245K587795K180517J727342Q60989m8816
883.1G68982291m77493o25073j075328j711368j801432j029491J28150Q87275J012981
901.5G64290512R97364J236439J352370O60121p10964j873314k425552k855956l561914
919.8G57109106m033089l491521k045453o44445L9220K89500O92725J155972J098216
938.2G50170231M61519n5433o0916p0095p39395k004147l121614l708899m380882n748689
958.6G30741680p437945q844912j0058582j1469900j3061941j4218509j4220417j3042748
$$ plain form
830.1 720696092 716107428 711348772 707090080 703446627 699988127 696409047 693063676 690707982
846.4 690707982 689927638 690961063 693955362 698989689 705915093 714205801 722895324 731193900 739032149
864.8 739032149 746464610 753031731 758123219 761674464 764262259 766442776 768170118 769031107 768982291
883.1 768982291 768504798 767879725 766804397 765093029 763291597 762262106 762390256 763277531 764290512
901.5 764290512 765287876 766524315 767876685 768536806 767825842 765952528 763526976 760671020 757109106
919.8 757109106 753076017 749584496 747539043 746894598 746933818 747223318 747916043 749072015 750170231
938.2 750170231 750631750 750576317 750515401 750445306 749705911 747701764 744580150 740871251 736490369 730741680
958.6 730741680 723303735 714458823 704400241 692930341 679868400 665649891 651429474 638386726
974.9F38386726j1401951r976804q783162p556617o468535n813121n459428m983187
991.2E77943921m190028l393173k932012k741814k551615k319336k491653l438532
1007.5E53885758m750192n725801o140352o228804o211400o055415n639314n053640
1023.9E08080840m609167m448981m366457m073560l599823l196895k950877k708226
1040.2D78126854k366275k083301k041012k112359j910806j109093K20567J599133
1056.5D68323708K633154L235757L309816K551228R10759j062333k615244l348678
1072.8D73938167l378183l107816k823740k498567k209127k298236k802103l222257
1089.1D51598138l028125k070785o86973O10590J585156K264559K626211K524614K076745
$$ plain form
974.9 638386726 626984775 617007971 608224809 600668192 594199657 588386536 582927108 577943921
991.2 577943921 573753893 570360720 567428708 564686894 562135279 559815943 557324290 553885758
1007.5 553885758 549135566 543409765 537269413 531040609 524829209 518773794 513134480 508080840
1023.9 508080840 503471673 499022692 494656235 490582675 486982852 483785957 480835080 478126854
1040.2 478126854 475760579 473677278 471636266 469523907 467613101 466504008 466724575 468323708
1056.5 468323708 470956862 474192619 477502435 480053663 480964422 479902089 477286845 473938167
1072.8 473938167 470559984 467452168 464628428 462129861 459920734 457622498 454820395 451598138
1089.1 451598138 448570013 446499228 445812255 446422845 448008001 450272560 452898771 455423385 457500130
1107.5D57500130J579255J093089L96520p78705k528488m435897n279452l936022j263738
1125.8D42346692P91520J843363J876831R39488N29320J443862K719999L348946L178627
1144.2D59018648K637982K176523K007574K137542K429873K838641L509671M520207
1160.5D81276661N740494O953567Q003741Q855939R456039R594261R207845Q539737
1176.8E47628284P833600P076919O050288M602075K853513J089275n19455j882136
1193.1E74732363k718746k689779j851738o25550N45918J327336J583576J350105P40588
1211.5E72394073j7166o08027q52645q33392p24554n96106l55720O3121N29051R03487
1231.9E69902122J193464J482069J758337J892805J830697J619101J308441R51350
$$ plain form
1107.5 457500130 459079385 460172474 460568994 459790289 457261801 452825904 447546452 443610430 442346692
1125.8 442346692 443138212 444981575 446858406 447797894 448327214 449771076 452491075 455840021 459018648
1144.2 459018648 461656630 463833153 465840727 467978269 470408142 473246783 476756454 481276661
1160.5 481276661 487017155 493970722 501974463 510830402 520286441 529880702 539088547 547628284
1176.8 547628284 555461884 562538803 568589091 573191166 576044679 577133954 576614499 574732363
1193.1 574732363 572013617 569323838 567472100 566846550 567392468 568719804 570303380 571653485 572394073
1211.5 572394073 572376907 571768880 570916235 570082843 569358289 568762183 568406463 568469584 568998635 569902122
1231.9 569902122 571095586 572577655 574335992 576228797 578059494 579678595 580987036 581938386
1248.2E81938386N80788K39431M8697J32502M91201J022757J625239K272964K980530
1266.6E91332495L653050M206121M633605M952550N219579N413770N517245N597770
1282.9F30526185N692959N781591N742252N492389N117476M712522M319429L931046
1299.2F71315849L543377L196001K902508K632141K314686J954914J680195J510262
1315.5F91049933J434744J450002J447856J422525J377165J217246R16541N25713J27673
1333.9G00969398j41084j73330M0233L12268M64261N44906N51700M55916K86460R5546
1354.3G03406274j02877m53890j032650j528919j630366j566052j556575j676739k008855
1372.6F91849351k148807j704753j105547r43720j212716j303613j024783q36909j049578
$$ plain form
1248.2 581938386 582519174 582758605 582807302 582939804 583431005 584453762 586079001 588351965 591332495
1266.6 591332495 594985545 599191666 603825271 608777821 613997400 619411170 624928415 630526185
1282.9 630526185 636219144 642000735 647742987 653235376 658352852 663065374 667384803 671315849
1299.2 671315849 674859226 678055227 680957735 683589876 685904562 687859476 689539671 691049933
1315.5 691049933 692484677 693934679 695382535 696805060 698182225 699399471 700316012 700841725 700969398
1333.9 700969398 700828314 700654984 700695217 701007485 701471746 702016652 702568352 703024268 703310728 703406274
1354.3 703406274 703303397 702849507 701816857 700287938 698657572 697091520 695534945 693858206 691849351
1372.6 691849351 689700544 687995791 686890244 685946524 684733808 683430195 682405412 681568503 680518925
1391F80518925j464307j665652j687705j973689k392471k821863l077805k857864k586007
1409.3F59991562k423286k160370j905442j682222j117825n63860m33326l22878l02673
1427.7F49079680l95774l95239l98159n5015Q09848J045287P94053O67036Q31425J307309
1448.1F53290451J660227J594425J699507L507793O474972O318688N351245O056726
1464.4F85954034P138908P282675P929265R726524R616912P426381N516052M079938
1480.7G44670689K992869J804351N41747l91960p93994j229345k171636l081620l282666
1499.1G39058435l372490l894270n216241o284296m818440m104674m509627m565776
1515.4G02292621m016816l275395k883673k329647k058506k193272k131164k175689
$$ plain form
1391 680518925 679054618 677388966 675701261 673727572 671335101 668513238 665435433 662577569 659991562
1409.3 659991562 657568276 655407906 653502464 651820242 650702417 650138557 649705231 649382353 649079680
1427.7 649079680 648683906 648288667 647890508 647835493 648645341 649690628 650484681 651151717 651983142 653290451
1448.1 653290451 654950678 656545103 658244610 661752403 668227375 674546063 679897308 685954034
1464.4 685954034 693092942 700375617 708304882 718031406 727648318 735074699 740590751 744670689
1480.7 744670689 747663558 749467909 750009656 749617696 748823702 747594357 745422721 742341101 739058435
1499.1 739058435 735685945 731791675 726575434 720291138 715472698 711368024 706858397 702292621
1515.4 702292621 698275805 695000410 692116737 689787090 687728584 685535312 683404148 681228459
1531.7F81228459k071858j685202j880049k045334q18491K46406M47988M35233O08922
1550.1F74466074R76145J078188O81281Q91507K280354J698018L42190o09458j481592
1568.4F80322707k032399k438844l556370m951239m957795m999697n879999o587982
1584.7F44918382p084071p428349p658898p807434p938027p871390p740438p729530
1601.1E83660245p664502p497489p436395p497549p362366p129490p502913p819534
1617.4E23750007o302297n564570n930126n435407m735917m175454l400624k940536
1633.7D85265076k288729o13689M83811R13351J242161K162099L253877K844394L353595
1652D96615946N928159N591810M627049N048096O153047O865740O237745O570220P847846
$$ plain form
1531.7 681228459 679156601 677471399 675591350 673546016 672727525 672973931 673421919 673857152 674466074
1550.1 674466074 675442219 676520407 677201688 678093195 680373549 682071567 682413757 681804299 680322707
1568.4 680322707 678290308 675851464 672295094 667343855 662386060 657386363 651506364 644918382
1584.7 644918382 637834311 630405962 622747064 614939630 607001603 599130213 591389775 583660245
1601.1 583660245 575995743 568498254 561061859 553564310 546201944 539072454 531569541 523750007
1617.4 523750007 517447710 511883140 505953014 500517607 495781690 491606236 488205612 485265076
1633.7 485265076 482976347 482362658 482846469 483759820 485001981 487164080 490417957 493262351 496615946
1652 496615946 502544105 508135915 512762964 517811060 523964107 530829847 537067592 543637812 551485658
1670.4E51485658P557213P877290Q797407P941783O940722P641435J0507107J0198831
1686.7F18947446Q302033Q228064P537722P909000Q825362R200275J1045814R632885
1703F89628601P801235P672369O557226N374492M542231M130543M776835N007446M027009
1721.4G39517987L454029L302873K922773K647340K559543L565132M439116L566325
1737.7G65975118L520548M041016L923178L554702L336727L762365M240691L504932
1754G95859277K714098K496540K328396K449274K249003J592815J262903J300573J758874
1772.4H14011753K084195J652777J306653J349926J368702J255274J164436R24051
1788.7H25117767P81298J194000J340866R75907Q26359J008987J089811Q94010O93441
$$ plain form
1670.4 551485658 559042871 566920161 575717568 583659351 590600073 598241508 608748615 618947446
1686.7 618947446 627249479 635477543 643015265 650924265 659749627 668949902 679995716 689628601
1703 689628601 697429836 705102205 711659431 717033923 721576154 725706697 730483532 735490978 739517987
1721.4 739517987 742972016 746274889 749197662 751845002 754404545 757969677 762408793 765975118
1737.7 765975118 769495666 773536682 777459860 781014562 784351289 788113654 792354345 795859277
1754 795859277 798573375 801069915 803398311 805847585 808096588 809689403 810952306 812252879 814011753
1772.4 814011753 816095948 817748725 819055378 820405304 821774006 823029280 824193716 825117767
1788.7 825117767 825899065 827093065 828433931 829409838 830236197 831245184 832334995 833229005 833922446
1807H33922446O72459Q06511Q09312O57379O10233O47247M86791K60055K95698M01080
1827.4H39569211N58019Q24034P16805M55320M56333M05610Q3327N5373N66542P45416
1847.8H44435990N69224M35055L42130K95282K91884K95996K28286Q3029o0975R0658
1868.2H47006559M90487N34892L03090K08080K33650K05993J41323J14143Q3208O9141
1888.6H49390566J57535J80066J45018J99855J99615J05739L9101L5703M1842M1962
1909H50537002O6757O4850j7702n9247J0609J6451R2864K57552J90377k325o6042K385
1933.5H51093531L8087o6340k28107k06172L6358J18196m5537j41264p1048j2100q2493
1955.9H50433111j93357j85669q9228p4565j57297j82569j03950k146J6272j13428
$$ plain form
1807 833922446 834594905 835401416 836210728 836868107 837478340 838125587 838612378 838872433 839168131 839569211
1827.4 839569211 840127230 840951264 841668069 842123389 842579722 842985332 843068659 843124032 843690574 844435990
1847.8 844435990 845005214 845440269 845782399 846077681 846369565 846665561 846893847 846976876 846915901 847006559
1868.2 847006559 847497046 848031938 848335028 848543108 848776758 848982751 849124074 849238217 849321425 849390566
1888.6 849390566 849548101 849728167 849873185 850073040 850272655 850378394 850417495 850453198 850495040 850537002
1909 850537002 850603759 850668609 850650907 850591660 850602269 850618720 850711584 850969136 851159513 851157188 851091146 851093531
1933.5 851093531 851131618 851065278 850837171 850630999 850667357 850785553 850740016 850598752 850527704 850515604 850433111
1955.9 850433111 850239754 850054085 849964857 849890292 849732995 849550426 849446476 849444330 849460602 849347174
1976.3H49347174k20299j39653N305j5200j93834l07083j89662K8193J2636j90377
1996.7H48137200k30491o5148J3649j41322l24011k73109p5876l8267k20596l33011
2017.1H46449018k01524m1187o9975k42115l07500j58429j0610q9168k62022k67744
2037.5H44798744r0838K1398j18673k70187j87993j6571l218j56462k52366j37032
2057.9H43586802L2247k39j87158k23220l2782R9659J3470j42812j44542N96O7592
2080.3H43069613l9578j39832p1526M7088N3465m6908j04666j6511J07110Q2314m4286
2102.8H42896283q0169R954R3282M4584n4717l0220P5043R5069M5001K9028P5519J25945
2127.3H43324602J20103P3314N5432R9480J19865Q9228O3122Q4161J35661J43528J15096
$$ plain form
1976.3 849347174 849126875 848987222 848992527 848977327 848783493 848476410 848286748 848314941 848327577 848137200
1996.7 848137200 847906709 847841561 847855210 847713888 847389877 847116768 847040892 847002625 846782029 846449018
2017.1 846449018 846247494 846206307 846136332 845894217 845586717 845428288 845417678 845328510 845066488 844798744
2037.5 844798744 844707906 844729304 844610631 844340444 844152451 844135880 844132662 843976200 843723834 843586802
2057.9 843586802 843619049 843618810 843431652 843208432 843175650 843275309 843288779 843145967 843001425 843002021 843069613
2080.3 843069613 843030035 842890203 842818677 842865765 842919230 842872322 842767656 842751145 842858255 842940569 842896283
2102.8 842896283 842816114 842826068 842919350 842963934 842909217 842878997 842954040 843049109 843094110 843123138 843198657 843324602
2127.3 843324602 843444705 843518019 843573451 843672931 843792796 843882024 843945146 844029307 844164968 844308496 844423592
2149.7H44423592J05977J05500J14382J18732R7931J05977J14739Q5949R0242J47879
2170.1H45510900J87993J60694Q3745O5326J62661K29180J44005K8789O2049J63495
2190.5H46798837J34111j550n9486M0532J64866J28210j3173j7583J22368J81198O2466
2212.9H47540796p7605l1114J31130J41859l4272j29819J0550J76668J12235j00255
2233.3H47740173j59084K3484J74403K9921k30789k12073N0783J53482l5047k27452
2253.7H47307801j32739J41024J88887o2704k18093n1081J85966J43469j14322j72317
2274.1H47215891O4433K53558J38580j09434j34229O3002J66297O795j96874j18196
2294.5H47349823J44124J84714n6266k31624j34945P8678Q5414j35303k32935o5327
$$ plain form
2149.7 844423592 844529569 844635069 844749451 844868183 844966114 845072091 845186830 845272779 845363021 845510900
2170.1 845510900 845698893 845859587 845943332 846008658 846171319 846400499 846544504 846573293 846635342 846798837
2190.5 846798837 846932948 846931398 846871912 846912444 847077310 847205520 847192347 847174764 847297132 847478330 847540796
2212.9 847540796 847463191 847432077 847563207 847705066 847670794 847540975 847551525 847728193 847840428 847740173
2233.3 847740173 847581089 847604573 847778976 847808897 847578108 847366035 847416818 847570300 847535253 847307801
2253.7 847307801 847175062 847316086 847504973 847442269 847224176 847173095 847359061 847502530 847388208 847215891
2274.1 847215891 847280324 847533882 847672462 847563028 847428799 847491801 847658098 847664893 847468019 847349823
2294.5 847349823 847493947 847678661 847622395 847390771 847255826 847334504 847419918 847284615 847051680 846986353
2314.9H46986353P2480q3804k67983j60038L6478Q3983j133j35541j59502j7345R9957
2337.3H46453905J5557m4763L18885P51495M07457k93374o04570m73499k12073o4790
2357.7H46254230J9192J60873L14653M15623M49598M52280M86612N34475M88699L67701
2378.1H49943936K86758K81572K90632K30015R2685k6882j7106N2631M7326k6822p1884
2400.6H51082861l7729K9802O5684J312r3878p3492K2113L1948o7651j41084q1837
2423H50738049J8596o437j20640j70767q2374K1100m7147k09987k27392n8949N4419
2445.4H49908471o0141k25842k25186r7335k1279q7559j75714j41204l7670n2988j88351
2467.9H48595202k25067j10865l2544j12116k34247k17080r5248p3671j88947k68161
$$ plain form
2314.9 846986353 847058833 846975029 846707046 846547008 846583486 846667469 846666336 846530795 846371293 846353948 846453905
2337.3 846453905 846469462 846424699 846743584 847495079 847902536 847609162 847004592 846531093 846319020 846254230
2357.7 846254230 846273422 846434295 846748948 847164571 847614169 848066449 848553061 849087536 849576235 849943936
2378.1 849943936 850230694 850512266 850802898 851032913 851125598 851098716 851081610 851134241 851181567 851154745 851082861
2400.6 851082861 851045132 851074934 851140618 851141930 851048052 850974560 850996673 851028621 850960970 850819886 850738049
2423 850738049 850756645 850750208 850629568 850458801 850376427 850397527 850350380 850140393 849913001 849854052 849908471
2445.4 849908471 849848330 849622488 849397302 849299967 849278688 849191129 849015415 848874211 848836541 848783553 848595202
2467.9 848595202 848370135 848259270 848226726 848114610 847880363 847663283 847568035 847494364 847305417 847037256
2488.3H47037256k03967p0155k2531j10387k25246k15352r2268m9114j57118k47538
2508.7H45643580j73271o0439r4771k04742k13862j28328q4877j33276k02716j87337
2529H44159961r2685o6817j62959k46525k04086j13309j03891j54912j80960j64986
2549.4H42668831j41382j51753j86026j99259j85787j63258j62243k00212k38002k33233
2569.8H40807676k24828k54572k82883k67864k27272k17617k66194l18706l08633k79665
2590.2H38159442l11494l60727l57747l44575l57330l64124l69847l77476l78967l94940
2610.6H34542215m08471m05371l98636l97324m09425l95834l63410l87489m39227m31836
2631H30505192l97026m05729m12643l62992l26157l52740l87550m10735m20034m07398
$$ plain form
2488.3 847037256 846833289 846763134 846740603 846630216 846404970 846189618 846097350 846048236 845891118 845643580
2508.7 845643580 845470309 845409870 845315099 845110357 844896495 844768167 844683290 844550014 844347298 844159961
2529 844159961 844067276 844000459 843837500 843590975 843386889 843273580 843169689 843014777 842833817 842668831
2549.4 842668831 842527449 842375696 842189670 841990411 841804624 841641366 841479123 841278911 841040909 840807676
2569.8 840807676 840582848 840328276 840045393 839777529 839550257 839332640 839066446 838747740 838439107 838159442
2590.2 838159442 837847948 837487221 837129474 836784899 836427569 836063445 835693598 835316122 834937155 834542215
2610.6 834542215 834133744 833728373 833329737 832932413 832522988 832127154 831763744 831376255 830937028 830505192
2631 830505192 830108166 829702437 829289794 828926802 828600645 828247905 827860355 827449620 827029586 826622188
2651.4H26622188m01676l79860l40343l43859l70562l89337m14610m01199l49462l29495
2671.8H22901785l39925l42488l50833l89159m27365m23432l79026l58223l98219m48287
2692.2H19044828m50551m31299m37796m36426m47094n03600n23984n10335n44369n85378
2712.6H14173996n70893n31673n25832n35906n05924m69446m94898n53131n58674m85957
2733H08941662l96311l82900m29809m54784m57465m39525m27365m96328n65768n33461
2753.4H04357946m73142m86135n68569o28710o40988o51240o46711o43015o49690o56486
2773.8G98313260p14302p97927q38161q31544p90298p63238p99715q77798r48071r77874
2794.2G89974332r74298j013577j092434j112520j125455j191795j246214j283467
$$ plain form
2651.4 826622188 826220512 825840652 825500309 825156450 824785888 824396551 823981941 823580742 823231280 822901785
2671.8 822901785 822561860 822219372 821868539 821479380 821052015 820628583 820249557 819891334 819493115 819044828
2692.2 819044828 818594277 818162978 817725182 817288756 816841662 816338062 815814078 815303743 814759374 814173996
2712.6 814173996 813603103 813071430 812545598 812009692 811503768 811034322 810539424 809986293 809427619 808941662
2733 808941662 808545351 808162451 807732642 807277858 806820393 806380868 805953503 805457175 804891407 804357946
2753.4 804357946 803884804 803398669 802830100 802201390 801560402 800909162 800262451 799619436 798969746 798313260
2773.8 798313260 797598958 796801031 795962870 795131326 794341028 793577790 792778075 791900277 790952206 789974332
2794.2 789974332 789000034 787986457 786894023 785781503 784656048 783464253 782218039 780934572
2810.5G80934572j311540j331449j375854j456380j574159j687526j802683k004624
2826.8G68390357k254068k513349k874434l423453m195511n175173o245792p317007
2843.1G34391570q495748r594738r735883q107423m876555j162767J692772K895117
2859.5F97006345K558231J328766j38521j317024j781285j370728n33521O0797J59442
2877.8F95972502k04980q68380j634002k400875l011823l352940l499687l589510l706873
2896.2F73703432l836691l919661l986776m233778m767418n503237o443679p664979
2912.5F33347213r001195r884179r711027q296132n809069k634883O59943L443360
2928.8E92114031N325973O418646O994307P160723O912649O219506N076647L519058
$$ plain form
2810.5 780934572 779623032 778291583 776915729 775459349 773885190 772197664 770394981 768390357
2826.8 768390357 766136289 763622940 760748506 757325053 753129542 747954369 741708577 734391570
2843.1 734391570 725895822 716301084 706565201 698457778 693581223 692418456 694111228 697006345
2859.5 697006345 699564576 700893342 700754821 699437797 697656512 696285784 695752263 695813060 695972502
2877.8 695972502 695767522 694899142 693265140 690864265 687852442 684499502 680999815 677410305 673703432
2896.2 673703432 669866741 665947080 661960304 657726526 652959108 647455871 641012192 633347213
2912.5 633347213 624346018 614461839 604750812 596454680 590645611 588010728 588670671 592114031
2928.8 592114031 597440004 603858650 610852957 618013680 624926329 631145835 636222482 639741540
2945.1F39741540J766145L13997m60147n90504j46925P97272J924812K906383L562450
2963.5F49815023L915071M100800M135609M039824L887891L671945L533005L489971
2979.8F80589139L216446K733767K353132K098977J867056J554251J064837N91934
2996.1F96069539K92539M2260k23339m40180n09381m54188m21405n75721q80301j085877
3016.5F91813946j133979j144349j191437j311839j426399j412928j374304j406610
3032.8F81412101j497984j589596j560212j532554j686692j893282j947880j855552
3049.1F67848349j802743j890778j931787j854539j828074j822353j757204j653970
3065.5F53306901j577019j643181j774371j771807j603544j464129j588225j804650
$$ plain form
2945.1 639741540 641507685 641821682 641361535 640771031 640624106 641421378 643346190 646252573 649815023
2963.5 649815023 653730094 657830894 661966503 666006327 669894218 673566163 677099168 680589139
2979.8 680589139 683805585 686539352 688892484 690991461 692858517 694412768 695477605 696069539
2996.1 696069539 696362078 696404338 696180999 695740819 695231438 694777250 694355845 693780124 692899823 691813946
3016.5 691813946 690679967 689535618 688344181 687032342 685605943 684193015 682818711 681412101
3032.8 681412101 679914117 678324521 676764309 675231755 673545063 671651781 669703901 667848349
3049.1 667848349 666045606 664154828 662223041 660368502 658540428 656718075 654960871 653306901
3065.5 653306901 651729882 650086701 648312330 646540523 644936979 643472850 641884625 640079975
3081.8F40079975j814008j733243j720011j777888j889169j924455j839638j779914
3098.1F25601649j893997k098620k116680j982212j985729k153933k196967k051950
3114.4F09121561k042770k251923k506316k648771k584994k471924k493202k594650
3130.7E89527011k624750k577126k565205k656103k823650k882183k799213k779663
3147E67819118k802670k794265k892256l063619l130555l119111l053248k961696k995729
3165.4E41005969l114819l148139l088295l047228l088415l144503l110349l054917
3181.7E16209304l057539l071606l066063l046811l068328l126383l130346l087223
3198D91555005l046006k971738k907276k901793k875268k839566k862244k888144k875953
$$ plain form
3081.8 640079975 638265967 636532724 634812713 633034825 631145656 629221201 627381563 625601649
3098.1 625601649 623707652 621609032 619492352 617510140 615524411 613370478 611173511 609121561
3114.4 609121561 607078791 604826868 602320552 599671781 597086787 594614863 592121661 589527011
3130.7 589527011 586902261 584325135 581759930 579103827 576280177 573397994 570598781 567819118
3147 567819118 565016448 562222183 559329927 556266308 553135753 550016642 546963394 544001698 541005969
3165.4 541005969 537891150 534743011 531654716 528607488 525519073 522374570 519264221 516209304
3181.7 516209304 513151765 510080159 507014096 503967285 500898957 497772574 494642228 491555005
3198 491555005 488508999 485537261 482629985 479728192 476852924 474013358 471151114 468262970 465387017
3216.4D65387017k841831k776414k720803k720117k718956k656728k572179k541661
3232.7D43838328k597481k621323k523541k434999k424002k394527k313107k287269
3249D24242079k287358k218187k175897k189487k159089k096206k093881k109170k018750
3267.4D04894054j898080j941890k061099k064913k010703j980960j979709j970083
3283.7C88986617j932740j903117j846909j802236j837879j886726j949400k021968
3300C73805642j958728j789123j793146k005428k179801k171844k059669k003193j987248
3318.4C55857462j952023j928657j940370k027541k125621k098739k004623j935035
3334.7C39844853j898825j962156k045124k004922j983911j993954j896441j896471
$$ plain form
3216.4 465387017 462545186 459768772 457047969 454327852 451608896 448952168 446379989 443838328
3232.7 443838328 441240847 438619524 436095983 433660984 431236982 428842455 426529348 424242079
3249 424242079 421954721 419736534 417560637 415371150 413212061 411115855 409021974 406912804 404894054
3267.4 404894054 402995974 401054084 398992985 396928072 394917369 392936409 390956700 388986617
3283.7 388986617 387053877 385150760 383303851 381501615 379663736 377777010 375827610 373805642
3300 373805642 371846914 370057791 368264645 366259217 364079416 361907572 359847903 357844710 355857462
3318.4 355857462 353905439 351976782 350036412 348008871 345883250 343784511 341779888 339844853
3334.7 339844853 337946028 335983872 333938748 331933826 329949915 327955961 326059520 324163049
3351C24163049k041786k056838j925200j824468j810551j777500j629978j532614j653791
3369.3C07910323j832723j795829j558840j352131j263053j246601j159906r75788
3385.7B96725452p63685n59628n76943q08418p87943l99649j75357m17084o83516n15550
3406.1B91037679j87457l7789l4213q6963p1943M5210J89990L37541N01871O99550
3426.5B92393476Q76724Q73983Q89510J042933R77814P55816Q17776J130462J360893
3444.8C01119387J448959J512110J624018J716078J761555J870186K007544J957833
3461.1C15017670J960218K317250K569705K257496J819999J921117K264648K470702
3477.4C32598805K525688K388000K374113K597421K643049K524167K590358K782733
$$ plain form
3351 324163049 322121263 320064425 318139225 316314757 314504206 312726706 311096728 309564114 307910323
3369.3 307910323 306077600 304281771 302722931 301370800 300107747 298861146 297701240 296725452
3385.7 296725452 295961767 295402139 294825196 294016778 293228835 292829186 292653829 292236745 291553229 291037679
3406.1 291037679 290850222 290812433 290778220 290691257 290619314 290664524 290854514 291192055 291693926 292393476
3426.5 292393476 293270200 294144183 295033693 296076626 297054440 297810256 298628032 299758494 301119387
3444.8 301119387 302568346 304080456 305704474 307420552 309182107 311052293 313059837 315017670
3461.1 315017670 316977888 319295138 321864843 324122339 325942338 327863455 330128103 332598805
3477.4 332598805 335124493 337512493 339886606 342484027 345127076 347651243 350241601 353024334
3493.8C53024334K915233K878130K842575K933293K864868K684146K804995L155470
3510.1C76103044L377527L270566L016144L010482L257274L558368L579229L396779
3526.4D02569413L444106L624051L725142L862470L908724L763556L828973M113912
3542.7D32840347M296989M176616L973067M079759M354596M435569M443616M586607
3559D67187166M630208M395843M412740N263359N783557N299002M995615N201161N421280
3577.4E12589931N571306N616904N413651N416751N975962O252288N812943N724013
3593.7E58373749O111145O323755O373286O313384N917549N579829N972326O420553
3610F07385576O320119O131470N853236O120622O878972O402790N125106M612088N940616
$$ plain form
3493.8 353024334 355939567 358817697 361660272 364593565 367458433 370142579 372947574 376103044
3510.1 376103044 379480571 382751137 385767281 388777763 392035037 395593405 399172634 402569413
3526.4 402569413 406013519 409637570 413362712 417225182 421133906 424897462 428726435 432840347
3542.7 432840347 437137336 441313952 445287019 449366778 453721374 458156943 462600559 467187166
3559 467187166 471817374 476213217 480625957 485889316 491672873 496971875 501967490 507168651 512589931
3577.4 512589931 518161237 523778141 529191792 534608543 540584505 546836793 552649736 558373749
3593.7 558373749 564484894 570808649 577181935 583495319 589412868 594992697 600965023 607385576
3610 607385576 613705695 619837165 625690401 631811023 638689995 645092785 650217891 654829979 660770595
3628.4F60770595P153809O008804N223632N240381N196511N063653M593373L793835
3644.7G03044593L584624M873097N765736M459083L607452M213452M249513L479600
3661G37277150K995610K598644K106189K313555K725839K176941K507686L323436K809227
3679.4G60834277K228200J787305J341641J536727K216458K324879J921058J526415
3695.7G75716960J214385J101554J318931J345456P95305K84433N01812J412511J685977
3714G85377324J086831O16252N05448N34951N94259P59899O84142K35200K742M26888
3734.4G90823936J227618J147985L8088n12839L55840P73013J83999O59466J433134
3752.8G96130240R10640K56002L69966O57141M33564K23339K41279M03285O61552N29290
$$ plain form
3628.4 660770595 667924404 673933208 679156840 684397221 689593732 694657385 699250758 703044593
3644.7 703044593 706629217 711502314 717268050 721727133 725334585 729548037 733797550 737277150
3661 737277150 740272760 742871404 744977593 747291148 750016987 752193928 754701614 758025050 760834277
3679.4 760834277 763062477 764849782 766191423 767728150 769944608 772269487 774190545 775716960
3695.7 775716960 776931345 778032899 779351830 780697286 781492591 781777024 782278836 783691347 785377324
3714 785377324 786464155 787080407 787585855 788120806 788715065 789474964 790159106 790394306 790397048 790823936
3734.4 790823936 792051554 793199539 793237627 792724788 793080628 793853641 794037640 794697106 796130240
3752.8 796130240 797040880 797296882 797666848 798323989 798757553 798980892 799222171 799625456 800287008 800816298
3773.2H00816298J79946J38342M05610M42386J71184J96099L96789L85105J72854j42992
3793.6H03161621k09510j51932k03252K19166N07176M01735O99401N44846j62899m73440
3814H04332912j42455j8120o3479N29349O66380L16381O8128j88708k27332k20537
3834.4H05052519j91391K03491N32567N46873N10394J85669n56827j236260n80668
3852.7H04466367J225292J109302J06395l42190k59877J15335j1027j74224L18289
3871.1H06553662N61058L17455j50740l74675n1141J63495L15786K68459j05560L6657
3891.5H07534456K67983j46270n56231m98294j29760M06206P39455N12660J80363o795
3911.9H08303773k19643k56538K0325J72496n543o7771P1109K5689m0650J64449K80678
$$ plain form
3773.2 800816298 800996244 801134586 801540196 801982582 802153766 802349865 802746654 803131759 803304613 803161621
3793.6 803161621 802952111 802800179 802596927 802816093 803323269 803725004 804424405 804969251 804806352 804332912
3814 804332912 804190457 804172337 804108858 804638207 805304587 805620968 805689096 805500388 805273056 805052519
3834.4 805052519 804861128 805064619 805597186 806144059 806654453 806840122 806283295 805047035 804466367
3852.7 804466367 805691659 806800961 806907356 806565166 806305289 806420624 806409597 806235373 806553662
3871.1 806553662 807114720 807432175 807281435 806906760 806855619 807019114 807334900 807603359 807497799 807534456
3891.5 807534456 807802439 807656169 807099938 806601644 806471884 806878090 807617545 808130205 808310568 808303773
3911.9 808303773 808084130 807827592 807847917 808020413 808014870 807947099 808018208 808043897 808003247 808167696 808448374
3934.3H08448374O3896j53899j29878M5120R8646K9147N6743J19508J05977P2419O1930
3956.7H08817983M1961J0550K6644Q2254J03176O2108k8849n4061Q5711J80125J30594
3979.2H09458196Q0347L6359L3259R7692J14680K6226l4750O6221J93536
3997.5H10071766
$$ plain form
3934.3 808448374 808512270 808358371 808228493 808273613 808372259 808401406 808458149 808577657 808683634 808756053 808817983
3956.7 808817983 808859944 808870494 808897138 808979392 809082568 809144676 809115827 809061766 809147477 809327602 809458196
3979.2 809458196 809538543 809574902 809608161 809705853 809820533 809846759 809812009 809878230 810071766
3997.5 810071766
##END=$$ End of the data block
