##TITLE=$$ Begin of the data block
##JCAMP-DX=5.00 $$ ACD/SpecManager v 10.08
##SPECTROMETER/DATA SYSTEM=Alpha
##DATE=14 Apr 2014 11:23:48
##DATA TYPE=INFRARED SPECTRUM
##DATA CLASS=XYDATA
##ORIGIN=
##OWNER=
##NPOINTS=1765
##FIRSTX=399.75695801
##LASTX=3997.56933594
##MAXX=3997.56933594
##MINX=399.75695801
##MAXY=0.83778566
##MINY=0.17152870
##XFACTOR=1.0000000000
##YFACTOR=1.000000000000000e-9
##FIRSTY=0.53553671
##DELTAX=2.03957629
##XUNITS=1/CM
##YUNITS=ARBITRARY UNITS
##XYDATA=(X++(Y..Y))
399.8 535536706 532193065 529404342 528884709 528321803 525741041 523177207 522921383 523530185 521901786
418.1 521901786 518684626 517914236 519407213 520023108 518263221 516327620 516314685 516648769 515032053
436.5 515032053 512803197 512718022 514098287 514120579 512619972 511936069 512772143 513061523 511482060
454.8 511482060 509612083 509284079 509527981 508448124 506413341 505215764 505058408 504244804 502020061
473.2 502020061 500024855 499494284 499266237 497861922 495884538 495059609 495327264 494842887 492942870
491.5 492942870 491178602 490613401 489965826 488026142 485779613 484774083 484574229 483587027 481556505
509.9 481556505 479746968 478938609 478094518 475982010 473485053 472040713 471090883 469135463 466313124
528.3 466313124 464291543 463637143 462927103 460999191 459009916 458531797 458848059 458015174 455963969
546.6 455963969 454581231 454447091 453929871 451935142 449593514 448240131 447069585 444544822 441017061
565 441017061 438168585 436233461 433582932 429685593 426156193 424159855 422603726 419967115 416877836
583.3 416877836 414876103 413771719 411983460 409022391 406297624 404857427 403727263 401331365
599.6 401331365 397911310 395198762 393899918 393111765 392126173 391384214 391570657 392541826 393982738
618 393982738 396463186 400560796 405555934 409868121 413109541 416530192 420984387 425428182 428435683
636.3 428435683 430283487 432138830 433954388 435136497 436533988 439223558 442210168 443203241 441885918
654.7 441885918 441802055 446500093 454254210 460663915 464187533 467284888 472617924 477082372 479618549
673.1 479618549 481840312 485083163 489195496 492414623 494127333 495853871 498681754 501460969
689.4 501460969 502756774 503169596 504347920 506364405 507650852 507715285 508281827 510623753 513603985
707.7 513603985 515579998 517054975 519845903 523887098 527134597 528926134 531216919 535250843
724 535250843 539487422 542050540 543613732 546207726 549814284 552450538 553491056 554800034 557710409
742.4 557710409 560877085 562507212 563394547 565612495 569020927 571513414 572501957 573807955 576687992
760.8 576687992 579825759 581454873 582345247 584447443 587553382 589436114 589270532 588800609 589310229
779.1 589310229 589515626 587847650 585446477 584787488 586203992 588001490 589811206 593474150 600070238
797.5 600070238 607958376 614968538 621207118 628111243 635431349 640989542 644056618 646526277
813.8 646526277 649693251 652141452 652026594 649927735 647728145 645393550 641167462 634814143 628320038
832.1 628320038 623116851 618261278 612369061 606099606 601111829 597505391 594194770 591410160
848.5 591410160 591193438 595061660 602228940 610864222 620484829 631923020 644869089 657213986
864.8 657213986 667509556 676599681 685676098 693816304 699230850 702202320 704698026 707092106
881.1 707092106 707623482 705485642 702290058 699806094 697707236 694824874 691891074 691057205 692718506
899.4 692718506 694934189 696272492 697451532 699405313 701014698 700317681 697242916 693438888 689657390
917.8 689657390 685018122 679301143 674329102 671945572 671706259 671891749 672075391 673174083 675238490
936.2 675238490 676865041 677174509 677060604 677632332 678206861 677089214 673953891 669953823 665462136
954.5 665462136 659215987 650231659 639218271 627155840 613532066 597140849 578211784 558559895
970.8 558559895 539664507 521823108 505234361 490644127 478503436 468173116 458537817 449369937
987.1 449369937 441393405 434998423 429672837 424858749 420770675 417876482 415883780 413808197
1003.5 413808197 410900563 407080412 402445465 396727204 389800727 382354587 375392705 369263083
1019.8 369263083 363573104 358022064 352864832 348364562 344259530 340189338 336272508 332942128
1036.1 332942128 330298543 327936769 325492769 323070705 320888489 318761438 316468477 314454168
1052.4 314454168 313688666 314748883 317317545 320603341 323910028 326568723 327714324 326647937
1068.7 326647937 323591322 319707453 316038311 312817097 309846401 307116002 304663599 302107930
1085 302107930 298875690 294909418 290893048 287728280 285897613 285324126 285809845 287236750 289252788
1103.4 289252788 291250348 292859614 294110119 295033306 295241743 294057399 291018397 286207527 280751377
1121.8 280751377 276841223 275915921 277223825 279096156 280264765 280406117 280607194 282166094 285081178
1140.1 285081178 288382113 291251451 293506593 295451730 297376990 299324274 301451296 304205447
1156.4 304205447 308003962 312958032 319025606 326360434 335199952 345357776 356119424 366758317
1172.7 366758317 377070576 387122363 396665275 405188411 412387043 418227077 422515929 424789220
1189.1 424789220 424875170 423373342 421302676 419418365 418159842 418032289 419480145 422294170 425490230
1207.4 425490230 428063035 429764420 430903733 431670338 432001472 431961030 431964129 432418853 433279097 434310347
1227.8 434310347 435593575 437434644 439873159 442524642 445052654 447580248 450331420 453046978
1244.1 453046978 455159783 456509411 457478344 458376557 459112436 459652364 460429668 462064922 464720339
1262.5 464720339 468058109 471953601 476676643 482356548 488609314 494932413 501342654 508183897
1278.8 508183897 515446961 522701442 529774070 537058234 544817567 552538395 559497118 565655529
1295.1 565655529 571504056 577161431 582115948 586082816 589568198 593108952 596410692 598840356
1311.4 598840356 600525796 602218688 604178965 605952382 607280016 608598471 610332966 612100840
1327.8 612100840 613160491 613463759 613586247 613790512 613745868 613357306 613232434 613770723 614580691 615030885
1348.1 615030885 615085602 615214527 615480959 615309358 614286065 612660527 610975802 609373271 607412398
1366.5 607412398 605110109 603150785 601529837 599620700 597179294 593946815 589327753 584028423
1382.8 584028423 580780447 581053376 582955718 584152520 583994448 582610726 580616534 578350961 575776935
1401.2 575776935 572508931 568487883 564686179 561517358 558593392 555763900 553177357 550972104
1417.5 550972104 549410343 548458457 547611058 546944618 546625912 546362281 546092749 545971572 546394646
1435.9 546394646 547893763 549800217 551571488 553408802 555700898 558675349 562058389 565504432
1452.2 565504432 569359124 575392723 584417999 592976034 600569308 609126389 618696988 627819300
1468.5 627819300 637177110 648612916 660491407 670189381 677635849 683398783 687996745 691160917
1484.8 691160917 692523003 692396641 691742659 690804303 688592732 684688509 680438399 676649153 672570467
1503.2 672570467 666244209 657176256 650069892 644589782 638568997 632144809 626306713 621718466
1519.5 621718466 617569923 613695204 610052288 606422305 603290796 600070715 596414566 593412042
1535.8 593412042 590770483 587620378 585343719 584489763 584295273 584567904 585177064 586028814 586933911
1554.1 586933911 587687910 588512957 590125322 591389179 591462195 590535760 588475764 585310578 581776857
1572.5 581776857 577213645 570749700 564245164 557865739 550490797 542498231 534137130 525321305
1588.8 525321305 516158819 506999850 497909129 488920927 480042756 471235722 462616146 454218209
1605.1 454218209 445781112 437149376 428748548 420847714 412531912 403528482 396265298 390035510
1621.4 390035510 383266330 376917303 371344298 366427600 362564445 359245360 356140673 354576319
1637.8 354576319 354453623 354980022 355915666 357593894 360318542 363116205 366504252 372071862 377661169
1656.1 377661169 382696301 388295621 395051897 402622521 409793586 417560905 426842511 435944170
1672.4 435944170 445472777 456150025 466278136 475674272 485972166 499285132 512230873 523384690
1688.8 523384690 534723699 545288146 556256175 568374813 581107795 596018076 608997524
1703 608997524 619706988 630417764 639968336 648005664 654806495 661003947 667993784 675309002
1719.3 675309002 681387365 686626434 691733062 696595609 701083541 705053747 709603786 715226412
1735.7 715226412 720269024 724968016 729893625 734957933 740052819 744946837 749824584 755013466
1752 755013466 759852231 764052570 767719805 770840704 774026811 777333140 780026019 781959593 783622563
1770.3 783622563 785797954 788558662 790921390 792717636 794511080 796509802 798395038 799999475
1786.7 799999475 801302612 802439213 803963780 805725932 807144761 808340669 809721768 811199963
1803 811199963 812411070 813372135 814332426 815408349 816434622 817282021 818104386 819041491 819806516
1821.3 819806516 820210993 820631921 821290910 822049916 822959721 823810279 824444592 825121224 825766325 825989604
1841.7 825989604 826005161 826633573 827682137 828473449 828947663 829360962 829889536 830402255 830735862 830959320
1862.1 830959320 831205487 831356883 831424356 831799209 832486928 833151460 833635092 833880365 833976984 834189773
1882.5 834189773 834565997 834787726 834739029 834855497 835279524 835653543 835840881 835951567 836149156 836441636
1902.9 836441636 836629629 836609244 836583972 836815059 837147951 837165773 836919963 836936355 837207913 837380409
1923.3 837380409 837442636 837498128 837634563 837785661 837753594 837582886 837531447 837571502 837434351 837180972
1943.7 837180972 837088823 837189615 837293029 837197006 836923957 836720347 836671650 836599469 836390913 836126328
1964.1 836126328 835953832 835930765 835867286 835658073 835497856 835465133 835393727 835183203 834969342 834864795
1984.5 834864795 834785461 834582806 834243774 834011137 834012389 833984077 833746970 833464742 833265722 833107352
2004.9 833107352 832895279 832595587 832297623 832071781 831836939 831523836 831210494 830983758 830808640 830561042
2025.3 830561042 830237865 829928279 829690874 829488754 829209447 828860879 828564405 828381002 828237116 828034461
2045.7 828034461 827784300 827574193 827417672 827241600 827000618 826788902 826681256 826561272 826341271 826119900
2066.1 826119900 826000988 825928450 825812519 825666368 825582683 825564146 825518310 825386226 825222373 825119138
2086.5 825119138 825050950 824955404 824815631 824704170 824694812 824716985 824669600 824583352 824558973 824614525 824642956
2108.9 824642956 824570596 824482679 824467063 824499726 824501157 824484706 824547648 824692190 824810326 824850678 824892163
2131.3 824892163 824990749 825094223 825139880 825180590 825281739 825425029 825569391 825691998 825803459 825931311
2151.7 825931311 826083302 826232910 826357901 826468468 826607585 826784134 826946616 827082217 827242076 827438474
2172.1 827438474 827626228 827782750 827915490 828064919 828262806 828453064 828574061 828652978 828743815 828840554
2192.5 828840554 828917921 828993797 829081953 829169869 829242349 829285681 829318166 829390049 829495668 829557478 829569280
2215 829569280 829611003 829695463 829749286 829733729 829701483 829703152 829738736 829773128 829751909 829711199 829735577 829778433
2239.4 829778433 829732537 829623282 829556823 829537034 829500198 829417288 829312682 829254568 829273343 829285622 829213798
2261.9 829213798 829153121 829203844 829279006 829271853 829224765 829249322 829334676 829375625 829401135 829523802 829716086
2284.3 829716086 829820216 829773664 829719841 829805255 829948306 829997182 829967916 829964399 830042005 830123544 830099881
2306.7 830099881 830038846 830071568 830172777 830232978 830190897 830087364 830026925 830045164 830072403 830045104 830079794
2329.2 830079794 830225646 830311835 830292463 830286562 830337882 830414712 830574214 830971241 831537604 831881106 831790924
2351.6 831790924 831383526 830998302 830911577 831028521 831174672 831427693 831823587 832273126 832737029 833154917
2372 833154917 833601713 834220052 834869981 835387170 835835934 836285472 836660743 836872756 836958826 837043405
2392.4 837043405 837175906 837287843 837326527 837347150 837409139 837480128 837501645 837473929 837463558 837507784 837570310
2414.8 837570310 837573528 837491453 837392330 837309122 837198973 837070644 836983860 836956501 836955011 836905301 836791277
2437.3 836791277 836698353 836654842 836595416 836497426 836387396 836279690 836172402 836059272 835948646 835842431
2457.7 835842431 835730314 835606933 835465848 835308313 835168839 835066199 834932923 834721565 834504068 834349036
2478.1 834349036 834224761 834074676 833875000 833641887 833455563 833355367 833247244 833072901 832903385 832764328
2498.5 832764328 832604766 832427263 832263768 832129717 832012057 831853926 831659973 831482589 831306756 831103384
2518.9 831103384 830883324 830691218 830557942 830431819 830235064 829972506 829737902 829575002 829411626 829193771
2539.2 829193771 828963578 828775108 828623831 828454971 828238606 828031659 827870727 827673793 827399373 827145696
2559.6 827145696 826958120 826740205 826436281 826124012 825879216 825649023 825318098 824874222 824453056 824142992
2580 824142992 823842466 823432744 822970033 822567701 822193086 821750641 821261227 820790946 820332587 819841504
2600.4 819841504 819283068 818698764 818168521 817654669 817066967 816433311 815843344 815298855 814737976 814132988
2620.8 814132988 813511789 812906384 812304139 811659634 810982406 810338855 809755802 809204280 808653951 808104575
2641.2 808104575 807556629 806990802 806381762 805763006 805182993 804618776 804059923 803497076 802908957 802337825
2661.6 802337825 801791131 801217079 800616324 800042331 799534798 799040973 798493326 797918379 797334015 796734154
2682 796734154 796131790 795521855 794905066 794300139 793705583 793083191 792416871 791741014 791053355 790327609
2702.4 790327609 789586782 788862348 788140297 787391245 786623120 785861552 785108447 784355044 783594012 782818019
2722.8 782818019 782055020 781331599 780596375 779838502 779117465 778440952 777772307 777057648 776291132 775542796
2743.2 775542796 774834454 774138093 773431301 772693515 771920741 771120310 770318389 769508183 768665314 767812610
2763.6 767812610 766962171 766087353 765146494 764157355 763174295 762178302 761142373 760080814 759001076
2782 759001076 757884860 756694496 755468249 754289210 753079474 751749933 750380635 749008477 747601449
2800.3 747601449 746168435 744676113 743095815 741478205 739837706 738143802 736399293 734608233
2816.6 734608233 732774258 730886698 728881121 726743639 724523604 722185552 719605207 716717243
2832.9 716717243 713504136 709849954 705558121 700410843 694253087 687130034 679443359 672107697
2849.3 672107697 666271389 662613392 660973430 660649896 660784006 660592198 659592211 657635868 654880881
2867.6 654880881 651789665 648934364 646631122 644779861 643135786 641522527 639762044 637709975
2883.9 637709975 635328829 632664919 629810274 626837969 623751819 620536029 617246032 613930583
2900.2 613930583 610494792 606779039 602669597 598063409 592799366 586707711 579883456 572903812
2916.6 572903812 566534340 561286747 557450354 555209398 554574132 555329502 557045996 559417665 562468350
2934.9 562468350 566180348 570284367 574454606 578381300 581727803 584216118 585756838 586538255
2951.2 586538255 586925805 587288797 587956965 589162529 590952456 593189776 595691800 598280370 600803018
2969.6 600803018 603199184 605415881 607380152 609132826 610747933 612202168 613514066 614729702
2985.9 614729702 615810096 616740704 617461324 617787421 617692530 617297173 616661966 615833879 614825964
3004.3 614825964 613670230 612479806 611317396 610078692 608586669 606837988 604984105 603097618
3020.6 603097618 601133585 599019349 596787870 594587564 592429876 590203881 587844312 585397482
3036.9 585397482 582998335 580593526 578017771 575321496 572632134 569962740 567266345 564517200
3053.2 564517200 561777949 559086442 556374073 553659141 551045716 548541009 546052456 543477237
3069.5 543477237 540858209 538307488 535846233 533440590 530960262 528339982 525706470 523110271
3085.8 523110271 520485282 517831147 515157640 512435257 509703934 507014155 504279077 501408637
3102.2 501408637 498483539 495605379 492734790 489776254 486784995 483861625 480943739 477921814
3118.5 477921814 474709719 471317172 467914730 464621037 461389989 458114088 454736531 451328129
3134.8 451328129 447989464 444671273 441213965 437612474 434033662 430515289 427019089 423573166
3151.1 423573166 420087367 416453838 412776470 409126818 405473858 401870221 398326665 394756049
3167.4 394756049 391147166 387570858 384029359 380467027 376889825 373360366 369887948 366435081
3183.7 366435081 362982780 359546453 356147647 352779359 349419773 346067637 342763394 339524627
3200.1 339524627 336338222 333175540 330045015 326987267 323984712 320983380 317998081 315102100
3216.4 315102100 312272459 309460521 306665897 303893328 301171839 298507869 295929968 293457329
3232.7 293457329 290970236 288429201 285953403 283586234 281289309 279037982 276835680 274644077
3249 274644077 272447526 270329505 268308431 266288698 264233291 262208790 260242462 258295804 256370693
3267.4 256370693 254524291 252709985 250827551 248917818 247046709 245218277 243419215 241616264
3283.7 241616264 239834011 238122463 236452714 234786466 233113825 231397152 229619578 227831334
3300 227831334 226112023 224496663 222878650 221158877 219364166 217538550 215758517 214058593 212395772
3318.4 212395772 210784420 209228411 207663432 206042960 204422623 202886388 201391578 199906498
3334.7 199906498 198465854 197041810 195593134 194149330 192703187 191266879 189994693 188802496
3351 188802496 187444702 186011672 184706807 183536947 182424411 181360051 180429861 179607600 178685188
3369.3 178685188 177549168 176395640 175491616 174812660 174207225 173602462 173028320 172582909 172356144
3387.7 172356144 172319800 172202110 171841025 171535999 171604052 171889320 171951517 171690896 171528697 171686441
3408.1 171686441 171992257 172311574 172631174 172992557 173424006 173887104 174378157 175012022 175848812 176828489
3428.5 176828489 177831396 178906411 180111066 181180507 181983978 182820156 183916956 185230151 186677963
3446.8 186677963 188133940 189584866 191160232 192883149 194705933 196654379 198609963 200524032
3463.2 200524032 202660441 205019668 207162470 208894759 210631967 212703705 215104133 217596725
3479.5 217596725 219859630 222034380 224438578 226965472 229475215 232071802 234790221 237593338
3495.8 237593338 240388587 243212104 246121585 248937175 251648843 254527241 257648826 260938704
3512.1 260938704 264271557 267481565 270666122 274039805 277684957 281334966 284810901 288384587
3528.4 288384587 292197794 296112865 300140470 304247618 308271378 312408954 316826522 321377963
3544.7 321377963 325811565 330115139 334542811 339212239 343987823 348819166 353845954 358974338
3561.1 358974338 363904685 368811935 374427795 380560338 386425018 392118126 397988260 404050469
3577.4 404050469 410311401 416738361 423088610 429400682 436068922 443041474 449805319 456551820
3593.7 456551820 463642895 470958650 478359759 485797435 493037343 500016034 507253349 514903843
3610 514903843 522611201 530241668 537654519 545285046 553607285 561640680 568720222 575313926 582710207
3628.4 582710207 591136277 598978043 606313527 613525569 620487571 627247989 633708358 639577866
3644.7 639577866 645067275 651294231 658379853 664732635 670279384 676066756 681812763 686832607
3661 686832607 691329479 695412278 698892534 702315390 706234515 709768772 713067830 716986239 720863044
3679.4 720863044 724249363 727196097 729672849 731940389 734439254 737231374 739999413 742467463
3695.7 742467463 744500339 746140420 747750342 749549091 751154006 752257168 753144741 754539132
3712 754539132 756546617 758351982 759588659 760481954 761308312 762242675 763404369 764599979 765299797
3730.3 765299797 765551269 766063929 767289758 768774033 769631684 769616783 769667983 770509958 771161735 771653116
3750.7 771653116 772938430 774452269 775389493 775973797 776744485 777556479 778104961 778487325 778946817
3769.1 778946817 779724658 780638993 781274498 781605244 781918287 782394230 782840669 783218980 783698201 784218192
3789.5 784218192 784600258 784699202 784641087 784671843 784657180 784850717 785535276 786105573 786671162 787471056
3809.9 787471056 787928462 787749588 787414789 787377536 787375212 787776828 788620293 789224803 789527059 789534688
3830.3 789534688 789419174 789465129 789411306 789258301 789528728 790231645 791052639 791592717 791493058 790576994
3850.7 790576994 789317369 789534450 790985048 791931748 792060077 791818202 791758239 791767001 791617155 791786134
3871.1 791786134 792285085 792772472 793063104 792959094 792828619 792860508 792959809 793282568 793435752 793378353
3891.5 793378353 793622971 793839753 793564975 793085217 792825878 792960763 793569803 794273496 794618368 794645727
3911.9 794645727 794506788 794264078 794174314 794365048 794524133 794527650 794592738 794673741 794651687 794722795 794971466
3934.3 794971466 795193553 795279741 795241475 795159698 795185685 795275927 795324564 795409620 795590580 795794606 795960069
3956.7 795960069 796088934 796158433 796204746 796302438 796430171 796568394 796692014 796764195 796830535 796947598
3977.1 796947598 797104061 797264338 797433078 797597349 797693551 797774017 797913790 798048913 798162341 798291981
3997.5 798291981
##END=$$ End of the data block
