##TITLE=$$ Begin of the data block
##JCAMP-DX=5.00 $$ ACD/SpecManager v 10.08
##SPECTROMETER/DATA SYSTEM=Alpha
##DATE=14 Apr 2014 11:23:48
##DATA TYPE=INFRARED SPECTRUM
##DATA CLASS=XYDATA
##ORIGIN=
##OWNER=
##NPOINTS=1765
##FIRSTX=399.75695801
##LASTX=3997.56933594
##MAXX=3997.56933594
##MINX=399.75695801
##MAXY=0.83784753
##MINY=0.17169149
##XFACTOR=1.0000000000
##YFACTOR=1.000000000000000e-9
##FIRSTY=0.53568584
##DELTAX=2.03957629
##XUNITS=1/CM
##YUNITS=ARBITRARY UNITS
##XYDATA=(X++(Y..Y))
399.8 535685837 532478034 529357493 528351843 528039634 526263058 523859262 523005486 523400307 522380471
418.1 522380471 519636631 518792391 519941390 519848168 517494917 515739381 516314387 516693354 514557004
436.5 514557004 512098074 512121558 513518453 513733745 512686372 512183547 512753963 512798131 511267483
454.8 511267483 509565353 509406626 509623766 508345902 506302536 505303621 505197644 504138350 501624942
473.2 501624942 499484986 498965323 498951733 497710586 495689988 494819462 494990349 494327724 492427826
491.5 492427826 490809083 490332723 489819586 488043755 485883147 484952688 484739304 483577758 481433362
509.9 481433362 479790002 479174554 478292406 476075113 473498315 472038180 471205086 469296902 466248095
528.3 466248095 463983983 463324994 462662250 460714698 458782732 458473295 458913803 458096445 456050903
546.6 456050903 454651088 454453111 453854769 451785535 449477136 448227197 447164983 444748193 441263735
565 441263735 438399851 436381131 433613539 429673910 426182836 424202591 422603518 419940382 416825682
583.3 416825682 414809078 413767397 412076741 409172922 406421840 404900640 403734922 401407242
599.6 401407242 398110628 395515233 394272059 393361539 392121404 391265720 391541779 392658353 394225836
618 394225836 396686941 400630772 405541569 409863621 413132310 416612208 421157777 425656170 428681076
636.3 428681076 430566281 432462186 434233397 435284764 436575413 439249963 442349017 443491280
652.7 443491280 442221522 442094892 446775466 454582959 460993707 464445412 467437059 472655863 477136314
671 477136314 479746163 482000202 485195160 489252120 492541730 494377345 496128857 498953700 501800537
689.4 501800537 503141820 503550351 504763365 506768346 507968366 507991672 508593321 511025131 514045596
707.7 514045596 515949607 517322302 520036459 524018288 527263820 529109895 531374037 535330594
724 535330594 539589286 542249262 543890893 546515226 550135434 552793682 553839684 555110633 557950139
742.4 557950139 561098814 562819600 563771665 565890014 569149315 571585655 572580636 573978424 577007174
760.8 577007174 580173612 581710756 582540631 584643960 587709010 589528322 589378655 588950574 589446902
779.1 589446902 589606225 587952197 585645914 585068941 586513221 588291883 590046704 593692005 600337029
797.5 600337029 608271539 615272641 621476531 628336787 635567427 641058743 644105613 646560907
813.8 646560907 649761736 652234733 652075946 649936020 647741318 645443261 641251504 634872794 628327787
832.1 628327787 623139441 618298709 612396240 606173575 601232231 597624183 594296694 591496050
848.5 591496050 591298044 595218182 602425337 611043394 620585799 631947696 644861102 657180011
864.8 657180011 667448044 676555037 685681343 693863750 699308813 702322066 704845011 707220316
881.1 707220316 707709253 705512464 702308118 699887455 697806537 694912553 692008972 691159844 692751884
899.4 692751884 694923520 696228445 697397828 699395418 701060653 700377584 697269440 693424165 689624548
917.8 689624548 684999764 679310560 674341142 671918809 671621263 671776175 671976209 673097372 675169706
936.2 675169706 676797986 677100897 676983535 677547336 678103864 676971555 673823893 669825375 665341735
954.5 665341735 659093797 650102675 639096975 627049625 613401473 596986413 578104615 558534086
970.8 558534086 539667845 521785259 505154550 490568161 478465766 468180418 458564341 449394166
987.1 449394166 441433877 435045481 429688901 424862593 420772284 417834610 415785462 413682729
1003.5 413682729 410766482 406938553 402278185 396518052 389580756 382165939 375244915 369121909
1019.8 369121909 363394588 357829154 352727175 348325431 344314814 340299636 336398304 333061457
1036.1 333061457 330398351 328031272 325615555 323206574 320981205 318816036 316555321 314621419
1052.4 314621419 313891351 314903110 317422181 320673943 323925734 326554209 327731192 326737136 323729306
1070.8 323729306 319835961 316125989 312862396 309898376 307210296 304770827 302198946 298942536
1087.1 298942536 294972926 291008651 287919760 286091924 285465121 285946518 287418544 289475173 291472554
1105.4 291472554 293038398 294242352 295144230 295358360 294186324 291152298 286351442 280878395 276910633
1123.8 276910633 275952786 277274996 279176742 280376971 280555367 280783236 282334417 285215765 288472503
1142.2 288472503 291292518 293532580 295502186 297432482 299371332 301510930 304288179 308089435
1158.5 308089435 313015193 319070280 326430649 335293084 345442683 356180876 366815150 377137810
1174.8 377137810 387171566 396675348 405178815 412376016 418234408 422551572 424830973 424898595
1191.1 424898595 423372149 421290427 419424146 418201327 418094695 419534385 422311217 425473779
1207.4 425473779 428059965 429797441 430956006 431712389 432006836 431962878 432011515 432478905 433305085
1225.8 433305085 434307069 435591280 437446713 439873844 442513287 445080012 447663367 450411737
1242.1 450411737 453083098 455179602 456542879 457550198 458501995 459241897 459739029 460517019 462176681
1260.4 462176681 464806855 468107283 471984506 476687104 482367158 488642007 494938523 501275539
1276.8 501275539 508080602 515364945 522644997 529710472 536996841 544810712 552573979 559505165
1293.1 559505165 565628171 571487248 577151120 582080185 586037576 589549065 593125224 596441388
1309.4 596441388 598877370 600588381 602313459 604292393 606057525 607363045 608662605 610385656
1325.7 610385656 612164617 613242209 613546729 613663077 613854110 613799572 613422036 613303483 613831937
1344.1 613831937 614638746 615095496 615151763 615284085 615559280 615380645 614334345 612701356 611030757
1362.4 611030757 609436214 607483149 605190992 603229463 601612866 599708974 597245395 593980551
1378.7 593980551 589356422 584082007 580860496 581147730 583044291 584235311 584111810 582756042 580728650
1397.1 580728650 578426242 575843692 572582543 568569839 564772427 561607301 558664501 555806935
1413.4 555806935 553227544 551052153 549499929 548544586 547708333 547051311 546733320 546485901 546212912
1431.8 546212912 546040654 546425045 547932982 549869061 551669121 553522289 555813849 558781683 562172830
1450.1 562172830 565626264 569474638 575511873 584537089 593065262 600640237 609213889 618792534
1466.4 618792534 627892673 637223244 648640096 660515547 670231223 677702188 683479965 688100815
1482.8 688100815 691299975 692678213 692532659 691863120 690937459 688718200 684782565 680536509 676754534
1501.1 676754534 672675848 666402459 657370329 650187552 644641042 638627410 632254779 626451671
1517.4 626451671 621858954 617677033 613796175 610193968 606569350 603421509 600237489 596622586
1533.7 596622586 593611419 590960443 587850153 585626662 584761202 584518313 584759116 585358679 586205840
1552.1 586205840 587110221 587894797 588801026 590460837 591685236 591709375 590769708 588727117 585584879
1570.5 585584879 582065225 577507675 571049392 564547598 558160782 550759494 542727947 534327686
1586.8 534327686 525486290 516317546 507145286 498047680 489085019 480228812 471406817 462746829
1603.1 462746829 454311579 445854992 437214017 428808391 420904517 412563503 403520316 396247178
1619.4 396247178 390021652 383238286 376868188 371305108 366414577 362563074 359240353 356117159
1635.7 356117159 354544073 354443341 354996264 355943233 357633382 360384613 363199383 366565555 372105330
1654.1 372105330 377711236 382777661 388411343 395191014 402765989 409942269 417728335 427024752
1670.4 427024752 436143160 445715606 456398427 466468990 475838780 486163139 499499112 512435615
1686.7 512435615 523556888 534870327 545443714 556431115 568545043 581267416 596153259
1701 596153259 609098554 619813561 630547523 640098810 648128510 654944956 661191881 668224275
1717.3 668224275 675537765 681586564 686809897 691935539 696817398 701315224 705299139 709826231
1733.6 709826231 715371132 720366776 725083828 730052173 735147059 740242898 745110273 749991834
1749.9 749991834 755215585 760063827 764261603 767940462 771085382 774273634 777537525 780187249
1766.3 780187249 782107472 783787549 786002994 788771093 791096985 792863011 794644296 796632648
1782.6 796632648 798506677 800100803 801417828 802596271 804145336 805886865 807270706 808464170
1798.9 808464170 809866548 811350524 812564611 813524425 814463615 815517008 816531897 817380369 818222046
1817.2 818222046 819173455 819936156 820337236 820743740 821400166 822182417 823092043 823922992 824557424 825263083
1837.6 825263083 825931609 826141477 826129496 826740682 827778935 828563988 829033911 829429030 829928994 830442429
1858 830442429 830809534 831060946 831322074 831502557 831609786 831977487 832605898 833229423 833707869 833950102
1878.4 833950102 834055901 834292293 834674299 834888637 834836364 834953070 835377574 835752964 835943222 836053908
1898.8 836053908 836260617 836585045 836798847 836766839 836721063 836949944 837286413 837298393 837030649 837031901
1919.2 837031901 837315440 837514639 837580502 837600052 837702274 837847531 837816834 837635934 837573349 837620556
1939.6 837620556 837517142 837306261 837228298 837311685 837396443 837294877 837032676 836855054 836809039 836700976
1960 836700976 836463869 836219013 836091340 836093485 836036682 835810542 835618615 835566461 835481882 835274160 835092068
1982.5 835092068 835007727 834900796 834666967 834349155 834137976 834110737 834065437 833861172 833609045 833406627
2002.8 833406627 833242595 833027899 832710266 832392573 832161605 831918955 831594229 831300914 831093788 830924273
2023.2 830924273 830717504 830418825 830074489 829802752 829611480 829374492 829056025 828755498 828544855 828368485
2043.6 828368485 828134596 827862859 827665687 827539682 827372968 827123523 826894760 826770663 826646686 826434433
2064 826434433 826237500 826139212 826071918 825969100 825828910 825720370 825675070 825630248 825510859 825340927 825233519
2086.5 825233519 825170934 825061202 824916363 824823380 824806869 824803889 824762464 824699640 824682593 824715078 824696422
2108.9 824696422 824593365 824520528 824540973 824600041 824632704 824648440 824726343 824867666 824952841 824957550 825004876
2131.3 825004876 825127840 825236797 825279295 825316131 825417161 825571418 825718641 825826108 825924993 826058805
2151.7 826058805 826223969 826379120 826493263 826593816 826730669 826889694 827036858 827178478 827352643 827571452
2172.1 827571452 827789068 827972054 828121066 828261614 828416765 828565001 828684449 828785837 828875184 828961670
2192.5 828961670 829060733 829162419 829233289 829270661 829326391 829414070 829497159 829563200 829621732 829675317 829715729
2215 829715729 829759955 829817295 829859734 829873204 829863071 829856217 829879940 829904139 829881012 829854727 829895973 829947889
2239.4 829947889 829908133 829789877 829697192 829667211 829632342 829544783 829444766 829403162 829430759 829442620 829376578
2261.9 829376578 829315424 829348683 829413354 829413116 829377472 829415858 829528809 829610467 829666734 829775572 829927683
2284.3 829927683 830000281 829937041 829892099 829981923 830112219 830159485 830139279 830146730 830219150 830288947 830276549
2306.7 830276549 830219865 830236614 830342114 830413699 830363333 830245435 830181956 830223024 830294669 830307722 830327570
2329.2 830327570 830414712 830469310 830459177 830500960 830633938 830766678 830893517 831229985 831774771 832108378
2349.6 832108378 832001448 831552625 831130266 831094980 831315935 831526756 831739485 832057059 832539022 833097100
2370 833097100 833578169 834023535 834556103 835124195 835621953 836060107 836486399 836836040 837029278 837118626
2390.4 837118626 837207198 837332785 837453663 837507665 837525010 837581038 837650120 837678790 837678134 837678730 837698460 837735653
2414.8 837735653 837733865 837645054 837528586 837440908 837340593 837237954 837184906 837162852 837155581 837129891 837024331
2437.3 837024331 836880982 836794555 836744487 836666107 836549163 836412191 836295903 836208165 836111367 835992873
2457.7 835992873 835873961 835748017 835604250 835454643 835310102 835179031 835030019 834832907 834629655 834482968
2478.1 834482968 834366918 834201157 833992243 833796203 833638906 833518565 833393395 833222151 833032429 832868457
2498.5 832868457 832701266 832520068 832374394 832267404 832162082 832006752 831791043 831592381 831439972 831283092
2518.9 831283092 831072927 830843091 830688953 830580115 830398738 830143154 829915583 829760909 829603493 829380095
2539.2 829380095 829143584 828961670 828801692 828603446 828388631 828214645 828057170 827822864 827516794 827262819
2559.6 827262819 827096105 826895833 826587856 826259196 825988352 825724244 825390458 824989259 824612677 824304938
2580 824304938 824002624 823637545 823194265 822748840 822337627 821864307 821326673 820846498 820425034 819954276
2600.4 819954276 819402397 818836212 818298340 817755401 817174673 816581249 816005170 815447748 814884543 814280927
2620.8 814280927 813642919 813004255 812391579 811780214 811147153 810533226 809947670 809363604 808759570 808144152
2641.2 808144152 807564437 807013273 806442440 805864513 805299044 804734349 804177582 803620279 803050637 802492261
2661.6 802492261 801943779 801369369 800765753 800183237 799657404 799144506 798590422 797996402 797389805 796796679
2682 796796679 796214879 795609891 794986963 794390917 793798923 793154597 792469203 791795611 791126609 790431678
2702.4 790431678 789726675 788997829 788233697 787471712 786727309 785985410 785236359 784473538 783683658 782889962
2722.8 782889962 782139838 781433225 780708909 779964924 779260337 778570950 777857542 777133167 776396573 775665998
2743.2 775665998 774976969 774313331 773611188 772838354 772032440 771217167 770402491 769608974 768801689 767935693
2763.6 767935693 767045379 766164541 765249848 764283717 763305724 762313664 761281431 760219336 759119749
2782 759119749 757965267 756784022 755602002 754410625 753164172 751857698 750539541 749190748 747778535
2800.3 747778535 746314406 744784474 743194401 741605818 740004659 738317668 736559689 734763980
2816.6 734763980 732919157 731001914 728980899 726869345 724675357 722335219 719776809 716930807
2832.9 716930807 713704169 709989369 705641568 700476110 694357932 687269747 679572880 672258615
2849.3 672258615 666457415 662746906 661027670 660686493 660838664 660657465 659639299 657688975 654995620
2867.6 654995620 651935637 649050891 646715283 644868433 643267751 641684592 639918089 637873173
2883.9 637873173 635512829 632835627 629941702 626955628 623905480 620743990 617468178 614114165
2900.2 614114165 610655725 606960893 602871716 598274708 593004465 586876512 580007970 573036134
2916.6 573036134 566708744 561469257 557639241 555421293 554785967 555515289 557220757 559625447 562695384
2934.9 562695384 566368520 570433378 574604511 578549564 581909359 584383965 585912228 586713612
2951.2 586713612 587093115 587414980 588082373 589306056 591065228 593273997 595815301 598474443 601032674
2969.6 601032674 603414774 605624020 607605219 609363854 610988081 612470448 613784969 614952147
2985.9 614952147 616004229 616964281 617704213 618016422 617907166 617493689 616840959 616031051 615063012
3004.3 615063012 613911569 612702727 611521542 610244691 608737886 607012987 605172753 603295803
3020.6 603295803 601356328 599266589 597029328 594788671 592599988 590385914 588060677 585635006
3036.9 585635006 583258688 580896676 578361213 575669408 572940886 570236981 567544162 564803421
3053.2 564803421 562046409 559343815 556662440 553981006 551370800 548860729 546381116 543825090
3069.5 543825090 541197836 538614929 536141932 533729136 531231761 528610468 525981367 523372650
3085.8 523372650 520736277 518078268 515387774 512652636 509927750 507254243 504552186 501723886
3102.2 501723886 498825431 495934993 493038714 490081668 487106055 484186679 481232256 478158206
3118.5 478158206 474931687 471544325 468143135 464859813 461657196 458401620 455011964 451583236
3134.8 451583236 448240638 444942236 441522270 437955320 434378803 430825740 427307665 423873097
3151.1 423873097 420389056 416733027 413046658 409428447 405815065 402208805 398629516 395025373
3167.4 395025373 391398937 387823015 384288430 380740017 377192646 373686552 370197088 366691679
3183.7 366691679 363218129 359820276 356458098 353088677 349716544 346361846 343048543 339800626
3200.1 339800626 336628288 333483785 330346495 327255398 324237406 321278334 318340808 315421760
3216.4 315421760 312522769 309651732 306829363 304062843 301359087 298733801 296183586 293676883
3232.7 293676883 291166455 288654625 286206573 283841044 281540036 279288501 277060211 274843127
3249 274843127 272670120 270560294 268512636 266527712 264530092 262472987 260441929 258483529 256551176
3267.4 256551176 254657894 252821833 250993490 249142036 247267291 245412990 243639871 241893217
3283.7 241893217 240091845 238289669 236555994 234869570 233179092 231449693 229687989 227942422
3300 227942422 226253539 224641830 223041534 221350789 219586030 217789546 215986446 214240626 212597951
3318.4 212597951 211013943 209415495 207807168 206206277 204616204 203050360 201505944 200023234
3334.7 200023234 198636726 197249830 195779711 194291577 192812130 191366434 190053329 188787654
3351 188787654 187419206 186032504 184777632 183644772 182564184 181514814 180555269 179692864 178757370
3369.3 178757370 177632228 176516265 175653845 174973667 174332187 173701510 173136279 172706395 172479346
3387.7 172479346 172448054 172359571 172025770 171691492 171711013 171976477 172042623 171816587 171697676 171888158
3408.1 171888158 172211334 172544897 172856659 173149526 173515007 173950657 174434915 175099835 175989613 177020997
3428.5 177020997 178046733 179077908 180231884 181328878 182186395 183028921 184107661 185419783 186874539
3446.8 186874539 188346416 189838752 191397473 193050265 194884971 196852922 198722586 200567648
3463.2 200567648 202739179 205156162 207324550 209072649 210854426 212963164 215313286 217730552
3479.5 217730552 219995633 222227991 224691570 227239296 229720727 232299134 235048100 237909317
3495.8 237909317 240704194 243415013 246229723 249049976 251750886 254568994 257684320 261037648
3512.1 261037648 264410198 267607301 270775944 274162322 277834147 281481832 284910321 288439393
3528.4 288439393 292274892 296263307 300325215 304421842 308461845 312644064 317094624 321624249
3544.7 321624249 325997829 330299765 334781379 339469850 344225466 349049598 354083091 359208018
3561.1 359208018 364146233 369101673 374749571 380883694 386755049 392426133 398267895 404342502
3577.4 404342502 410606235 417001456 423357427 429710865 436369151 443298727 450052798 456801891
3593.7 456801891 463886261 471234173 478704661 486169398 493386209 500366807 507647872 515282035
3610 515282035 522935927 530614793 538123965 545793355 554097474 562075317 569074929 575598478 583013117
3628.4 583013117 591534913 599392593 606667995 613882244 620924115 627749264 634213924 640019834
3644.7 640019834 645443738 651691794 658810973 665142477 670653343 676390409 682104409 687153637
3661 687153637 691697478 695808947 699304700 702689111 706511438 709997952 713316560 717224538 721080899
3679.4 721080899 724520445 727563620 730112433 732393682 734877408 737659633 740378499 742763042
3695.7 742763042 744724512 746348143 747989655 749816597 751446486 752577960 753478348 754874289
3712 754874289 756860316 758645833 759913623 760839224 761634171 762498796 763624012 764843404 765582919
3730.3 765582919 765854895 766377330 767636955 769136012 769970417 769939423 769955873 770754933 771444380 772036552
3750.7 772036552 773347318 774772584 775631547 776252687 777120471 777963996 778469682 778802156 779239357
3769.1 779239357 780019701 780927420 781535864 781846166 782129824 782569051 783031523 783466458 784008145 784617782
3789.5 784617782 785053372 785123110 785054922 785130203 785105824 785172999 785737455 786289096 786909878 787757635
3809.9 787757635 788186669 787965119 787684739 787713826 787658572 787987828 788855076 789485514 789738297 789719045
3830.3 789719045 789687216 789817274 789725780 789514840 789819598 790518820 791241527 791735232 791682720 790824056
3850.7 790824056 789654195 789936960 791329741 792216241 792309642 792022884 791967750 792042553 791896284 791984320
3871.1 791984320 792465866 793031991 793381453 793248773 793067515 793110549 793228984 793542385 793724954 793682277
3891.5 793682277 793884814 794118106 793902516 793405950 793101609 793224752 793790519 794454396 794789732 794793189
3911.9 794793189 794642091 794440925 794381499 794542491 794695616 794716001 794761300 794843376 794847965 794914961 795173705
3934.3 795173705 795442522 795532703 795415461 795251131 795268953 795384884 795462430 795585811 795810103 796035528
3954.7 796035528 796168685 796280324 796407759 796498477 796553075 796643257 796809494 796947241 796982646 797035217
3975.1 797035217 797177196 797340810 797519386 797675669 797778964 797896922 798007965 798077226 798185110 798356771
3995.5 798356771 798507273
3997.5 798507273
##END=$$ End of the data block
