##TITLE=$$ Begin of the data block
##JCAMP-DX=5.00 $$ ACD/SpecManager v 10.08
##SPECTROMETER/DATA SYSTEM=Alpha
##DATE=14 Apr 2014 11:23:48
##DATA TYPE=INFRARED SPECTRUM
##DATA CLASS=XYDATA
##ORIGIN=
##OWNER=
##NPOINTS=1765
##FIRSTX=399.75695801
##LASTX=3997.56933594
##MAXX=3997.56933594
##MINX=399.75695801
##MAXY=0.83804888
##MINY=0.17175843
##XFACTOR=1.0000000000
##YFACTOR=1.000000000000000e-9
##FIRSTY=0.53482848
##DELTAX=2.03957629
##XUNITS=1/CM
##YUNITS=ARBITRARY UNITS
##XYDATA=(X++(Y..Y))
399.8E34828484k558529k652705r51886o40512k132654k495289q64267J51515j289368
418.1E21394789k743900q70227J149058L33548j857102j997888j12534K43008j594305
436.5E13944447k062738j35243J235962L12507j047909n18203Q69572M29988j414954
454.8E11613429j847506l51429K20478j295090k371907j354993j52468q60393k326787
473.2E01273334k015173l49284K1756j326919k009063p76530K89560o32436j974821
491.5D92500424j693338n24640n09769j738160k177686r79334k65688j201212k148062
509.9D81262535j763314q10713r00179k065778k466470j561701j102656j954556k694875
528.3D65942293j924842o41614p56503j873016j877218m94987K19315q10623j883090
$$ y = [534828484, 532269955, 529617250, 528665364, 528024852, 525892198, 523396909, 522532642, 522684157, 521394789, 518650889, 517780662, 518929720, 519263268, 517406166, 515408278, 515295744, 515538752, 513944447, 511881709, 511746466, 512982428, 513294935, 512247026, 511728823, 512598395, 513028383, 511613429, 509765923, 509414494, 509634972, 508339882, 505967975, 504612982, 504460514, 503600121, 501273334, 499258161, 498908877, 498930633, 497603714, 495594651, 494818121, 495107681, 494475245, 492500424, 490807086, 490282446, 489772677, 488034517, 485856831, 484877497, 484611809, 483410597, 481262535, 479499221, 478688508, 477788329, 475722551, 473256081, 471694380, 470591724, 468637168, 465942293, 464017451, 463375837, 462619334, 460746318, 458869100, 458374113, 458593428, 457782805, 455899715]
546.6D55899715j328647k64913o77198k119243k389043j280696j023739k374590l409922
565D41031724k774626j959383k796173m011840l509969j904159j477689k605378l108353
583.3D16884154j985341r88215j747191l035546k734840j446545j216888k412886l371566
601.7C97945136k678573j206667p78317j213551r06974L15249J206637J617580K535075
620C96835595M035622M938931M322350L238976L388792M483998M485786K994597J884341
638.4D30608988J964330J814902J026243J279027K702653L123492J188248j195371
654.7D42512512p9751M625559P701367O431252L554523L034234N203843M461140K581208
673.1D80025887K254278L286123M154772L245175J697182J662851K789914K844453
$$ y = [455899715, 454571068, 454306155, 453628957, 451509714, 449120671, 447839975, 446816236, 444441646, 441031724, 438257098, 436297715, 433501542, 429489702, 425979733, 424075574, 422597885, 419992507, 416884154, 414898813, 413910598, 412163407, 409127861, 406393021, 404946476, 403729588, 401316702, 397945136, 395266563, 394059896, 393281579, 392068028, 391161054, 391476303, 392682940, 394300520, 396835595, 400871217, 405810148, 410132498, 413371474, 416760266, 421244264, 425730050, 428724647, 430608988, 432573318, 434388220, 435414463, 436693490, 439396143, 442519635, 443707883, 442512512, 442432761, 447058320, 454759687, 461190939, 464745462, 467779696, 472983539, 477444679, 480025887, 482280165, 485566288, 489721060, 492966235, 494663417, 496326268, 499116182, 501960635]
689.4E01960635J394808M56453J206398K004206J208127k206N48661K363026K995432
707.7E14135540K018630J609921K870799L987789L241896J828969K205491L896177
724E35795212M162311K552152J585722K613604L659427K733946J080632J258970K868831
742.4E58310807L195047J651704Q36194K191722L431976K421737Q68559J295507K922237
760.8E77125490L131449J598656Q96752K176106L134787J790106k02000l87311N34594
779.1E89798629J33336j692295k316356n91099J397550J746178J736819L648818O713092
797.5F00574672Q016587P011532O148756O845057P258713N474866L029763K448499
813.8F46808445L157557K436876j46687k093017k194584k371728m243314o345690o472349
$$ y = [501960635, 503355443, 503811896, 505018294, 507022500, 508230627, 508228421, 508777082, 511140108, 514135540, 516154170, 517764091, 520634890, 524622679, 527864575, 529693544, 531899035, 535795212, 539957523, 542509675, 544095397, 546709001, 550368428, 553102374, 554183006, 555441976, 558310807, 561505854, 563157558, 563993752, 566185474, 569617450, 572039187, 572907746, 574203253, 577125490, 580256939, 581855595, 582752347, 584928453, 588063240, 589853346, 589651346, 589264035, 589798629, 589931965, 588239670, 585923314, 585332215, 586729765, 588475943, 590212762, 593861580, 600574672, 608591259, 615602791, 621751547, 628596604, 635855317, 641330183, 644359946, 646808445, 649966002, 652402878, 652256191, 650163174, 647968590, 645596862, 641353548, 635007858, 628535509]
832.1F28535509n177617m875779n896866o186784m914760l596962l297627k766728
848.5E91822386j75953L967643P210016Q563101R550691J1397362J2863099J2228072
864.8F57426417J0235846R142518R152114Q146227N369007K931416K472699K364695
881.1G07240939M95255k185166l205359k428770k023279k806783k938211r43542J575709
899.4F92780793K198338J342833J185417J938343J615108o42181l030479l783882l791749
917.8F89812541m701436n757749m934847k360642k93970J30296J82390J110196K079248
936.2F75266027J615704K24232j90556N50568N42045j162648l116668l938376m489005
954.5F65301323o282985q999169j1006296j2041688j3622165j6417503j8905282j9561112
$$ y = [628535509, 623357892, 618482113, 612585247, 606398463, 601483703, 597886741, 594589114, 591822386, 591646433, 595614076, 602824092, 611387193, 620937884, 632335246, 645198345, 657426417, 667662263, 676804781, 685956895, 694103122, 699472129, 702403545, 704876244, 707240939, 707736194, 705551028, 702345669, 699916899, 697893620, 695086837, 692148626, 691205084, 692780793, 694979131, 696321964, 697507381, 699445724, 701060832, 700418651, 697388172, 693604290, 689812541, 685111105, 679353356, 674418509, 672057867, 671763897, 671894193, 672076583, 673186779, 675266027, 676881731, 677105963, 676915407, 677465975, 678008020, 676845372, 673728704, 669790328, 665301323, 659018338, 650019169, 639012873, 626971185, 613349020, 596931517, 578026235, 558465123]
970.8E58465123j8841088j7851054j6596914j4557838j2092948j0322541r651452r170741
987.1D49380547p985503o410002n342037m854172m123807k911657k053500k175808
1003.5D13524061k956807l814370m655122n746037o897181p393390o917179o085604
1019.8C69058371n675495n561233n141616m414051l955573l954858l877043l312588
1036.1C33165914k634704k354473k412439k400875k189219k114117k259999k001047
1052.4C14799041p59989J069575K512306L156692L214657K642810J173199j003027
1068.7C26805264k991289l891766l739178l253699k956211k736479k464950k532006
1085C02239686l198057l949106l981322l100216j810432n86480N06938J449495K018661
$$ y = [558465123, 539624035, 521772981, 505176067, 490618229, 478525281, 468202740, 458551288, 449380547, 441395044, 434985042, 429643005, 424788833, 420665026, 417753369, 415699869, 413524061, 410567254, 406752884, 402097762, 396351725, 389454544, 382061154, 375143975, 369058371, 363382876, 357821643, 352680027, 348265976, 344310403, 340355545, 336478502, 333165914, 330531210, 328176737, 325764298, 323363423, 321174204, 319060087, 316800088, 314799041, 314039052, 315108627, 317620933, 320777625, 323992282, 326635092, 327808291, 326805264, 323813975, 319922209, 316183031, 312929332, 309973121, 307236642, 304771692, 302239686, 299041629, 295092523, 291111201, 288010985, 286200553, 285614073, 286121011, 287570506, 289589167]
1103.4B89589167J995355J591473J237005R30280K23130j171708l064037m858672n481124
1121.8B80990869l948242j000523J250982J886159J232326K00331K13802J531571K905518
1140.1B85262793L306747K853542K250702J946419J899749J948744K176881K807111
1156.4C04452688L805130M905761O025195P333040Q853942J0145992J0711640J0595679
1172.7C66829067J0304243J0054231R532123Q481801P131338N814761M323065K300322
1189.1D24770951P5817j528978k070785j821816j180350j00464J440019K802342L181427
1207.4D25568163K555490J684755J139373P68542L01063n4687L5554M69327Q53389
1225.8D33320969J041741J288235J825422K434343K676397K576501K586156K784550
$$ y = [289589167, 291584522, 293175995, 294413000, 295343280, 295566410, 294394702, 291330665, 286471993, 280990869, 277042627, 276042104, 277293086, 279179245, 280411571, 280611902, 280825704, 282357275, 285262793, 288569540, 291423082, 293673784, 295620203, 297519952, 299468696, 301645577, 304452688, 308257818, 313163579, 319188774, 326521814, 335375756, 345521748, 356233388, 366829067, 377133310, 387187541, 396719664, 405201465, 412332803, 418147564, 422470629, 424770951, 424846768, 423317790, 421247005, 419425189, 418244839, 418144375, 419584394, 422386736, 425568163, 428123653, 429808408, 430947781, 431716323, 432017386, 431962699, 431998253, 432467580, 433320969, 434362710, 435650945, 437476367, 439910710, 442587107, 445163608, 447749764, 450534314]
1242.1D50534314K719402K120197J374722R92029R00627P31140N34982P71939J626045
1260.4D62305397K631694L292173L824234M644513N629361O241739O299495O340236
1276.8E01208842O770611P243812P278323P089436P302046P802307P738769O922424
1293.1E59356570O126583N871773N694985M962623L974855L514350L580033L345847
1309.4E96427619K464772J705348J709998J978755J791000J336873J314282J733482
1325.7F10462129J781345J068353L10183J44720K10821o0141l98218j18554N57959
1344.1F13958597Q18610M48108O0201J42455K77221j75655j021623j607061j688123
1362.4F11212730j638174j980662k295315j951516j614630j916349k479196l267526
$$ y = [450534314, 453253716, 455373913, 456748635, 457740664, 458641291, 459372431, 459907413, 460679352, 462305397, 464937091, 468229264, 472053498, 476698011, 482327372, 488569111, 494868606, 501208842, 507979453, 515223265, 522501588, 529591024, 536893070, 544695377, 552434146, 559356570, 565483153, 571354926, 577049911, 582012534, 585987389, 589501739, 593081772, 596427619, 598892391, 600597739, 602307737, 604286492, 606077492, 607414365, 608728647, 610462129, 612243474, 613311827, 613622010, 613766730, 613977551, 613917410, 613519192, 613400638, 613958597, 614777207, 615225315, 615285516, 615427971, 615705192, 615529537, 614507914, 612900853, 611212730, 609574556, 607593894, 605298579, 603347063, 601732433, 599816084, 597336888, 594069362]
1378.7E94069362m619778n275547l225982K84135J906037J195968j44661j375496k008200
1397.1E80805838k267718k583623l296197m044175l814101l166914k907336k805471
1413.4E55920303k571702k208948j569033r29773p98106o46114l28601k50458k60950
1431.8E46356618j41799L96848J465857J889169J773834J846314K302348K964258L368080
1450.1E62221527L459394L902614O084264Q985579Q476793P575035Q580506R567917
1466.4F18853629R101927R364545J1474312J1893689R673238P429183N762577M608869
1482.8F88161969L194392J390099j38223p00772r71019k210975l886759m235625l788531
1501.1F76814556m067302o270170r037494p174910n536258n998492o369233n807162
$$ y = [594069362, 589449584, 584174037, 580948055, 581232190, 583138227, 584334195, 584189534, 582814038, 580805838, 578538120, 575954497, 572658300, 568614125, 564800024, 561633110, 558725774, 555920303, 553348601, 551139653, 549570620, 548640847, 547842741, 547196627, 546868026, 546617568, 546356618, 546214819, 546611667, 548077524, 549966693, 551740527, 553586841, 555889189, 558853447, 562221527, 565680921, 569583535, 575667799, 584653378, 593130171, 600705206, 609285712, 618853629, 627955556, 637320101, 648794413, 660688102, 670361340, 677790523, 683553100, 688161969, 691356361, 692746460, 692608237, 691907465, 690936446, 688725471, 684838712, 680603087, 676814556, 672747254, 666477084, 657439590, 650264680, 644728422, 638729930, 632360697, 626553535]
1517.4F26553535m559814m132808l879130l612995l598630l127635l188252l607094
1533.7E96847177k993286k628446l107130k261699q62061k07425K47836N89908Q54790
1552.1E86479664R23633P89345Q80658J604021J195490M1843r06527k026081l154874
1570.5E85827172l541231m556060o440819o491780o385803p400572q023441q370221
1586.8E34617245q814931r202897r226442r114533q978337q882046q823186q645743
1603.1D62929130q435488q475483q661300q409172p898986q340955r044409p264435
1619.4C96398902o213009o792427o401538n592019m918843l871560l315777l092468
1635.7C56201261j550019j07079N31286R20474J680643K781033K847284L418595N592584
$$ y = [626553535, 621993721, 617860913, 613981783, 610368788, 606770158, 603642523, 600454271, 596847177, 593853891, 591225445, 588118315, 585856616, 584994555, 584787130, 585034966, 585624874, 586479664, 587403297, 588192642, 589073300, 590677321, 591872811, 591914654, 591008127, 588982046, 585827172, 582285941, 577729881, 571289062, 564797282, 558411479, 551010907, 542987466, 534617245, 525802314, 516599417, 507372975, 498258442, 489280105, 480398059, 471574873, 462929130, 454493642, 446018159, 437356859, 428947687, 421048701, 412707746, 403663337, 396398902, 390185893, 383393466, 376991928, 371399909, 366481066, 362609506, 359293729, 356201261, 354651242, 354544163, 355075449, 355995923, 357676566, 360457599, 363304883, 366723478, 372316062]
1654.1C72316062N574793N030394N650669O820709P597297P188320P789105R294033
1670.4D27261382R127975R571373J0684371J0098547R377718J0299504J3318032J2937754
1686.7E12676656J1133790J1322737J0566294J0970056J2106121J2710750J4857888
1701E96344292J2962997J0748029J0707021R504676Q013904O808221O236255P051349
1717.3F68376744P344544O055593N226433N141438M904329M512906M016102M569649
1733.6G10147738N535365M973769M694342M927874N061805N103946M904747M863441
1749.9G50213027N159855M834890M221618L678441L137231L208697L289640K664626
1766.3G80408025J932323J698255K223373K741635K293408J763522J802743K012193
$$ y = [372316062, 377890855, 382921249, 388571918, 395392627, 402989924, 410178244, 417967349, 427261382, 436389357, 445960730, 456645101, 466743648, 476121366, 486420870, 499738902, 512676656, 523810446, 535133183, 545699477, 556669533, 568775654, 581486404, 596344292, 609307289, 620055318, 630762339, 640267015, 648280919, 655089140, 661325395, 668376744, 675721288, 681776881, 687003314, 692144752, 697049081, 701561987, 705578089, 710147738, 715683103, 720656872, 725351214, 730279088, 735340893, 740444839, 745349586, 750213027, 755372882, 760207772, 764429390, 768107831, 771245062, 774453759, 777743399, 780408025, 782340348, 784038603, 786261976, 789003611, 791297019, 793060541, 794863284, 796875477]
1782.6G96875477J881659J585781J317919J180529J535833J746059J401901J177668
1798.9H08702826J373292J486122J220644R55879R33230J031518R82166Q30650Q62598
1817.2H18378925J008928P86662L76344M06742O70612P70628R06766Q44836O35982
1835.6H24786425O86407O53743K28286J6451O00338J011670P69078M66586M21345N37634
1856H30177963N24461L40045K26557K75552J97768R1493L44813O30498O32525M76062
1876.4H33917737K46704J16706K29537L72171K25842l8087J13130M06205L57271J89900
1896.8H36137116J19448J98781L12925K22027k0266m5955K16603L16918M232k53498
1917.2H37208331J4186K82943J94788O3181J9848J04725J60873j5974j90735p7247
$$ y = [796875477, 798757136, 800342917, 801660836, 802841365, 804377198, 806123257, 807525158, 808702826, 810076118, 811562240, 812782884, 813738763, 814671993, 815703511, 816685677, 817516327, 818378925, 819387853, 820174515, 820550859, 820957601, 821628213, 822398841, 823305607, 824150443, 824786425, 825472832, 826126575, 826354861, 826371312, 826971650, 827983320, 828752398, 829218984, 829640329, 830177963, 830702424, 831042469, 831269026, 831544578, 831742346, 831833839, 832178652, 832809150, 833441675, 833917737, 834164441, 834281147, 834510684, 834882855, 835108697, 835070610, 835183740, 835589945, 835947216, 836137116, 836256564, 836455345, 836768270, 836990297, 836970031, 836924076, 837140679, 837457597, 837461829, 837208331, 837222517, 837505460, 837700248, 837763429, 837783277, 837888002, 838048875, 838032901, 837842166, 837764919]
1937.6H37764919L8743j22369k32219p5281J13547J07646j11222k80321j87039m3214
1958H36973190r3281k29478k58446j55806j5736m5717j89006j57714l6359o8426k11417
1980.4H35511804k29419j13368q3089k18927l22700j84536O56p3731k62141k73109
2000.8H33751440j73747j45436k30372l30269l26336k36690k14159k91050l04937k32279
2021.2H31266165j82092k22445k91288k98202k44677k26557k85626l15070k60413j98543
2041.6H28741252j85370k08914k49327k20596j55390j93655k70665k09808r9898j22189
2062H26825440k01404j89305j02221o6221j03355j41322j04964m8518o7115j35481
2082.4H25665534j62304j03772o4671j08540j46866q3446L278j79m4465o8009l2901
$$ y = [837764919, 837803662, 837681293, 837449074, 837373793, 837487340, 837594986, 837483764, 837203443, 837016404, 836973190, 836879909, 836650431, 836391985, 836236179, 836220443, 836174726, 835985720, 835828006, 835791647, 835723221, 835511804, 835282385, 835169017, 835085928, 834867001, 834544301, 834359765, 834360421, 834286690, 834024549, 833751440, 833577693, 833432257, 833201885, 832871616, 832545280, 832308590, 832094431, 831803381, 831498444, 831266165, 831084073, 830861628, 830570340, 830272138, 830027461, 829800904, 829515278, 829200208, 828939795, 828741252, 828555882, 828346968, 828097641, 827877045, 827721655, 827528000, 827257335, 827047527, 826947629, 826825440, 826624036, 826434731, 826332510, 826266289, 826162934, 826021612, 825916648, 825868130, 825801015, 825665534, 825503230, 825399458, 825334787, 825226247, 825079381, 824995935, 824999213, 824999034, 824954569, 824886560, 824853659]
2104.8H24853659M0292L279r4354o5983J3769L2902M530o140O6281J54256J28806M9055
2129.3H25180352O2227J27554J08242J2517M172R5964J56462J43409J14858J03712
2149.7H26109469J17540J62423J74463J34706J15395J45674J66356J43886J35720J76847
2170.1H27582479J95145J60575J42574J45674J45316J62542J69516J46329J36018J14620
2190.5H29100788P4505P0572Q5950Q7738Q7679R3579P6652M8637O2883R5725P1764
2212.9H29956472P75j5438N3168Q9764L6717j4186j967L7014K8253l5882m7445K1398
2237.4H30108643L7133l0756q0466o8486k9027m4942j03533q9288k0206P15l7551o5923
2261.9H29576313j6033P3612N8174n4300p0751N4300J34408O6817K4259J15395J79052
$$ y = [824853659, 824893951, 824897230, 824802876, 824736893, 824750662, 824783564, 824788094, 824781954, 824848235, 825002491, 825131297, 825180352, 825242579, 825370133, 825478375, 825490892, 825495064, 825591028, 825747490, 825890899, 826005757, 826109469, 826227009, 826389432, 826563895, 826698601, 826813996, 826959670, 827126026, 827269912, 827405632, 827582479, 827777624, 827938199, 828080773, 828226447, 828371763, 828534305, 828703821, 828850150, 828986168, 829100788, 829175293, 829245865, 829331815, 829419553, 829507232, 829600811, 829677463, 829726100, 829788983, 829884708, 829956472, 829957247, 829941809, 829994977, 830084741, 830121458, 830107272, 830105305, 830142319, 830170572, 830134690, 830087245, 830108643, 830145776, 830115020, 830034554, 829966068, 829937041, 829892099, 829788566, 829699278, 829679072, 829679787, 829642236, 829576313, 829560280, 829633892, 829692066, 829637766, 829567015, 829621315, 829755723, 829822540, 829846799, 829962194, 830141246]
2284.3H30141246Q5652m9054l6717R1493J39416N5313k8491Q106J04785Q6009m1187
2306.7H30556571p7188M4287J26719O1333n5074j10925m3034O9141Q2493K5094M8339
2329.2H30727756P6532L6478J9432N4419Q8870Q3089J17123L44098N52535L47197r6560
2351.6H32350969m03523l17037k0147Q5295R9361K52008L80516M19259M69804M65035
2372H33781540M62175N41985N85258N18143M33564L90887L10719J82927Q8036R4772
2392.4H37390006J45554J11222K9266J9431O5327P8738L6180j2815m351L3438L3498
2414.8H37925494k0743q6546j09851q8573q6545j05858p0453o676J79n7161j07646
2437.3H37185621j01328o2763n7876q9407j04070j10924j30415j32323j08897r5189
$$ y = [830141246, 830226898, 830177844, 830141127, 830232620, 830372036, 830427349, 830398858, 830406964, 830511749, 830597758, 830556571, 830479383, 830523670, 830650389, 830711722, 830656648, 830545723, 830502689, 830571830, 830654323, 830679417, 830727756, 830804288, 830840766, 830860198, 830914617, 831003487, 831086576, 831203699, 831547797, 832100332, 832447529, 832350969, 831947446, 831630409, 831610262, 831695557, 831794918, 832046926, 832427442, 832846701, 833316505, 833781540, 834243715, 834785700, 835370958, 835889101, 836322665, 836713552, 837024271, 837207198, 837295234, 837390006, 837535560, 837646782, 837676048, 837695479, 837760806, 837839544, 837875724, 837862909, 837858558, 837891996, 837925494, 837904751, 837818205, 837708354, 837619781, 837533236, 837427378, 837356925, 837350249, 837350428, 837293267, 837185621, 837084293, 837021530, 836963654, 836874247, 836770177, 836659253, 836528838, 836396515, 836287618, 836192429]
2457.7H36192429r2804j19806j66773j66476j32561j29223j67131j99855j85251j44958
2478.1H34687591j47403j80721j77205j70290j67668j32382j37627j88470j69694j33515
2498.5H33082616j69813j82689j28448j10328j42872j79410k13742k03133j63138j61767
2518.9H31427276k01285k09510j48833j31428k01583k51532k10821j45793j65642k40862
2539.2H29519987k45988j59681j10567j74761k42412k02000j46270k10166k94089k64346
2559.6H27469707j99259k20120l07977l25620k48671k44081l44574m08173l77536l20971
2580H24472725l15845l82721m72128m65811l97861m31955m98056m60088m19855m93944
2600.4H20134461n83053n59687n13137n41031n92172o14763o07371n67436n27382n69046
$$ y = [836192429, 836099625, 835979819, 835813046, 835646570, 835514009, 835384786, 835217655, 835017800, 834832549, 834687591, 834540188, 834359467, 834182262, 834011972, 833844304, 833711922, 833574295, 833385825, 833216131, 833082616, 832912803, 832730114, 832601666, 832491338, 832348466, 832169056, 831955314, 831752181, 831589043, 831427276, 831225991, 831016481, 830867648, 830736220, 830534637, 830283105, 830072284, 829926491, 829760849, 829519987, 829273999, 829114318, 829003751, 828828990, 828586578, 828384578, 828238308, 828028142, 827734053, 827469707, 827270448, 827050328, 826742351, 826416731, 826168060, 825923979, 825579405, 825171232, 824793696, 824472725, 824156880, 823774159, 823302031, 822836220, 822438359, 822006404, 821508348, 821048260, 820628405, 820134461, 819551408, 818991721, 818478584, 817937553, 817345381, 816730618, 816123247, 815555811, 815028429, 814459383]
2620.8H14459383o35445o41107o21617o19173o34194o38425n93364n36263n48124n89967
2641.2H08401704n96821n76914n70893n87881n85019n63622n63502n95570n95927n45919
2661.6H02619636n32567n79715o14107n75244n05209n02706n36024n36800n66661o29783
2682G97040820o57022o36399n90086n78820o03855o21676o72997p33971p25687o72042
2702.4G90548265o54578o98805p52926p75456p53940p31825p64907p97510p77781p55548
2722.8G83084989p40946p27176p53284p62463p14421o86765o98268p05123p15434p38383
2743.2G75842726p18474o67215o83069p60555q05974p96795p86900q25108q59379q65341
2763.6G68073916q76605q79169r06050r54747r78827j003504j042486j065731j070678
$$ y = [814459383, 813823938, 813182831, 812561214, 811942041, 811307847, 810669422, 810076058, 809539795, 808991671, 808401704, 807804883, 807227969, 806657076, 806069195, 805484176, 804920554, 804357052, 803761482, 803165555, 802619636, 802087069, 801507354, 800893247, 800318003, 799812794, 799310088, 798774064, 798237264, 797670603, 797040820, 796383798, 795747399, 795157313, 794578493, 793974638, 793352962, 792679965, 791945994, 791220307, 790548265, 789893687, 789194882, 788441956, 787666500, 786912560, 786180735, 785415828, 784618318, 783840537, 783084989, 782344043, 781616867, 780863583, 780101120, 779386699, 778699934, 778001666, 777296543, 776581109, 775842726, 775124252, 774457037, 773773968, 773013413, 772207439, 771410644, 770623744, 769798636, 768939257, 768073916, 767197311, 766318142, 765412092, 764457345, 763478518, 762475014, 761432528, 760366797, 759296119]
2782G59296119j109481j180350j213551j208186j236081j301408j332402j347661j411021
2800.3G47955978j483798j525760j557529j579821j611650j691460j778365j816451
2816.6G34911144j833022j881242j987397k105058k203106k347351k579152k865970
2832.9G17108846l209770l695309m355133n176067o125033p080495p685125p348955
2849.3F72432959n841613l661751j643062l37064J26779j80066j001418j968085k747715
2867.6F55178964l075480k867639k347410j857638j590193j593053j798451k062917
2883.9F37986183k352118k654553k871156k982437l077090l199100l278852l310203
2900.2F14260674l434122l717780m119694m620493n273163o101310o829679o958902
$$ y = [759296119, 758186638, 757006288, 755792737, 754584551, 753348470, 752047062, 750714660, 749366999, 747955978, 746472180, 744946420, 743388891, 741809070, 740197420, 738505960, 736727595, 734911144, 733078122, 731196880, 729209483, 727104425, 724901319, 722553968, 719974816, 717108846, 713899076, 710203767, 705848634, 700672567, 694547534, 687467039, 679781914, 672432959, 666591346, 662929595, 661286533, 660949469, 661076248, 660896182, 659894764, 657926679, 655178964, 652103484, 649235845, 646888435, 645030797, 643440604, 641847551, 640049100, 637986183, 635634065, 632979512, 630108356, 627125919, 624048829, 620849729, 617570877, 614260674, 610826552, 607108772, 602989078, 598368585, 593095422, 586994112, 580164433, 573205531]
2916.6E73205531o342173n250454l857613k249240o28293P48992J715004K420009L108799
2934.9E62870562L716648M067003M143000L930628L342688K448738J502514P79867
2951.2E86801648M07040L90351P07507J223684J782953K241195K511620K607584K556920
2969.6F01230502K423167K236367J977741J745284J616776J491547J342833J208245
2985.9F15272462J061678R22025P02619L06010r3102l95596o48618q31604j009881
3004.3F15285993j140952j130403j128017j270354j510084j718759j813770j849055
3020.6F03724599j951456k145767k270937k233625k170265k170860k288819k456307
3036.9E86036563k438843k396942k540111k664685k694547k689362k691507k751410
$$ y = [573205531, 566863358, 561612904, 557755291, 555506051, 554877758, 555626750, 557341754, 559761763, 562870562, 566587210, 570654213, 574797213, 578727841, 582070529, 584519267, 586021781, 586801648, 587208688, 587599039, 588306546, 589530230, 591313183, 593554378, 596065998, 598673582, 601230502, 603653669, 605890036, 607867777, 609613061, 611229837, 612721384, 614064217, 615272462, 616334140, 617256165, 617958784, 618264794, 618171692, 617776096, 617127478, 616295874, 615285993, 614145041, 613014638, 611886621, 610616267, 609106183, 607387424, 605573654, 603724599, 601773143, 599627376, 597356439, 595122814, 592952549, 590781689, 588492870, 586036563, 583597720, 581200778, 578660667, 575995982, 573301435, 570612073, 567920566, 565169156]
3053.2E65169156k759457k702534k692521k695620k634585k534747k499938k554417
3069.5E44095337k594828k565325k476990k415180k495110k615869k631664k616227
3085.8E23684144k638042k667665k703131k709627k685070k688229k743363k845764
3102.2E02003253k911956k883494k849847k922177k970666k926588k963423l082633
3118.5D78492469l224552l362328l376454l272921l234625l327399l407449l369927
3134.8D51916814l298462l321975l463835l591686l583044l545463l522098l463566
3151.1D24126685l489167l616035l667921l631740l618807l602833l577232l612339
3167.4C95310611l636480l610253l584802l552407l543645l526330l474117l465593
$$ y = [565169156, 562409699, 559707165, 557014644, 554319024, 551684439, 549149692, 546649754, 544095337, 541500509, 538935184, 536458194, 534043014, 531547904, 528932035, 526300371, 523684144, 521046102, 518378437, 515675306, 512965679, 510280609, 507592380, 504849017, 502003253, 499091297, 496207803, 493357956, 490435779, 487465113, 484538525, 481575102, 478492469, 475267917, 471905589, 468529135, 465256214, 462021589, 458694190, 455286741, 451916814, 448618352, 445296377, 441832542, 438240856, 434657812, 431112349, 427590251, 424126685, 420637518, 417021483, 413353562, 409721822, 406103015, 402500182, 398922950, 395310611, 391674131, 388063878, 384479076, 380926669, 377383024, 373856694, 370382577, 366916984]
3183.7C66916984l477364l430337l350198l312439l339738l376186l343701l258616
3200.1C40028405l189623l172070l134340l060192l033250l012896k963126k910584
3216.4C15552324k862900k831579k823293k798825k701044k603025k567768k517462
3232.7B93846428k491563k499581k437889k370179k348095k298415k222150k181053
3249B74997503k135367k070069k052158k067268k064705k036810j975268j921445j932681
3267.4B56741732j916945j854688j859962j906336j902908j850650j789644j752228
3283.7B41908371j737326j728803j719788j695647j700968j741737j736254j691922
3300B28155926j655847j622915j642108j725197j810521j859426j803011j693875j639843
$$ y = [366916984, 363439620, 360009283, 356659085, 353346646, 350006908, 346630722, 343287021, 340028405, 336838782, 333666712, 330532372, 327472180, 324438930, 321426034, 318462908, 315552324, 312689424, 309857845, 307034552, 304235727, 301534683, 298931658, 296363890, 293846428, 291354865, 288855284, 286417395, 284047216, 281699121, 279400706, 277178556, 274997503, 272862136, 270792067, 268739909, 266672641, 264607936, 262571126, 260595858, 258674413, 256741732, 254824787, 252970099, 251110137, 249203801, 247300893, 245450243, 243660599, 241908371, 240171045, 238442242, 236722454, 235026807, 233325839, 231584102, 229847848, 228155926, 226500079, 224877164, 223235056, 221509859, 219699338, 217839912, 216036901, 214343026, 212703183]
3318.4B12703183j602843j571745j586243j650259j654014j538977j470298j454577
3334.7B00174227j404449j426220j515165j536637j502842j397833j215428j202703
3351A88972950j391962j466111j313954j135707j080573j046970q97288p95126r24737
3369.3A78920522j131683j133710r05753p12648o47291o15329n48899m18499j97574
3387.7A72609136k5526j54674l86760k83748J05635L05354O5848k16856j04115J51784
3408.1A72066078K67013K94850K80663K85328L84122M90904N44652O95586R17524J015306
3428.5A77242026R58070J022696J174689J033887P66039Q17463J132071J376316J469955
3446.8A86993212J487657J515120J558528J654624J823381J937136J860425J856625
$$ y = [212703183, 211100340, 209528595, 207942352, 206292093, 204638079, 203099102, 201628804, 200174227, 198769778, 197343558, 195828393, 194291756, 192788914, 191391081, 190175653, 188972950, 187580988, 186114877, 184800923, 183665216, 182584643, 181537673, 180640385, 179845259, 178920522, 177788839, 176655129, 175749376, 175036728, 174389437, 173774108, 173225209, 172806710, 172609136, 172583610, 172428936, 172042176, 171758428, 171864063, 172169417, 172235265, 172018409, 171914294, 172066078, 172333091, 172627941, 172908604, 173193932, 173578054, 174068958, 174613610, 175309196, 176226720, 177242026, 178200096, 179222792, 180397481, 181431368, 182197407, 183014870, 184146941, 185523257, 186993212, 188480869, 189995989, 191554517, 193209141, 195032522, 196969658, 198830083, 200686708]
3463.2B00686708K171502K397954K153918J739070J748860K091810K386168K447650
3479.5B17823640K285018K255410K438083K495975K454981K575040K754613K854631
3495.8B37937391K811685K771273K851069K813921K699867K831041L126771L372669
3512.1B61215687L399044L215641L167480L373414L665030L669948L481626L547281
3528.4B88735151L787965L954798M105061M136592M008234M140466M442245M543155
3544.7C21853667M388363M289776M450828M684209M790277M861682N020619N097598
3561.1C59437019M970073M994005N641133O102711N837113N665361N859793O088465
3577.4D04595673O307244O456197O346643O314456O691486O992042O780684O747603
$$ y = [200686708, 202858210, 205256164, 207410082, 209149152, 210898012, 212989822, 215375990, 217823640, 220108658, 222364068, 224802151, 227298126, 229753107, 232328147, 235082760, 237937391, 240749076, 243520349, 246371418, 249185339, 251885206, 254716247, 257843018, 261215687, 264614731, 267830372, 270997852, 274371266, 278036296, 281706244, 285187870, 288735151, 292523116, 296477914, 300582975, 304719567, 308727801, 312868267, 317310512, 321853667, 326242030, 330531806, 334982634, 339666843, 344457120, 349318802, 354339421, 359437019, 364407092, 369401097, 375042230, 381144941, 386982054, 392647415, 398507208, 404595673, 410902917, 417359114, 423705757, 430020213, 436711699, 443703741, 450484425, 457232028]
3593.7D57232028P071257P330239P436901P463455P295430P045686P265628P640719
3610E15781343P709265P661819P444084P645786Q304774Q019507P097125O600738P380128
3628.4E83644569Q422732P830680P296264P208228P010162O806075O464541N813897
3644.7F40497148N436122O265104P131160O321907N504548N742133N695462M985809
3661F87579393M457415M090070L581465L494322L849923L446103L297448L939628L879547
3679.4G21615314L398657K965272K504706K280593K474308K765715K737522K420962
3695.7G43163049J963139J582086J626015J863896J667321J160026R16660J372277
3712G55314469J977146J815319J283944R30130Q18789Q77559J086414J191139P66039
$$ y = [457232028, 464303285, 471633524, 479070425, 486533880, 493829310, 500874996, 508140624, 515781343, 523490608, 531152427, 538596511, 546242297, 554547071, 562566578, 569663703, 576264441, 583644569, 592067301, 599897981, 607194245, 614402473, 621412635, 628218710, 634683251, 640497148, 645933270, 652198374, 659329534, 665651441, 671155989, 676898122, 682593584, 687579393, 692036808, 696126878, 699708343, 703202665, 707052588, 710498691, 713796139, 717735767, 721615314, 725013971, 727979243, 730483949, 732764542, 735238850, 738004565, 740742087, 743163049, 745126188, 746708274, 748334289, 750198185, 751865506, 753025532, 753942192, 755314469, 757291615, 759106934, 760390878, 761321008, 762139797, 763017356, 764103770, 765294909, 766060948]
3730.3G66060948K83003N08785J268983J507402Q43286K6584R7036P81894O08623N26309
3750.7G72512853J259267J397551Q45611O08444Q58009Q30054N08368L44813M07636
3769.1G79572606P45118R48071O58334L14354L13998M78267M45128L97563N10514N99861
3789.5G84983814M97460J60158p4268k0921o9618J26600O44028N44072M97162P78198
3809.9G88066685N01752j36435k67744J1265n9426L29555Q71598O47962K86341R656
3830.3G90261209r5487Q226q3626j13368L07799O84917P62701M83990j26958q74222
3850.7G91215181j122296K72275J380860R00925R7274k92659o3180P9631j08361J30892
3871.1G92490542M76956N08130K59757j92821j41680J32262J65463L38733K01225o6518
$$ y = [766060948, 766343951, 766852736, 768121719, 769629121, 770472407, 770498991, 770596027, 771377921, 771986544, 772512853, 773772120, 775169671, 776015282, 776623726, 777481735, 778311789, 778820157, 779164970, 779572606, 780317724, 781265795, 781924129, 782238483, 782552481, 783030748, 783475876, 783873439, 784383953, 784983814, 785481274, 785641432, 785567164, 785546243, 785476625, 785603225, 786247253, 786791325, 787288487, 788066685, 788568437, 788432002, 788164258, 788175523, 788116097, 788445652, 789317250, 789965212, 790251553, 790261209, 790165722, 790173948, 790090322, 789976954, 790284753, 790969670, 791732371, 792216361, 792089403, 791215181, 790092885, 790365160, 791746020, 792646945, 792744219, 792451560, 792388380, 792468011, 792359650, 792490542, 792967498, 793475628, 793735385, 793542564, 793400884, 793533146, 793698609, 794037342, 794238567, 794172049]
3891.5G94172049J70648K19702k31504n06401k99931J60456O20365O54400K77221q226
3911.9G95228779j08123j76787l3915K09868J31607l5226K3067L1829m0174J12593
3932.3G95343518L06666K16067L5703o0499n9425N8710Q8692K8253R2685K25305K30670
3954.7G96506345J26839Q0943P3910M0769M7625J44958K28643J81973Q8633N3942O6578
3977.1G97641158R4891J46150J83285J74939J45376R7990Q1420J27256J40428J07944
3997.5G98940837
$$ y = [794172049, 794342697, 794562399, 794330895, 793824494, 793524563, 793685019, 794305384, 794959784, 795237005, 795228779, 795120656, 794943869, 794909954, 795119822, 795251429, 795216203, 795239270, 795271099, 795230925, 795343518, 795650184, 795866251, 795901954, 795841455, 795782030, 795840740, 795929432, 795957685, 796050370, 796275675, 796506345, 796633184, 796714127, 796788037, 796828806, 796876431, 797021389, 797250032, 797432005, 797520638, 797574580, 797641158, 797736049, 797882199, 798065484, 798240423, 798385799, 798483789, 798565209, 798692465, 798832893, 798940837]
##END=$$ End of the data block
