##TITLE=$$ Begin of the data block
##JCAMP-DX=5.00 $$ ACD/SpecManager v 10.08
##SPECTROMETER/DATA SYSTEM=Alpha
##DATE=14 Apr 2014 11:23:48
##DATA TYPE=INFRARED SPECTRUM
##DATA CLASS=XYDATA
##ORIGIN=
##OWNER=
##NPOINTS=1765
##FIRSTX=399.75695801
##LASTX=3997.56933594
##MAXX=3997.56933594
##MINX=399.75695801
##MAXY=0.83828706
##MINY=0.17207363
##XFACTOR=1.0000000000
##YFACTOR=1.000000000000000e-9
##FIRSTY=0.53676778
##DELTAX=2.03957629
##XUNITS=1/CM
##YUNITS=ARBITRARY UNITS
##XYDATA=(X++(Y..Y))
399.8E36767781k959550l222406j000821l60727k065957k182663l51130L99231j192927
$$ 536767781 533808231 530585825 529585004 529224277 527158320 524975657 524624527 525023758 523830831
418.1E23830831k707541j129568P53105J64628j843870j904904m4287K39969j747370
$$ 523830831 521123290 519993722 520746827 520911455 519067585 517162681 517118394 517358363 515610993
436.5E15610993k429903m32193R85563M4346j141787n10275Q35597L66688j403987
$$ 515610993 513181090 512748897 513734460 513778806 512637019 512126744 512962341 513329029 511925042
454.8E11925042j763225k35557N02765r74059k370775j530826k26498j013160k462029
$$ 511925042 510161817 509926260 510429025 509454966 507084191 505553365 505326867 504313707 501851678
473.2E01851678j932174m20779k09719j300305j763433p18862J51932n77420j784325
$$ 501851678 499919504 499498725 499289006 497988701 496225268 495506406 495658338 495080918 493296593
491.5D93296593j626163n78702o67959j919180k320886j085818j53005r67473k187162
$$ 493296593 491670430 491091728 490423769 488504589 486183703 485097885 484944880 483977407 481790245
509.9D81790245j865000o85751p76470k028704k457857j537919r43124j794100k784222
$$ 481790245 479925245 479239494 478463024 476434320 473976463 472438544 471495420 469701320 466917098
528.3D66917098k169341p90328p63387j924574k035022o04421K12402p46698j742392
$$ 466917098 464747757 463957429 463194042 461269468 459234446 458630025 458842427 458095729 456353337
546.6D56353337j120717p6532o55174k283782k588660j369863r73106k283841l394187
$$ 456353337 455232620 455156088 454500914 452217132 449628472 448258609 447285503 445001662 441607475
565D41607475k865374k058834k771824l956229l506422j885533j527637k782315l238738
$$ 441607475 438742101 436683267 433911443 429955214 426448792 424563259 423035622 420253307 417014569
583.3D17014569j999527j026541j754582k849460k424627j178086j143038k556235
$$ 417014569 415015042 413988501 412233919 409384459 406959832 405781746 404638708 402082473
599.6D02082473l538161k743155j247943p82609j111328q12352L20017J159221J539767
$$ 402082473 398544312 395801157 394553214 393770605 392659277 391846925 392166942 393326163 394865930
618C94865930K446890L980100M931033M352629L361314L560603M479945M323512K896488
$$ 394865930 397312820 401292920 406223953 410576582 413937896 417498499 421978444 426301956 429198444
636.3D29198444J818180J855433J807988J208514J470774K705038K957135J037717
$$ 429198444 431016624 432872057 434680045 435888559 437359333 440064371 443021506 444059223
652.7D44059223j223922q3178M643738P788867O484717L560424L090083N299122M470527
$$ 444059223 442835301 442752123 447395861 455184728 461669445 465229869 468319952 473619074 478089601
671D78089601K531677K224744L267675M067064L183633J766562J798123K905041K857566
$$ 478089601 480621278 482846022 486113697 490180761 493364394 495130956 496929079 499834120 502691686
689.4E02691686J312494L72768J175582K038479J267672N4896O00576K353430K951503
$$ 502691686 504004180 504376948 505552530 507591009 508858681 508913577 509514153 511867583 514819086
707.7E14819086J960456J493037K801537L984511L208399J854360K321482L942013
$$ 514819086 516779542 518272579 521074116 525058627 528267026 530121386 532442868 536384881
724E36384881M110574K526224J654148K734423L684461K596855R55582J272380K914131
$$ 536384881 540495455 543021679 544675827 547410250 551094711 553691566 554647148 555919528 558833659
742.4E58833659L203928J691818R19044K194047L358126K414823Q81970J330971L026486
$$ 558833659 562037587 563729405 564648449 566842496 570200622 572615445 573497415 574828386 577854872
760.8E77854872L140926J502574Q42213K114415L049255J807213j77145m59075M80830
$$ 577854872 580995798 582498372 583340585 585455000 588504255 590311468 590134323 589675248 590156078
779.1E90156078J26124j686335k294242n69046J390040J754224J840592L763080O694614
$$ 590156078 590282202 588595867 586301625 585732579 587122619 588876843 590717435 594480515 601175129
797.5F01175129P884205O924569O186665O868481P197917N445063L048837K486289
$$ 601175129 609059334 615983903 622170568 629039049 636236966 641682029 644730866 647217155
813.8F47217155L195822K415716k14576k160430k191723k294421m208267o380260o514728
$$ 647217155 650412977 652828693 652614117 650453687 648261964 645967543 641759276 635379016 628864288
832.1F28864288n163014m805863n867481o235063m947543l546715l205478k670884
$$ 628864288 623701274 618895411 613027930 606792867 601845324 598298609 595093131 592422247
848.5E92422247j61529L855050P118344Q560777R527683J1340142J2859225J2257755
$$ 592422247 592260718 596115768 603234112 611794889 621322572 632662714 645521939 657779694
864.8F57779694J0226845R076834R072244Q127988N400598K938807K460658K375782
$$ 657779694 668006539 677083373 686155617 694283605 699684203 702623010 705083668 707459450
881.1G07459450M99785k204001l188730k370893k024591k884686k951801q55088J643419
$$ 707459450 707959235 705755234 702566504 700195611 698171020 695286334 692334533 691479445 693122864
899.4F93122864K162337J230598J119017J981139J655579o78659l099501l841102l785312
$$ 693122864 695285201 696515799 697634816 699615955 701271534 700592875 697493374 693652272 689866960
917.8F89866960m630744n705715m953801k409816l15964J06573J19209J055896K067566
$$ 689866960 685236216 679530501 674576700 672166884 671850920 671957493 672076702 673132598 675200164
936.2F75200164J640499K64287j89900N16653N25057j160145l108203l892482m430174
$$ 675200164 676840663 677104950 676915050 677431703 677956760 676796615 673688412 669795930 665365756
954.5F65365756o309510r075880j1038303j2048721j3640762j6427576j8899620j9538581
$$ 665365756 659056246 649980366 638942063 626893342 613252580 596825004 577925384 558386803
970.8E58386803j8773079j7762721j6565740j4579505j2079686j0282874r662389r211600
$$ 558386803 539613724 521851003 505285263 490705758 478626072 468343198 458680809 449469209
987.1D49469209q001685o411285n344450m823715m081249k937376k116621k211481
$$ 449469209 441467524 435056239 429711789 424888074 420806825 417869449 415752828 413541347
1003.5D13541347k994389l866225m678905n744964o893992p356227o875783o091475
$$ 413541347 410546958 406680733 402001828 396256864 389362872 382006645 375130862 369039387
1019.8C69039387n675316n531520n103946m389673l959209l925264l797263l282547
$$ 369039387 363364071 357832551 352728605 348338932 344379723 340454459 336657196 333374649
1036.1C33374649k670407k375513k414078k416313k210170k108454k216250j937062
$$ 333374649 330704242 328328729 325914651 323498338 321288168 319179714 316963464 315026402
1052.4C15026402p21722J048416K488374L147543L179609K617986J170665j008600
$$ 315026402 314304680 315353096 317841470 320989013 324168622 326786608 327957273 326948673
1068.7C26948673l002674l904104l716618l215194k937197k713353k447009k539217
$$ 326948673 323945999 320041895 316325277 313110083 310172886 307459533 305012524 302473307
1085C02473307l205985l927112l958344l108412j822561n91129N16831J478136K028376
$$ 302473307 299267322 295340210 291381866 288273454 286450893 285859764 286376595 287854731 289883107
1103.4B89883107J982659J593739J249462R24379J87844j212567l076405m862785n495667
$$ 289883107 291865766 293459505 294708967 295633346 295821190 294608623 291532218 286669433 281173766
1121.8B81173766l940881r73373J241475J837432J210303K42978K97576J574069K864719
$$ 281173766 277232885 276259512 277500987 279338419 280548722 280791700 281089276 282663345 285528064
1140.1B85528064L258258K843141K253086J965850J920194J929253K132714K771825
$$ 285528064 288786322 291629463 293882549 295848399 297768593 299697846 301830560 304602385
1156.4C04602385L799438M930764O043226P316649Q819550J0118783J0708332J0629266
$$ 304602385 308401823 313332587 319375813 326692462 335512012 345630795 356339127 366968393
1172.7C66968393J0349840J0051996R475320Q443505P136017N793899M268825K281517
$$ 366968393 377318233 387370229 396845549 405289054 412425071 418218970 422487795 424769312
1189.1D24769312J02013j494467k054333j845658j190514m1574J488537K777964L134697
$$ 424769312 424871325 423376858 421322525 419476867 418286353 418244779 419733316 422511280 425645977
1207.4D25645977K561987J736641J156836P38293K60771r3192J7673M92572Q83937
$$ 425645977 428207964 429944605 431101441 431839734 432100505 432007313 432024986 432517558 433401495
1225.8D33401495J032442J268029J853466K479703K676039K548129K583712K819061
$$ 433401495 434433937 435701966 437555432 440035135 442711174 445259303 447843015 450662076
1242.1D50662076K754987K144277J399129R97335Q86083P19577N29617P89940J644940
$$ 450662076 453417063 455561340 456960469 457957804 458843887 459563464 460093081 460883021 462527961
1260.4D62527961K606689L264845L821820M637718N602390O173074O227344O352425
$$ 462527961 465134650 468399495 472221315 476859033 482461423 488634497 494861841 501214266
1276.8E01214266O830811P239759P197500P018804P284582P795751P727504O933212
$$ 501214266 508045077 515284836 522482336 529501140 536785722 544581473 552308977 559242189
1293.1E59242189O165683N900145N703985M989982M013002L539026L571272L314495
$$ 559242189 565407872 571308017 577012002 582001984 586014986 589554012 593125284 596439779
1309.4E96439779K483547J772642J746177J981318J789928J338720J317918J719118
$$ 596439779 598923326 600695968 602442145 604423463 606213391 607552111 608870029 610589147
1325.7F10589147J757085J057327L03268J33038K17139l5405l92139j32084N53608
$$ 610589147 612346232 613403559 613706827 613839865 614057004 614021599 613629460 613497376 614050984
1344.1F14050984Q20995M48763P1585J62244K98679j71363j061261j648843j676977
$$ 614050984 614871979 615320742 615392327 615554571 615853250 615681887 614620626 612971783 611294806
1362.4F11294806j602054j955807k288282j960575j615942j910686k478004l271520
$$ 611294806 609692752 607736945 605448663 603488088 601872146 599961460 597483456 594211936
1378.7E94211936m628718n287886l248035K65777J925647J247585j06812j364231k007246
$$ 594211936 589583218 584295332 581047297 581313074 583238721 584486306 584379494 583015263 581008017
1397.1E81008017k298832k630591l292561l999472l776669l160357k945781k857805
$$ 581008017 578709185 576078594 572786033 568786561 565009892 561849535 558903754 556045949
1413.4E56045949k582311k157152j515627r50575q41856o50048k94864k13862k47955
$$ 556045949 553463638 551306486 549790859 548840284 547998428 547348380 547053516 546839654 546591699
1431.8E46591699j49548L92973J476169J882255J756609J844704K299487K941966L338159
$$ 546591699 546442151 546835124 548311293 550193548 551950157 553794861 556094348 559036314 562374473
1450.1E62374473L442049L899574O092071Q996487Q481026P591724Q589864R536207
$$ 562374473 565816522 569716096 575808167 584804654 593285680 600877404 609467268 619003475
1466.4F19003475R068429R358406J1479974J1910617R694696P433355N751729M596173
$$ 619003475 628071904 637430310 648910284 660820901 670515597 677948952 683700681 688296854
1482.8F88296854L194035J394391j45257p07686r67562k210200l912270m274666l807247
$$ 688296854 691490889 692885280 692740023 692032337 691064775 688854575 684942305 680667639 676860392
1501.1F76860392m048824o193817q951843p157743n540907o008506o362021n769133
$$ 676860392 672811568 666617751 657665908 650508165 644967258 638958752 632596731 626827598
1517.4F26827598m533410m140139l907919l633440l597855l104568l160953l620506
$$ 626827598 622294188 618154049 614246130 610612690 607014835 603910267 600749314 597128808
1533.7E97128808l011941k569199k981484k203822r14395k75612K46644O24836Q69989
$$ 597128808 594116867 591547668 588566184 586362362 585447967 585172355 585418999 586043835 586913824
1552.1E86913824R45747Q41737R25958J571298J143634K1338r10163k036809l190637
$$ 586913824 587859571 588701308 589627266 591198564 592342198 592363536 591453373 589416564 586225927
1570.5E86225927l561378m522800o420314o554127o443083p400454q016526q379877
$$ 586225927 582664549 578141749 571721435 565167308 558724225 551323771 543307245 534927368
1586.8E34927368q813858r192645r228349r138823q995324q870006q823335q689433
$$ 534927368 526113510 516920865 507692516 498553693 489558369 480688363 471865028 463175595
1603.1D63175595q489073q494138q660019q412569p887722q312672r042084p302940
$$ 463175595 454686522 446192384 437532365 429119796 421232074 412919402 403877318 396574378
1619.4C96574378o252229o806046o399065n599618m931808l871739l300130l103256
$$ 396574378 390322149 383516103 377117038 371517420 366585612 362713873 359413743 356310487
1635.7C56310487j598150j32501N41270R75996J746267K797932K884984L503889N600690
$$ 356310487 354712337 354579836 355121106 356097102 357843369 360641301 363526285 367030174 372630864
1654.1C72630864N514086N007386N658984O844163P617325P204502P828683R333700
$$ 372630864 378144950 383152336 388811320 395655483 403272808 410477310 418305993 427639693
1670.4D27639693R129107R559244J0669768J0078788R379863J0339648J3344914J2902379
$$ 427639693 436768800 446328044 456997812 467076600 476456463 486796111 500141025 513043404
1686.7E13043404J1081218J1273504J0549426J1017441J2161613J2722492J4828384
$$ 513043404 524124622 535398126 545947552 556964993 569126606 581849098 596677482
1701E96677482J2882352J0670066J0691225R529055Q034706O852150O324887P091701
$$ 596677482 609559834 620229900 630921125 640450180 648484886 655337036 661661923 668753624
1717.3F68753624P284403O013155N231976N149603M900634M505754M020810M598379
$$ 668753624 676038027 682051182 687283158 692432761 697333395 701839149 705859959 710458338
1733.6G10458338N549014M958153M687190M928827N055845N095243M906535M883588
$$ 710458338 716007352 720965505 725652695 730581522 735637367 740732610 745639145 750522733
1749.9G50522733N170762M815400M191637L660440L127397L196358L273189K653837
$$ 750522733 755693495 760508895 764700532 768360972 771488369 774684727 777957916 780611753
1766.3G80611753J945854J729309K234698K723336K277314J763940J813472K007126
$$ 780611753 782557607 784286916 786521614 789244950 791522264 793286204 795099676 797106802
1782.6G97106802J855493J562297J326025J232684J561105J702070J385629J228988
$$ 797106802 798962295 800524592 801850617 803083301 804644406 806346476 807732105 808961093
1798.9H08961093J407028J444995J169086R57727R66966J049161R79841Q20219Q38459
$$ 808961093 810368121 811813116 812982202 813939929 814906895 815956056 816935897 817756116 818594575
1817.2H18594575R83417Q01444M26650M38988O69301P62045Q85785Q05378O22153P02202
$$ 818594575 819577992 820379436 820806086 821245074 821914375 822676420 823562205 824367583 824989736 825691938
1837.6H25691938O53029K31027M4346O05166R88901P55489M58181M11510N31197N17130
$$ 825691938 826344967 826575994 826620340 827225506 828214407 828969896 829428077 829839587 830370784 830887914
1858H30887914L41415K34723K72751J98960J20581L75032O31154O27696M76539K25246
$$ 830887914 831229329 831464052 831736803 831935763 832056344 832431376 833062530 833690226 834166765 834392011
1878.4H34392011Q3149K27868M00186K56598k3782Q8989L80874L59058J76788R4831
$$ 834392011 834475160 834703028 835103214 835359812 835336030 835425019 835805893 836164951 836341739 836436570
1898.8H36436570K01165L30329K29776j8954m1664K24471L26276J4544k51770M768
$$ 836436570 836637735 836968064 837197840 837178886 837137222 837361693 837687969 837702513 837450743 837455511
1919.2H37455511K70248J88469P6652L9935J11640J44600k5510j54376m9770J7643
$$ 837455511 837725759 837914228 837990880 838030815 838142455 838287055 838261545 838107169 838057399 838075042
1939.6H38075042j39117k13802n7340Q6010N5074j34826k85267j87755k0564n7697
$$ 838075042 837935925 837722123 837664783 837750793 837805867 837671041 837385774 837198019 837177455 837119758
1960H37119758k08020k38478j33336l6597j00494k07901j38044k0206p2479k18153
$$ 837119758 836911738 836673260 836539924 836503327 836402833 836194932 836056888 836036682 835964203 835746050
1980.4H35746050k25186j21296q6963j88232l21924k40326k6643m0293k22683k75195
$$ 835746050 835520864 835399568 835312605 835124373 834802449 834562123 834535480 834495187 834272504 833997309
2000.8H33997309j99556j58310k24710k96235k67744k07841k52307l37898k92540k00331
$$ 833997309 833797753 833639443 833414733 833118498 832850754 832642913 832390606 832052708 831760168 831559837
2021.2H31559837j89662k62857l33845l09468k14457j86443k63811l21149k86520k13444
$$ 831559837 831370175 831107318 830773473 830464005 830249548 830063105 829799294 829478145 829191625 828978181
2041.6H28978181j93477k33173k49744j70171j11699j82629k65658k17139j18196j48058
$$ 828978181 828784704 828551531 828301787 828131616 828019917 827837288 827571630 827354491 827236295 827088237
2062H27088237k40803k08318q1301m3631j20222j67668j00017m3153o7056j06215j23322
$$ 827088237 826847434 826639116 826557815 826514184 826393962 826226294 826126277 826083124 826016068 825909853 825786531
2084.4H25786531j03891r7930j20640j20461o3360K623o616o9619q0824k1517L8445
$$ 825786531 825682640 825584710 825464070 825343609 825280249 825282872 825276256 825206637 825125813 825104296 825142741
2106.9H25142741N663q5652p4029L457K8908n662l696R6321J68741J02997J3530N4240
$$ 825142741 825148404 825062752 824988723 824992180 825021088 825015426 825011730 825108051 825276792 825379789 825393319 825447559
2131.3H25447559J47045J27971J2517j967J04606J65463J48237J24871J22905J35660
$$ 825447559 825594604 825722575 825735092 825733125 825837731 826003194 826151431 826276302 826399207 826534867
2151.7H26534867J37866J18673J16884J41204J66654J58608J37508J58489J92761J98782
$$ 826534867 826672733 826791406 826908290 827049494 827216148 827374756 827512264 827670753 827863514 828062296
2172.1H28062296J76489J61946J60873J45674J48415J64092J42693J09375J00017R3817
$$ 828062296 828238785 828400731 828561604 828707278 828855693 829019785 829162478 829271853 829371870 829465687
2192.5H29465687P2360O0320Q2910J04785Q2553N1737M8935O5625Q5950P0393J7404
$$ 829465687 829538047 829598367 829681277 829786062 829868615 829920352 829969287 830034912 830120862 830191255 830208659
2215H30208659L517M1604N6684K4497N901L4869O7353M5538k6762n2154J1325M5359
$$ 830208659 830212176 830253780 830310464 830334961 830340862 830375731 830443084 830488622 830461860 830409706 830421031 830466390
2239.4H30466390k9266j06752r4354n0485m0651p7367r5009m6373k324k1220o7889
$$ 830466390 830437124 830330372 830236018 830185533 830144882 830067515 829972506 829926133 829923809 829902589 829834700
2261.9H29834700l4869P0572Q8751j848m6134L5227J10864N7221K1100J10447J68264
$$ 829834700 829799831 829870403 829959154 829957306 829911172 829946399 830057263 830114484 830135584 830246031 830414295
2284.3H30414295Q2672k2233J729R2566R8526K8551j1623J7285P6354O0081l7014n8472
$$ 830414295 830496967 830474734 830476463 830569029 830667555 830696106 830684483 830701768 830778122 830838203 830801189 830742717
2308.8H30742717N1141J37031R1970q107n1915j8776J3709J3888L7432R5844J11938
$$ 830742717 830793858 830930889 831022859 831014752 830962837 830944061 830957770 830971658 831009090 831104934 831216872
2331.2H31216872Q1837L2723J9848O0678O6042J04010L39508N39422L27527o8783k90931
$$ 831216872 831298709 831331432 831351280 831411958 831478000 831582010 831921518 832460940 832788467 832719684 832428753
2353.6H32428753k55644n6148Q2314O6281J68919M07577N14209M59790L75808L92735
$$ 832428753 832173109 832116961 832199275 832265556 832434475 832842052 833356261 833816051 834191859 834584594
2374H34584594N31614N93066N11527M31836L88085L05176J86503R4235Q0287J22846
$$ 834584594 835116208 835709274 836220801 836652637 837040722 837345898 837532401 837626636 837706923 837829769
2394.4H37829769J22368O1393L7849O2406O8247L7789k3722m9830J1623P0691K9803
$$ 837829769 837952137 838013530 838051379 838113785 838182032 838219821 838196099 838146269 838157892 838228583 838258386
2416.9H38258386n6863r5129r1732j10805j30653r0361l3676l815k9683j03772j03891
$$ 838258386 838201523 838106394 838014662 837903857 837773204 837682843 837649167 837645352 837615669 837511897 837408006
2439.3H37408006l1054l6955j11282j46448j38521j20283r7572q6487j03056j33872
$$ 837408006 837376952 837339997 837228715 837082267 836943746 836823463 836725891 836639404 836536348 836402476
2459.7H36402476j59145j64270j54853j18434q8692j39713k04027j99854j56463j34825
$$ 836402476 836243331 836079061 835924208 835805774 835717082 835577369 835373342 835173488 835017025 834882200
2480.1H34882200j69993k14338k07126j56105j15931j37925j89423j84596j54793j67847
$$ 834882200 834712207 834497869 834290743 834134638 834018707 833880782 833691359 833506763 833351970 833184123
2500.5H33184123j73509j45137j10507r9600j55627k01583j59920j30832j81019k57313
$$ 833184123 833010614 832865477 832754970 832655370 832499743 832298160 832138240 832007408 831826389 831569076
2520.9H31569076k59757j60397j13666j98960k67744k06530j23561j41143k12610k31028
$$ 831569076 831309319 831148922 831035256 830836296 830568552 830362022 830238461 830097318 829884708 829653680
2541.3H29653680j72913j45912k02656k39730j93357j49429j99020k69413k66313k30074
$$ 829653680 829480767 829334855 829132199 828892469 828699112 828549683 828350663 828081250 827814937 827584863
2561.7H27584863k40684k94566l07262k61307k49326l32534m27068l96728k95878k96175
$$ 827584863 827344179 827049613 826742351 826481044 826231718 825899184 825472116 825075388 824779510 824483335
2582.1H24483335m02272m53472l90351l74913m80235n40673m80652m33028m82261n44786
$$ 824483335 824081063 823627591 823237240 822862327 822382092 821841419 821360767 820927739 820445478 819900692
2602.5H19900692n42343n25475n54204o07311o20723n97418n81920n61654n63026o08384
$$ 819900692 819358349 818832874 818278670 817671359 817050636 816453218 815871298 815309644 814746618 814138234
2622.9H14138234o29187o25730o45875o48678o21736n92172n68628n74231n91994n81622
$$ 814138234 813509047 812883317 812237442 811588764 810967028 810374856 809806228 809231997 808640003 808058381
2643.3H08058381n44965n40972n68032n81265n87642n79595n67556n66661n63264n72384
$$ 808058381 807513416 806972444 806404412 805823147 805235505 804655910 804088354 803521693 802958429 802386045
2663.7H02386045n96284n89848n20408m70519n25654n85496n76735n68330n90443o12557
$$ 802386045 801789761 801199913 800679505 800208986 799683332 799097836 798521101 797952771 797362328 796749771
2684.1G96749771o05047n88775n94735o07014o30498o88672p27415p14302o97672o87063
$$ 796749771 796144724 795555949 794961214 794354200 793723702 793035030 792307615 791593313 790895641 790208578
2704.5G90208578o92189p44581q02636p87616p30991p23779p56801p68184p51436p29263
$$ 790208578 789516389 788771808 787969172 787181556 786450565 785726786 784969985 784201801 783450365 782721102
2724.8G82721102p17163p45356p74801p43210o98447o85215o94394p37310p66218p05599
$$ 782721102 782003939 781258583 780483782 779740572 779042125 778356910 777662516 776925206 776158988 775453389
2745.2G75453389o33598o80089p92086q36193q01087p54535p76052q56221r10104q94784
$$ 775453389 774819791 774139702 773347616 772511423 771710336 770955801 770179749 769323528 768413424 767518640
2765.6G67518640q62539r12905r72748r55045r58800j025975j080930j105130j135409
$$ 767518640 766656101 765743196 764770448 763815403 762856603 761830628 760749698 759644568 758509159
2784G58509159j169860j181424j184702j227021j300573j347363j368523j408041j459181
$$ 758509159 757339299 756157875 754973173 753746152 752445579 751098216 749729693 748321652 746862471
2802.3G46862471j524687j589894j597166j607597j685917j770199j797735j810670
$$ 746862471 745337784 743747890 742150724 740543127 738857210 737087011 735289276 733478606
2818.7G33478606j900673k041221k137482k211213k341747k539754k825499l212988
$$ 733478606 731577933 729536712 727399230 725188017 722846270 720306516 717481017 714268029
2835G14268029l701628m342854n161762o121814p105768p718324p347405n811811l661573
$$ 714268029 710566401 706223547 701061785 694939971 687834203 680115879 672768474 666956663 663295090
2853.3F63295090j678109l61800J27852j70529r88543j930356k713680l090859k879798
$$ 663295090 661616981 661255181 661383033 661212504 660223961 658293605 655579925 652489066 649609268
2871.7F49609268k305389j835882j628638j613736j782417k055049k354384k658605
$$ 649609268 647303879 645467997 643839359 642225623 640443206 638388157 636033773 633375168
2888F33375168k876461k973675l060461l204166l308595l333866l431320l719390m133522
$$ 633375168 630498707 627525032 624464571 621260405 617951810 614617944 611186624 607467234 603333712
2906.4F03333712m619241n273223o113470o819188o918550o320476n260587l863692
$$ 603333712 598714471 593441248 587327778 580508590 573590040 567269564 562008977 558145285
2922.7E58145285k237380n94258P88331J722216K401054L088951L694952M044771M127443
$$ 558145285 555907905 555313647 556101978 557824194 560225248 563314199 567009151 571053922 575181365
2941E75181365L922760L361643K482176J531779Q16823M17351L55959O75380J221359
$$ 575181365 579104125 582465768 584947944 586479723 587296546 587713897 588069856 588745236 589966595
2959.4E89966595J791299K255559K551496K629578K522230K387762K220333J942515
$$ 589966595 591757894 594013453 596564949 599194527 601716757 604104519 606324852 608267367
2975.7F08267367J714110J616657J489580J331091J226067J104474R48072P03752L05712
$$ 608267367 609981477 611598134 613087714 614418805 615644872 616749346 617697418 618401170 618706882
2994.1F18706882p9751l87311o54578q33392r87292j123726j151502j152992j291454
$$ 618706882 618627131 618239820 617585242 616751850 615764558 614640832 613489330 612336338 611044884
3012.4F11044884j521945j691819j806318j912833j981854k069235k191663k228498
$$ 611044884 609522939 607831120 606024802 604111969 602130115 600060880 597869217 595640719
3028.7E95640719k209544k233982k351106k450287k384961k372086k527535k647697
$$ 595640719 593431175 591197193 588846087 586395800 584010839 581638753 579111218 576463521
3045.1E76463521k684892k682507k678692k737165k760469k705396k701938k713144
$$ 576463521 573778629 571096122 568417430 565680265 562919796 560214400 557512462 554799318
3061.4E54799318k635836k524555k473533k531827k600073k559007k437114k380372
$$ 554799318 552163482 549638927 547165394 544633567 542033494 539474487 537037373 534657001
3077.7E34657001k496659k628088k637446k631128k653718k654970k670765k713322
$$ 534657001 532160342 529532254 526894808 524263680 521609962 518954992 516284227 513570905
3094E13570905k704978k681136k751053k855956k874494k847165k870321k967537k999335
$$ 513570905 510865927 508184791 505433738 502577782 499703288 496856123 493985802 491018265 488018930
3112.4D88018930k938092k962470l074765l232569l373324l371031l272593l221422
$$ 488018930 485080838 482118368 479043603 475811034 472437710 469066679 465794086 462572664
3128.7D62572664l311604l438115l412992l299385l301710l467799l600776l573268
$$ 462572664 459261060 455822945 452409953 449110568 445808858 442341059 438740283 435167015
3145D35167015l506840l460616l446877l536701l647923l648341l626585l645539l632158
$$ 435167015 431660175 428199559 424752682 421215981 417568058 413919717 410293132 406647593 403015435
3163.4D03015435l595501l579230l589183l598600l588558l565698l539920l505528
$$ 403015435 399419934 395840704 392251521 388652921 385064363 381498665 377958745 374453217
3179.7C74453217l473431l460229l463953l461391l416151l369152l367454l357083
$$ 374453217 370979786 367519557 364055604 360594213 357178062 353808910 350441456 347084373
3196C47084373l299325l232599l171146l135830l122896l089785l056050l037452k984018
$$ 347084373 343785048 340552449 337381303 334245473 331122577 328032792 324976742 321939290 318955272
3214.3C18955272k893388k838254k826035k806932k766102k720922k663643k579629
$$ 318955272 316061884 313223630 310397595 307590663 304824561 302103639 299439996 296860367
3230.7B96860367k501011k503395k548426k515972k418399k309531k207309k156526
$$ 296860367 294359356 291855961 289307535 286791563 284373164 282063633 279856324 277699798
3247B77699798k182364k188921k122432k058685k050489k065808k022504j955957j954019
$$ 277699798 275517434 273328513 271206081 269147396 267096907 265031099 263008595 261052638 259098619
3265.3B59098619j951456j868754j820714j874596j898899j875505j854465j803234
$$ 259098619 257147163 255278409 253457695 251583099 249684200 247808695 245954230 244150996
3281.6B44150996j779303j779675j725927j683608j710713j755893j769573j760497
$$ 244150996 242371693 240592018 238866091 237182483 235471770 233715877 231946304 230185807
3298B30185807j737386j669646j586020j603901j706242j785949j809150j758129j707360
$$ 230185807 228448421 226778775 225192755 223588854 221882612 220096663 218287513 216529384 214822024
3316.3B14822024j683831j607493j552418j600414j660585j644567j572371j524001
$$ 214822024 213138193 211530700 209978282 208377868 206717283 205072716 203500345 201976344
3332.6B01976344j490965j426191j404285j453400j458138j426086j388758j291573
$$ 201976344 200485379 199059188 197654903 196201503 194743365 193317279 191928521 190636948
3348.9A90636948j273513j379654j405120j291022j156225j085744j042440r38088
$$ 190636948 189363435 187983781 186578661 185287639 184131414 183045670 182003230 181065142
3365.3A81065142q57591r44466j107275j097590q88944p27340o71596o35370n83336
$$ 181065142 180207551 179263085 178155810 177058220 176169276 175441936 174770340 174134970 173551634
3383.6A73551634m80592k44066J4707n1975l51191l64885J4380K95043J08942j85877
$$ 173551634 173071042 172826976 172841683 172789708 172438517 172073632 172088012 172383055 172491997 172306120
3404A72306120q5443J92925L11628L07277K67521K86877L95015M89980N60716P13095
$$ 172306120 172220677 172413602 172725230 173032507 173300028 173586905 173981920 174471900 175032616 175745711
3424.4A75745711Q76099R52318R57161J044020J188234J080885Q11979Q44077J146942
$$ 175745711 176621810 177574128 178531289 179575309 180763543 181844428 182656407 183500484 184647426
3442.8A84647426J361161J462281J487434J496986J559585J657948J795709J917988
$$ 184647426 186008587 187470868 188958302 190455288 192014873 193672821 195468530 197386518
3459.1A97386518J883283J891151K180383K394795K135605J717866J766279K117410
$$ 197386518 199269801 201160952 203341335 205736130 207871735 209589601 211355880 213473290
3475.4B13473290K403423K476886K283424K221048K442688K521947K464473K578587
$$ 213473290 215876713 218353599 220637023 222858071 225300759 227822706 230287179 232865766
3491.7B32865766K744391K840176K791763K765134K872705K807662K689257K880276
$$ 232865766 235610157 238450333 241242096 244007230 246879935 249687597 252376854 255257130
3508B55257130L166407L322870L301233L148913L194153L439397L665388L627330L458410
$$ 255257130 258423537 261746407 265047640 268196553 271390706 274830103 278495491 282122821 285581231
3526.4B85581231L563106L816515L958583M094959M163116M068076M171878M435540
$$ 285581231 289144337 292960852 296919435 301014394 305177510 309245586 313417464 317853004
3542.7C17853004M545182M435837M323572M415572M649937M784375M862070N053222
$$ 317853004 322398186 326834023 331157595 335573167 340223104 345007479 349869549 354922771
3559C54922771N099476M912525M970908N674720O141365N843639N650312N874306O135672
$$ 354922771 360022247 364934772 369905680 375580400 381721765 387565404 393215716 399090022 405225694
3577.4D05225694O313235O421178O337375O310195O662815O971032O796211O819248
$$ 405225694 411538929 417960107 424297482 430607677 437270492 444241524 451037735 457856983
3593.7D57856983P150233P320940P395834P466167P284612P046640P325172P662654
$$ 457856983 465007216 472328156 479723990 487190157 494474769 501521409 508846581 516509235
3610E16509235P688999P684112P465303P653653Q342445Q018851P049978O606579P452250
$$ 516509235 524198234 531882346 539347649 547001302 555343747 563362598 570412576 577019155 584471405
3628.4E84471405Q391559P693767P252217P273852P086933O843031O439030N795359
$$ 584471405 592862964 600556731 607808948 615082800 622169733 629012764 635451794 641247153
3644.7F41247153N460024O238341P052899O311119N568563N774200N676985N001486
$$ 641247153 646707177 652945518 659998417 666309536 671878099 677652299 683329284 688330770
3661F88330770M498720M093110L538251L472984L881991L496289L313899L865779L775000
$$ 688330770 692829490 696922600 700460851 703933835 707815826 711312115 714626014 718491793 722266793
3679.4G22266793L355980K979815K515555K329290K576112K786160K674520K372026
$$ 722266793 725622773 728602588 731118143 733447433 736023545 738809705 741484225 743856251
3695.7G43856251J989484J681566J686633J806498J596570J156330R55760J364648
$$ 743856251 745845735 747527301 749213934 751020432 752617002 753773332 754729092 756093740
3712G56093740J868904J720965J290977R89556Q50678R01162J094699J093090O70791
$$ 756093740 757962644 759683609 760974586 761964142 762814820 763715982 764810681 765903771 766574562
3730.3G66574562L23236N42461J263619J562655Q90672J3948M2438P86245O70433N52475
$$ 766574562 766897798 767440259 768703878 770266533 771157205 771171153 771213591 771999836 772670269 773222744
3750.7G73222744J242817J401186Q89659O14941P99954Q03470N23091L59833M28975
$$ 773222744 774465561 775866747 776756406 777371347 778171301 778974771 779497862 779857695 780286670
3769.1G80286670P45058R03249O36279L52264L30329M44233M15504L77059N16534O04868
$$ 780286670 781031728 781934977 782571256 782923520 783253849 783698082 784113586 784490645 785007179 785612047
3789.5G85612047M65750J33276n9306M4405k0325Q5712N63800N35726N60701Q05736
$$ 785612047 786077797 786211073 786151767 786196172 786175847 786261559 786825359 787361085 787921786 788727522
3809.9G88727522N01454j46747l44634r358M7147L65079P74503N56886K67505O1393
$$ 788727522 789228976 789082229 788737595 788728237 788775384 789140463 789914966 790471852 790739357 790800750
3830.3G90800750J4663J19030q7261k16484K74539P14183P50959M51803j15335q44955
$$ 790800750 790815413 790934443 790847182 790630698 790905237 791619420 792370379 792822182 792706847 791861892
3850.7G91861892j153350K30789J387239Q93950Q7857k31981O616N3287j64450J00255
$$ 791861892 790708542 790939331 792326570 793220520 793308377 793076396 793083012 793136299 792971849 793072104
3871.1G93072104M46499M94659L15010j26838j93239L6359J81258M03821J91510j25110
$$ 793072104 793518603 794013262 794328272 794201434 794008195 794044554 794225812 794629633 794821143 794696033
3891.5G94696033J05739J86205j94610m46200k54571K17259O56783O26087K38955L100
$$ 794696033 794801772 794987977 794793367 794347167 794092596 794309855 794966638 795592725 795831680 795834780
3911.9G95834780j07169k49446j28805K02119K17378M053m589Q2910P4803R5427J76907
$$ 795834780 795727611 795478165 795349360 795551479 795768857 795772910 795768321 795851231 795926034 796021461 796198368
3934.3G96198368J94252R6798p6294j51277J4484J34468P7546R6619K20477K75612
$$ 796198368 796392620 796489418 796413124 796261847 796276331 796410799 796488345 796584964 796805441 797081053
3954.7G97081053J89722P5877M4643P6712J04725J10269J04665J04249J04308P4446
$$ 797081053 797270775 797346652 797391295 797468007 797572732 797683001 797787666 797891915 797996223 798070669
3975.1G98070669Q5533J60694J98841J55568R8348P8916O4731R9301J97411K09928
$$ 798070669 798156202 798316896 798515737 798671305 798769653 798848569 798913300 799012601 799210012 799419940
3995.5G99419940J50084
$$ 799419940 799570024
3997.5G99570024
$$ 799570024
##END=$$ End of the data block
