##TITLE=$$ Begin of the data block
##JCAMP-DX=5.00 $$ ACD/SpecManager v 10.08
##SPECTROMETER/DATA SYSTEM=Alpha
##DATE=14 Apr 2014 11:23:48
##DATA TYPE=INFRARED SPECTRUM
##DATA CLASS=XYDATA
##ORIGIN=
##OWNER=
##NPOINTS=1765
##FIRSTX=399.75695801
##LASTX=3997.56933594
##MAXX=3997.56933594
##MINX=399.75695801
##MAXY=0.83855855
##MINY=0.17240934
##XFACTOR=1.0000000000
##YFACTOR=1.000000000000000e-9
##FIRSTY=0.53522420
##DELTAX=2.03957629
##XUNITS=1/CM
##YUNITS=ARBITRARY UNITS
##XYDATA=(X++(Y..Y))
399.8 535224199 532106876 529258311 528407991 527926505 525807261 523276091 522794247 523608088 522520840
418.1 522520840 519489765 518530428 519658148 519738853 517658412 515729129 515758395 516024590 514338851
436.5 514338851 512213528 512359500 513835847 513802826 512325883 511749804 512553692 512691259 511102855
454.8 511102855 509330928 509093702 509467125 508413613 506204188 504927099 504775763 503696680 501170278
473.2 501170278 499177635 498793781 498692334 497424603 495682538 495022148 495175004 494443566 492388815
491.5 492388815 490590513 490052640 489526153 487736136 485545754 484570265 484414309 483341962 481143922
509.9 481143922 479400218 478722811 477757961 475503445 473024726 471683919 470838726 468936563 466094941
528.3 466094941 464005977 463248461 462398499 460486263 458677202 458253503 458442479 457565457 455767602
546.6 455767602 454687148 454567045 453908414 451819271 449456245 448169649 447060943 444546461 441044122
565 441044122 438235074 436314404 433614254 429659575 426162750 424249768 422726512 420022249 416820407
583.3 416820407 414821088 413813829 412065685 409117877 406456083 405135185 404115617 401768029
599.6 401768029 398386955 395753980 394514740 393603593 392390877 391612947 391921550 393024057 394614726
618 394614726 397139490 401176602 406177253 410557598 413882941 417385072 421852797 426235825 429192305
636.3 429192305 431054890 432973921 434815645 435933381 437218875 439850360 442930996 444101512
652.7 444101512 442895114 442825109 447522104 455338776 461838126 465406597 468521655 473832548 478211582
671 478211582 480655253 482868940 486208647 490360647 493535787 495241940 497052282 500059307 503010333
689.4 503010333 504323661 504664421 505831182 507834554 509047687 509084702 509745300 512183070 515101731
707.7 515101731 516979694 518476605 521303356 525287330 528487265 530303240 532591105 536603451
724 536603451 540850818 543433011 545033514 547681689 551299036 553854167 554828286 556182384 559160531
742.4 559160531 562342525 563941300 564823389 567107022 570543110 572902322 573694646 574981809 577973783
760.8 577973783 581121027 582667589 583524466 585656762 588719964 590466797 590260029 589878321 590425551
779.1 590425551 590590835 588960469 586694062 586143196 587550700 589254618 590989530 594646931 601318300
797.5 601318300 609284043 616233349 622311592 629081845 636254013 641663551 644663751 647149742
813.8 647149742 650426269 652947485 652735353 650489688 648233593 645885944 641625643 635264575 628821850
832.1 628821850 623700678 618915856 613090098 606902182 602005541 598526895 595359206 592681527
848.5 592681527 592542589 596452534 603587329 612120509 621614933 632932544 645742536 657885075
864.8 657885075 667967677 676984608 686095297 694233716 699616015 702591717 705133319 707537115
881.1 707537115 707961857 705682456 702513456 700179338 698072553 695072412 692146361 691372693 693000019
899.4 693000019 695095062 696294546 697432160 699466288 701124370 700360000 697229505 693447888 689677119
917.8 689677119 685036719 679360449 674423277 672007501 671682358 671758175 671840727 672893703 674953818
936.2 674953818 676521599 676690698 676499307 677123606 677734971 676568389 673410654 669467032 664996386
954.5 664996386 658669114 649603665 638593078 626533449 612832665 596395552 577571929 558115721
970.8 558115721 539395988 521666586 505122423 490563005 478486031 468186706 458502859 449252427
987.1 449252427 441206396 434773654 429411590 424557447 420443028 417475879 415346563 413116992
1003.5 413116992 410054296 406123817 401448607 395714223 388793528 381417155 374577254 368558794
1019.8 368558794 362945557 357483923 352477223 348176569 344253808 340317160 336507767 333253592
1036.1 333253592 330638140 328267455 325826287 323439538 321272790 319161952 316954732 315043300
1052.4 315043300 314300448 315324038 317838341 321006238 324161083 326739937 327892929 326859713
1068.7 326859713 323826700 319948852 316256166 313001245 310028732 307347059 304948002 302411020
1085 302411020 299205303 295289963 291353732 288320541 286583215 286013931 286504835 287944376 289943337
1103.4 289943337 291912705 293490857 294733077 295671016 295891136 294702172 291613966 286737114 281244963
1121.8 281244963 277302533 276299536 277497143 279326707 280568033 280823350 281100124 282648385 285491228
1140.1 285491228 288740665 291595221 293860346 295831740 297778368 299738258 301865697 304625213
1156.4 304625213 308428198 313343018 319363505 326688588 335515320 345616847 356291831 366859198
1172.7 366859198 377128065 387143105 396654308 405137986 412269831 418052226 422323167 424585342
1189.1 424585342 424651980 423149198 421112478 419289947 418106467 418059975 419571549 422383040 425521642
1207.4 425521642 428064883 429773003 430900842 431628227 431914926 431867212 431909502 432398707 433257580
1225.8 433257580 434274495 435569435 437453568 439952105 442665726 445248663 447844207 450659037
1242.1 450659037 453398317 455536574 456961125 458023787 458961755 459668726 460161090 460916400 462542951
1260.4 462542951 465146482 468378425 472148746 476744890 482305825 488466918 494699180 500985086
1276.8 500985086 507723987 514948428 522174776 529216290 536511123 544302583 552028000 558984220
1293.1 558984220 565186560 571107388 576792955 581741214 585744560 589322507 592950940 596292675
1309.4 596292675 598764658 600547612 602336347 604337215 606130362 607486129 608824015 610555112
1325.7 610555112 612297773 613320291 613619387 613798320 614053428 613993227 613568962 613459527 614048004
1344.1 614048004 614883482 615338802 615420103 615588844 615858078 615648150 614612520 613042235 611407518
1362.4 611407518 609760404 607734978 605427980 603501081 601913750 599978805 597451091 594169855
1378.7 594169855 589560091 584270358 581027687 581332088 583268821 584489286 584380448 583035588 581027508
1397.1 581027508 578722060 576071084 572730064 568687975 564904094 561767995 558850288 556005061
1413.4 556005061 553455353 551359355 549867332 548899353 548054755 547422945 547136962 546906531 546648979
1431.8 546648979 546529055 546966970 548422813 550242245 551965594 553791761 556087434 559052706 562405646
1450.1 562405646 565848470 569769502 575897217 584879935 593301773 600839972 609402299 618939281
1466.4 618939281 628027856 637438238 648974717 660868168 670505404 677903175 683658004 688276649
1482.8 688276649 691466689 692859769 692742050 692021787 691014409 688805163 684914351 680635393 676809609
1501.1 676809609 672751784 666594207 657715738 650562048 644972146 638937056 632598996 626866221
1517.4 626866221 622355759 618240952 614340425 610700488 607121408 604054332 600913644 597305000
1533.7 597305000 594339192 591826320 588851094 586622119 585713208 585461915 585724354 586335361 587183952
1552.1 587183952 588146389 589060247 590094745 591649890 592664003 592605948 591692984 589680374 586491585
1570.5 586491585 582914591 578379571 571948767 565380633 558930635 551521540 543495476 535110652
1586.8 535110652 526283324 517099738 507904649 498772204 489752382 480851203 472007215 463315815
1603.1 463315815 454827309 446311206 437623858 429210097 421332210 413019091 403963238 396643341
1619.4 396643341 390373558 383544266 377127677 371511012 366554171 362663776 359357536 356271446
1635.7 356271446 354688078 354549885 355100453 356120080 357931077 360759735 363625139 367107600 372706324
1654.1 372706324 378216863 383233815 388931483 395822734 403464973 410677761 418509543 427843213
1670.4 427843213 436986357 446567744 457228601 467283905 476669818 487037659 500394940 513267636
1686.7 513267636 524313390 535565376 546093702 557095170 569257915 581972539 596773922
1701 596773922 609649301 620335460 631052494 640594304 648638070 655521929 661873519 668968678
1717.3 668968678 676238358 682222247 687426209 692562819 697481275 702029765 706072569 710655570
1733.6 710655570 716193199 721154630 725842893 730780602 735867202 740989506 745905936 750804067
1749.9 750804067 755973399 760760307 764927149 768575251 771710694 774910569 778143108 780766070
1766.3 780766070 782727957 784481347 786711514 789410412 791676581 793437123 795255721 797297657
1782.6 797297657 799185634 800748944 802071214 803307235 804866195 806568384 807959914 809170008
1798.9 809170008 810548782 812002301 813184738 814130187 815094292 816168487 817167699 817989945 818822742
1817.2 818822742 819785953 820569992 821011007 821465611 822123110 822861552 823710978 824503899 825155258 825872898
1837.6 825872898 826511800 826743186 826809406 827423990 828403711 829149425 829609632 830017745 830533564 831043720
1858 831043720 831394851 831650198 831937253 832139790 832245946 832589567 833194137 833794713 834250391 834495723
1878.4 834495723 834621310 834865630 835250616 835482180 835450292 835567236 835989594 836369336 836548090 836641252
1898.8 836641252 836834967 837142766 837352335 837341905 837318242 837552488 837875605 837873876 837628841 837661803
1919.2 837661803 837941289 838106334 838140011 838174045 838315070 838461399 838399053 838205993 838162541 838222563
1939.6 838222563 838117540 837912738 837850809 837929010 837966323 837818325 837554455 837398469 837373078 837285221
1960 837285221 837061465 836819947 836684525 836655378 836559296 836340845 836203396 836173475 836070895 835852623
1980.4 835852623 835656703 835567355 835482359 835256577 834930599 834727108 834714472 834665179 834437668 834174633
2000.8 834174633 833989620 833831966 833602369 833295286 833022356 832827985 832594991 832265615 831945837 831696332
2021.2 831696332 831494629 831265688 830962956 830646813 830411613 830213070 829932511 829606295 829347432 829170644
2041.6 829170644 828990459 828745365 828477263 828285038 828159451 827990532 827731550 827490091 827356219 827217698
2062 827217698 826996148 826805294 826711297 826636434 826523423 826385438 826297164 826286912 826274693 826163828 825982869
2084.4 825982869 825847387 825743496 825607121 825474560 825420201 825434625 825433552 825367808 825291514 825281322 825311422
2106.9 825311422 825287998 825195909 825130045 825149298 825216174 825244308 825234950 825288117 825414956 825505972 825530887
2129.3 825530887 825600386 825738728 825844049 825882137 825932503 826056182 826233208 826393843 826508999 826604187
2149.7 826604187 826711416 826855242 827002823 827110052 827211857 827360451 827538371 827714920 827889383 828068674
2170.1 828068674 828245342 828411043 828570247 828727782 828900158 829091072 829264998 829387069 829484165 829584241
2190.5 829584241 829658747 829716444 829795718 829894900 829993606 830080926 830152512 830212414 830284894 830365300 830418885
2212.9 830418885 830455780 830503941 830563128 830609202 830608428 830585778 830594897 830633402 830658495 830639184 830620408 830660939
2237.4 830660939 830713034 830689728 830585182 830488682 830458224 830426693 830331028 830229282 830197692 830217361 830213130
2259.8 830213130 830150485 830103099 830156684 830229461 830210209 830161750 830202639 830324352 830406964 830454409 830583394
2282.3 830583394 830763280 830824673 830747187 830730319 830864012 831002474 831025720 830989838 831020534 831144035 831231833
2304.7 831231833 831178725 831084132 831116974 831259429 831344068 831294060 831202865 831188381 831238747 831266344 831274211
2327.1 831274211 831355333 831458569 831489623 831487775 831514478 831601918 831723094 831857979 832162857 832663178 832985699
2349.6 832985699 832898021 832519710 832199872 832168639 832255185 832312703 832534730 832993627 833527386 834081352
2370 834081352 834580541 834992647 835470438 836017907 836504996 836923122 837325394 837662458 837852359 837917984
2390.4 837917984 837976933 838098645 838227868 838305175 838355005 838425159 838494539 838509083 838485777 838480949 838514268
2412.8 838514268 838558555 838544309 838456333 838361382 838279068 838184237 838090122 838030398 838009953 837992430 837930441
2435.2 837930441 837812006 837697744 837638021 837572753 837452292 837318122 837219357 837148547 837050915 836917877
2455.6 836917877 836793900 836675942 836538732 836396694 836247563 836110115 836016119 835887611 835668802 835455418
2476 835455418 835325897 835216999 835051239 834857047 834670007 834492981 834340334 834181070 833987117 833807468
2496.4 833807468 833667994 833517849 833346307 833194137 833063304 832926571 832746983 832545459 832378626 832232594
2516.8 832232594 832080305 831903994 831721127 831572890 831414223 831192136 830929339 830695450 830534577 830383658
2537.2 830383658 830167472 829931498 829749644 829596281 829396129 829156816 828967631 828829408 828634977 828364789
2557.6 828364789 828110695 827894747 827650964 827357411 827061534 826803327 826537907 826184988 825758696 825378358
2578 825378358 825084805 824778140 824383914 823932946 823513269 823124409 822657943 822131455 821661830 821228862
2598.4 821228862 820743978 820202947 819647729 819093764 818539977 817966402 817364514 816771150 816195905 815605700
2618.8 815605700 814988613 814381838 813809216 813224912 812575221 811895132 811271250 810717702 810179412 809607744
2639.2 809607744 809002042 808412611 807860792 807305992 806721210 806117594 805520833 804937541 804342151 803749323
2659.6 803749323 803213477 802695811 802115142 801506102 800956309 800465703 799951136 799385905 798808813 798223555
2680 798223555 797619343 796994627 796379268 795810819 795253873 794666946 794024885 793293178 792540133 791849136
2700.4 791849136 791180909 790481508 789759219 789035320 788315058 787594616 786836743 786025941 785216987 784448504
2720.8 784448504 783691406 782947361 782239437 781507432 780753672 780049026 779373169 778687179 777977645 777242362
2741.2 777242362 776511788 775803924 775120020 774422288 773645699 772816539 772002459 771203101 770392060 769570351
2761.6 769570351 768746912 767921925 767071128 766139030 765135765 764127195 763125062 762102604 761030793
2779.9 761030793 759918272 758788764 757621884 756426871 755230129 753990054 752680302 751338065
2796.2 751338065 749980152 748585880 747149825 745650291 744062483 742423654 740769386 739088118
2812.5 739088118 737358689 735579491 733750701 731832862 729799390 727682710 725484133 723139524
2828.9 723139524 720575392 717722476 714508414 710819006 706478596 701301992 695160866 688062787
2845.2 688062787 680384040 673059821 667220652 663517654 661843777 661532402 661675930 661474943 660461962
2863.5 660461962 658490002 655740976 652677059 649825335 647492826 645636082 644023061 642418265
2879.9 642418265 640662134 638644218 636264026 633554757 630686045 627743661 624680042 621473968
2896.2 621473968 618199348 614895701 611458123 607737243 603619158 598994553 593715966 587619781
2912.5 587619781 580791295 573807061 567440391 562209189 558406711 556215048 555617630 556368887 558072269
2930.8 558072269 560459793 563526452 567225099 571298957 575453758 579399288 582773983 585258305
2947.2 585258305 586784184 587583363 587993979 588361382 589058757 590296090 592057824 594253480 596765757
2965.5 596765757 599414170 601982951 604375958 606591403 608574212 610345244 611994624 613477707
2981.8 613477707 614755929 615914822 616986334 617939949 618670225 619002163 618919373 618512332 617867589
3000.2 617867589 617078602 616125226 614981890 613771319 612598181 611365199 609887838 608155251 606316805
3018.5 606316805 604441464 602491617 600403249 598190367 595988214 593813241 591598511 589292109
3034.9 589292109 586860478 584428608 582028389 579508066 576853991 574157536 571479261 568812370
3051.2 568812370 566099763 563367665 560636044 557896554 555227816 552668154 550165832 547657013
3067.5 547657013 545082331 542456329 539890945 537452579 535053074 532555938 529953122 527340174
3083.8 527340174 524735928 522098780 519436359 516744733 514005363 511275768 508585930 505839348
3100.1 505839348 502978802 500075042 497209787 494373620 491465598 488477111 485491306 482499003
3116.4 482499003 479436815 476243198 472892374 469501376 466205686 462976575 459698170 456314951
3132.8 456314951 452906042 449561149 446231276 442775875 439165324 435536951 431995422 428550571
3149.1 428550571 425130069 421613514 417969912 414298207 410669208 407054931 403440952 399835616
3165.4 399835616 396218717 392598391 389009774 385441482 381888837 378360927 374857724 371368647
3181.7 371368647 367876202 364401460 360982776 357615322 354249090 350865752 347508818 344212264
3198 344212264 340960175 337749690 334575236 331430197 328330874 325286418 322301179 319356978 316454619
3216.4 316454619 313612610 310783029 307924360 305097014 302354246 299705297 297173530 294704437
3232.7 294704437 292177111 289611518 287123293 284740925 282452434 280230224 278007537 275768429
3249 275768429 273573667 271459192 269411147 267384619 265336752 263297796 261306196 259339303 257404655
3267.4 257404655 255560160 253747553 251873016 249968544 248076722 246222407 244422734 242633045
3283.7 242633045 240853161 239123523 237433478 235749751 234024853 232234657 230427429 228691861
3300 228691861 227055788 225476980 223870933 222146824 220320433 218495965 216746375 215057462 213388368
3318.4 213388368 211739436 210137412 208570883 206955835 205285430 203687996 202218309 200819269
3334.7 200819269 199446052 198031098 196506843 194944009 193432391 192034706 190815955 189604104
3351 189604104 188204616 186762854 185487613 184353754 183249623 182193220 181262374 180397108 179455459
3369.3 179455459 178365454 177276537 176410928 175707921 175030932 174355000 173725784 173267081 173093066
3387.7 173093066 173132017 173078805 172756955 172419474 172409341 172645092 172725946 172555730 172499493 172703162
3408.1 172703162 172977448 173249081 173534319 173838824 174228325 174729422 175314531 176017046 176864386 177843899
3428.5 177843899 178851485 179913983 181096345 182158530 182964623 183800712 184931949 186307549 187769771
3446.8 187769771 189210132 190671355 192231327 193932384 195791245 197736427 199611127 201472327
3463.2 201472327 203605145 205981851 208184198 209970862 211699262 213739395 216097876 218550682
3479.5 218550682 220827207 223059908 225519940 228054762 230536416 233138278 235891879 238723084
3495.8 238723084 241532609 244314790 247140214 249929711 252658904 255528718 258664936 262010962
3512.1 262010962 265376091 268596023 271804839 275203407 278861701 282515794 285963982 289501607
3528.4 289501607 293336838 297316760 301389605 305534840 309629768 313820034 318232566 322757125
3544.7 322757125 327184498 331537426 336027771 340702444 345465124 350316226 355343223 360444278
3561.1 360444278 365420073 370451629 376129538 382211030 388019919 393702805 399584115 405654371
3577.4 405654371 411944062 418430060 424815416 431129396 437803328 444821954 451683760 458526164
3593.7 458526164 465672106 473040611 480479807 487904966 495141506 502184927 509535015 517248571
3610 517248571 524978280 532672942 540158808 547820508 556102872 564081311 571159720 577799320 585256040
3628.4 585256040 593681693 601456165 608722091 615925550 622930944 629705131 636138678 642022610
3644.7 642022610 647622287 653946340 660929739 667083621 672504783 678207099 683883190 688879490
3661 688879490 693331480 697383165 700995684 704620779 708537579 711974800 715289116 719194710 722968280
3679.4 722968280 726291120 729253173 731788397 734144270 736715734 739449322 742060304 744392514
3695.7 744392514 746371329 748079598 749811172 751638770 753238440 754421353 755417466 756787717
3712 756787717 758654416 760395944 761681855 762630641 763477504 764406145 765507936 766652822 767418563
3730.3 767418563 767766893 768246830 769384861 770861864 771794319 771871924 771949112 772780836 773446739 773896217
3750.7 773896217 775046766 776450396 777356207 777975559 778794885 779609799 780126274 780484140 780924678
3769.1 780924678 781657815 782533586 783158302 783499599 783849299 784331977 784748673 785116911 785631716 786242306
3789.5 786242306 786709070 786827564 786746204 786758900 786738276 786857903 787439167 787966847 788502812 789265156
3809.9 789265156 789704084 789537132 789272368 789348483 789393783 789745748 790555656 791163564 791458547 791512012
3830.3 791512012 791504681 791608989 791575611 791430414 791662037 792257428 792902946 793346703 793313205 792564631
3850.7 792564631 791509151 791757762 793032885 793839812 793951154 793746293 793700278 793719471 793565929 793696225
3871.1 793696225 794186115 794664025 794903040 794782043 794736862 794870973 794965088 795223832 795376480 795316577
3891.5 795316577 795483172 795704186 795538843 795093417 794786990 794897795 795463502 796080470 796351850 796358883
3911.9 796358883 796277881 796144009 796120405 796272337 796363235 796366751 796464562 796547949 796496570 796533227 796789348
3934.3 796789348 797038555 797087371 796990573 796906650 796933293 797023833 797121525 797257245 797449291 797654808 797818244
3956.7 797818244 797932029 797996521 798045278 798120022 798211217 798324347 798444569 798531890 798603952 798721433 798912525
3979.2 798912525 799125493 799287021 799398899 799488783 799568772 799655437 799785674 799979687 800173879
3997.5 800173879
##END=$$ End of the data block
