##TITLE=$$ Begin of the data block
##JCAMP-DX=5.00 $$ ACD/SpecManager v 10.08
##SPECTROMETER/DATA SYSTEM=Alpha
##DATE=14 Apr 2014 11:23:48
##DATA TYPE=INFRARED SPECTRUM
##DATA CLASS=XYDATA
##ORIGIN=
##OWNER=
##NPOINTS=1765
##FIRSTX=399.75695801
##LASTX=3997.56933594
##MAXX=3997.56933594
##MINX=399.75695801
##MAXY=0.82897943
##MINY=0.20369412
##XFACTOR=1.0000000000
##YFACTOR=1.000000000000000e-9
##FIRSTY=0.54546374
##DELTAX=2.03957629
##XUNITS=1/CM
##YUNITS=ARBITRARY UNITS
##XYDATA=(X++(Y..Y))
$$ plain form
399.8 545463741 544354260 543839693 542257726 540455401 540061891 539606750 537607133 535701931 535200238
418.1 535200238 534950495 534465194 534670889 534712017 533487380 532536864 532793760 532227576 530485332 529944599
438.5 529944599 530442536 530124545 529740334 530280709 530236781 529166937 528685451 528470516 526917160 525259435
458.9 525259435 525142133 524889588 523390949 522245288 521989048 520836771 518793583 517854214 517416477
477.3 517416477 515969634 514778793 514984369 514698386 513028622 512026191 511894107 510730863 509092510
495.6 509092510 508516490 507750273 505722165 504337251 504150450 503139377 501415670 500684559 500003994
514 500003994 497927248 496037334 495361060 493973494 491486132 489862859 489082366 487406552 485399425
532.3 485399425 484560728 483870238 482202113 481042087 481060863 480531335 479166180 478463441 478047550
$$ packed form
399.8E45463741j109481n14567j581967j802325l93510m55141j999617j905202n01693
418.1E35200238k49743m85301K05695M1128j224637r50516K56896n66184j742244n40733
438.5E29944599M97937l17991l84211N40375m3928j069844m81486k14935j553356j657725
458.9E25259435j17302k52545j498639j145661k56240j152277k043188r39369m37737
477.3E17416477j446843j190841K05576k85983j669764j002431j32084j163244j638353
495.6E09092510n76020p66217k028108j384914j86801j011073j723707p31111o80565
514E00003994k076746j889914o76274j387566k487362j623273p80493j675814k007127
532.3D85399425q38697o90490j668125j160026J8776n29528j365155p02739m15891
$$ plain form
550.7 478047550 476601243 474948764 474116653 472974330 470775396 468695879 467053503 464602828 461476833
569 461476833 458930790 456576586 453630358 450893551 448850244 446591556 444012582 441942632 440238506
587.4 440238506 438121736 435889602 434339821 433022410 431087643 428834230 426674098 424164087
603.7 424164087 421693832 420517683 420405507 419952452 419307649 419921041 422150254 425268352 429127514
622.1 429127514 433680803 437979579 441742450 445778728 450088739 453690082 456641525 459633291
638.4 459633291 461899638 462542444 463191777 465861320 469385773 471509069 471930385 471542805 472335458
656.7 472335458 476693183 483819783 490103424 493723035 497335792 503199458 506895602 508977950
673.1 508977950 511995435 515626311 518584311 521115303 524032772 526651621 528398275 530232668
$$ packed form
550.7D78047550j446307j652479q32111j142323k198934k079517j642376k450675l125995
569D61476833k546043k354204k946228k736807k043307k258688k578974k069950j704126
587.4D40238506k116770k232134j549781j317411j934767k253413k160132k510011
603.7D24164087k470255j176149j12176m53055o44803O13392K229213L118098L859162
622.1D29127514M553289M298776L762871M036278M310011L601343K951443K991766
638.4D59633291K266347O42806O49333K669543L524453K123296M21316l87580P92653
656.7D72335458M357725P126600O283641L619611L612757N863666L696144K082348
673.1E08977950L017485L630876K958000K530992K917469K618849J746654J834393
$$ plain form
689.4 530232668 532501221 534058452 534759581 535773814 537155509 538020253 538906693 540854514 543209076
707.7 543209076 545167923 547474265 550521374 553281188 555583656 558453023 561724782 564426959
724 564426959 566932321 569904327 572722137 574759603 576696873 578994572 580905139 582324088 584104598
742.4 584104598 586287498 588115573 589730740 591769099 593796492 595278859 596868157 598988771
758.7 598988771 600950599 602505147 604229093 606136978 607540250 608453631 609378040 609936953 609535098
777.1 609535098 608629227 607786596 606657147 605202258 604335606 604638755 605926275 608390749 612608016
795.4 612608016 618272781 624472380 630954742 637644291 643762052 648699224 652790904 656415939
811.7 656415939 659158051 660749018 661542237 661438406 659832120 656880319 653230488 648766220 643282950
$$ packed form
689.4E30232668K268553J557231P01129J014233J381695Q64744Q86440J947821K354562
707.7E43209076J958847K306342L047109K759814K302468K869367L271759K702177
724E64426959K505362K972006K817810K037466J937270K297699J910567J418949J780510
742.4E84104598K182900J828075J615167K038359K027393J482367J589298K120614
758.7E98988771J961828J554548J723946J907885J403272R13381R24409N58913m01855
777.1F09535098r05871q42631j129449j454889q66652L03149J287520K464474M217267
795.4F12608016N664765O199599O482362O689549O117761M937172M091680L625035
811.7F56415939K742112J590967P93219j03831j606286k951801l649831m464268n483270
$$ plain form
830.1 643282950 637487531 632066429 626767576 621467471 616738439 612698853 608978450 606020808
846.4 606020808 604929686 606107712 609401524 615108073 623345375 633118153 643344998 653874338
862.7 653874338 664507270 674302042 682707071 690019667 696206868 700743675 703851700 706182241
879.1 706182241 707372844 706866264 705259502 703259706 700684130 697599709 695030272 693596363 692958593
897.4 692958593 693122864 694497824 696494162 698019803 699046254 699798286 699399710 697167754 693804204
915.8 693804204 689876318 685144246 680184245 676365376 673996866 672530770 672133744 673028409 674214303
934.1 674214303 674854100 675493300 676390946 676750779 676400304 675930917 674935579 672344267 668288648
952.5 668288648 663360536 656968653 648493111 638522804 627361417 614276052 599180341 582989573
$$ packed form
830.1F43282950n795419n421102n298853n300105m729032m039586l720403k957642
846.4F06020808j091122J178026L293812N706549Q237302R772778J0226845J0529340
862.7F53874338J0632932R794772Q405029P312596O187201M536807L108025K330541
879.1G06182241J190603n06580j606762j999796k575576l084421k569437j433909o37770
897.4F92958593J64271J374960J996338J525641J026451P52032l98576k231956l363550
915.8F93804204l927886m732072m960001l818869k368510j466096l97026Q94665J185894
934.1F74214303O39797O39200Q97646L59833l50475m69387r95338k591312m055619
952.5F68288648m928112o391883q475542r970307j1161387j3085365j5095711j6190768
$$ plain form
968.8 582989573 566259444 549359083 533498943 519774914 507911026 497334480 488161772 480265379
985.1 480265379 473004401 466344118 460852474 456443906 452546179 449251026 446869045 444932729
1001.4 444932729 442757487 440218538 437114716 432815164 427257627 421187043 415044039 408792555
1017.7 408792555 402769804 397445083 392579854 387748331 383147985 379013866 375086069 371212989
1034.1 371212989 367714435 364721596 361916006 359202445 356773227 354472846 352003723 349610776
1050.4 349610776 347880781 347130299 347471148 349085927 351716012 354384571 356142670 356563538 355422527
1068.7 355422527 352728575 349159449 345587969 342261076 339092374 336208493 333509505 330475986
1085 330475986 326845646 322927505 319186985 316074163 314161748 313789576 314672440 316214323 318063110
$$ packed form
968.8E82989573j6730129j6900361j5860140j3724029j1863888j0576546r172708p896393
985.1D80265379p260978o660283n491644m408568l897727l295153k381981j936316
1001.4D44932729k175242k538949l103822m299552n557537o070584o143004o251484
1017.7D08792555o022751n324721m865229m831523m600346m134119l927797l873080
1034.1C71212989l498554k992839k805590k713561k429218k300381k469123k392947
1050.4C49610776j729995p50482L40849J614779K630085K668559J758099M20868j141011
1068.7C55422527k693952l569126l571480l326893l168702k883881k698988l033519
1085C30475986l630340l918141l740520l112822j912415l72172Q82864J541883J848787
$$ plain form
1103.4 318063110 320014805 321703434 322825551 323353171 323106855 321540207 318219841 313261271 307727396
1121.8 307727396 303677946 302539527 303589880 305130154 305974871 306059301 306468219 308095574 310808331
1140.1 310808331 314001977 317042500 319463164 321343482 323135227 325071722 327230394 329905391
1156.4 329905391 333428472 337911576 343481630 350394011 358632028 367746830 377311826 387076259
1172.7 387076259 396687984 405756742 414199919 422032267 428892732 434292316 438015550 439955294
1189.1 439955294 440078139 438809305 437031746 435583085 434997976 435644269 437576532 440263808 442945391
1207.4 442945391 445178270 446806639 447719514 448032409 448161572 448369950 448617131 448971301 449726582
1225.8 449726582 450969040 452531278 454450995 456842691 459519058 462265581 465108603 467998415
$$ packed form
1103.4C18063110J951695J688629J122117N27620k46316j566648l320366m958570n533875
1121.8C07727396m049450j138419J050353J540274Q44717Q4430M08918J627355K712757
1140.1C10808331L193646L040523K420664J880318J791745J936495K158672K674997
1156.4C29905391L523081M483104N570054O912381Q238017R114802R564996R764433
1172.7C87076259R611725R068758Q443177P832348O860465N399584L723234J939744
1189.1D39955294J22845j268834j777559j448661n85109O46293J932263K687276K681583
1207.4D42945391K232879J628369R12875L12895J29163K08378K47181L54170P55281
1225.8D49726582J242458J562238J919717K391696K676367K746523K843022K889812
$$ plain form
1242.1 467998415 470628202 472794116 474538475 475862175 476717770 477299362 477979600 478957981 480343342
1260.4 480343342 482390761 485245198 488759398 492840439 497616589 503009439 508689046 514578521
1276.8 514578521 520803094 527276814 533833206 540577412 547662437 554852843 561788261 568428516
1293.1 568428516 574737489 580448627 585499465 590120554 594337523 597981513 601145446 603999674
1309.4 603999674 606432676 608377576 610052168 611675441 613236368 614687502 616183877 617767394
1325.7 617767394 619150460 620156050 620865464 621177852 620982051 620694101 620808780 621110916 621273935
1344.1 621273935 621501923 621908844 622192860 622152388 621946573 621529043 620544493 619066536 617567182
1362.4 617567182 616009176 614069819 612088919 610394418 608752251 607113302 605461836 603045821
$$ packed form
1242.1D67998415K629787K165914J744359J323700Q55595N81592O80238R78381J385361
1260.4D80343342K047419K854437L514200M081041M776150N392850N679607N889475
1276.8E14578521O224573O473720O556392O744206P085025P190406O935418O640255
1293.1E68428516O308973N711138N050838M621089M216969L643990L163933K854228
1309.4F03999674K433002J944900J674592J623273J560927J451134J496375J583517
1325.7F17767394J383066J005590P09414L12388j95801k87950J14679L02136J63019
1344.1F21273935K27988M06921K84016m0472k05815m17530r84550j477957j499354
1362.4F17567182j558006j939357j980900j694501j642167j638949j651466k416015
$$ plain form
1378.7 603045821 598870099 593714595 590505898 590678275 591973603 592057586 591198504 590010405 588393033
1397.1 588393033 586363852 583958030 580956936 577693164 574738622 571999729 569295526 566778004
1413.4 566778004 564506710 562591672 561451793 560809195 560255766 559719205 559091210 558749855 558668137
1431.8 558668137 558330238 558570325 560158908 561743200 563008726 564469039 566424489 569131792 572325647
1450.1 572325647 575572550 579090118 585119963 594617546 602957487 609743059 617441058 626001358
1466.4 626001358 633653462 641268611 651099086 661670148 670329332 676882327 681823313 685635269
1482.8 685635269 687890112 688437819 688197494 687704563 686038494 682848334 679070890 675366819 671026945
1501.1 671026945 665583134 658959091 651843548 645892620 640332758 634516299 628805101 623726428
$$ packed form
1378.7F03045821m175722n155504l208697J72377J295328Q3983q59082j188099j617372
1397.1E88393033k029181k405822l001094l263772k954542k738893k704203k517522
1413.4E66778004k271294j915038j139879o42598n53429n36561o27995l41355q1718
1431.8E58668137l37899K40087J588583J584292J265526J460313J955450K707303L193855
1450.1E72325647L246903L517568O029845R497583Q339941O785572P697999Q560300
1466.4F26001358P652104P615149R830475J0571062Q659184O552995M940986L811956
1482.8F85635269K254843N47707k40325m92931j666069l190160l777444l704071m339874
1501.1F71026945n443811o624043p115543n950928n559862n816459n711198n078673
$$ plain form
1517.4 623726428 619672298 616486132 613603890 610689044 607989907 605330348 602418363 599773228
1533.7 599773228 597365975 594650805 592518985 592002988 592149734 592218101 592104018 592345953 593057215
1552.1 593057215 593522966 593396723 594537437 597662568 598695815 598007500 596802294 594945014 592491269
1570.5 592491269 589307547 585162997 580198467 574986637 569418073 563075066 556018651 548494458
1586.8 548494458 540731072 532605112 524193406 515806019 507572114 499214232 490694910 482377619
1603.1 482377619 474291056 466109365 457820892 449749023 441827953 433596998 425314456 418324083
1619.4 418324083 411851525 405173987 399111003 393783689 388938338 384684622 381165653 378947318
1635.7 378947318 378267884 378342569 379006714 380193233 382748395 386628479 389620572 393662930 401324332
$$ packed form
1517.4F23726428m054130l186166k882242k914846k699137k659559k911985k645135
1533.7E99773228k407253k715170k131820n15997J46746O8367j14083K41935P11262
1552.1E93057215M65751j26243J140714L125131J033247o88315j205206j857280k453745
1570.5E92491269l183722m144550m964530n211830n568564o343007p056415p524193
1586.8E48494458p763386q125960q411706q387387q233905q357882q519322q317291
1603.1D82377619q086563q181691q288473q071869p921070q230955q282542o990373
1619.4D18324083o472558o677538o062984n327314m845351m253716l518969k218335
1635.7C78947318o79434P4685O64145J186519K555162L880084K992093M042358P661402
$$ plain form
1654.1 401324332 407615900 412286580 417596698 424372226 431885242 438426703 445540726 454418123
1670.4 454418123 462797582 471525848 481392145 490188748 497898221 506816685 519558966 531592369
1686.7 531592369 541054547 550398767 558854461 568288505 579329312 591049850 605627835 618156016
1703 618156016 628283024 638709784 647853851 655389965 661676943 667600632 675054312 682638109
1719.3 682638109 688109219 692806005 697646141 701976359 705640793 709004343 713874817 719555676
1735.7 719555676 723585248 727697968 732531786 736959636 741028011 745187104 749884725 754818201
1752 754818201 758883774 762440920 765804708 768647373 771688342 774629593 776653349 778159559 779798985
1770.3 779798985 782141328 784719646 786708474 788432240 790116608 791645765 793269813 794994593
$$ packed form
1654.1D01324332O291568M670680N310118O775528P513016O541461P114023Q877397
1670.4D54418123Q379459Q728266R866297Q796603P709473Q918464J2742281J2033403
1686.7E31592369R462178R344220Q455694R434044J1040807J1720538J4577985J2528181
1703F18156016J0127008J0426760R144067P536114O286978N923689P453680P583797
1719.3F82638109N471110M696786M840136M330218L664434L363550M870474N680859
1735.7G19555676M029572M112720M833818M427850M068375M159093M697621M933476
1752G54818201M065573L557146L363788K842665L040969K941251K023756J506210J639426
1770.3G79798985K342343K578318J988828J723766J684368J529157J624048J724780
$$ plain form
1786.7 794994593 796106696 796812415 798325896 800199747 801385462 802266300 803551733 805010855 806094766
1805 806094766 806965590 807898939 808823466 809654236 810536087 811478376 812238336 812716007 813189745 813775837
1825.4 813775837 814172804 814745486 815917909 816887677 817318857 817828178 818393052 818460643 818534076 819434166
1845.8 819434166 820482314 821066499 821476221 822003722 822428107 822617710 822961330 823479056 823656619
1864.2 823656619 823446453 823610187 824370503 824947178 825248361 825656712 826009870 826110005 826259375 826567531
1884.6 826567531 826640546 826559961 826865971 827296078 827422380 827526152 827815592 828047395 828056514 828070283
1904.9 828070283 828220487 828323841 828391910 828545868 828565836 828368187 828319013 828506768 828720272 828831017
1925.3 828831017 828889966 828979433 828937411 828751683 828672886 828686535 828490496 828183234 828154385 828250527 828151822
$$ packed form
1786.7G94994593J112103P05719J513481J873851J185715Q80838J285433J459122J083911
1805H06094766Q70824R33349R24527Q30770Q81851R42289P59960M77671M73738N86092
1825.4H13775837L96967N72682J172423R69768M31180N09321N64874O7591P3433R00090
1845.8H19434166J048148N84185M09722N27501M24385J89603L43620N17726J77563
1864.2H23656619k10166J63734P60316N76675L01183M08351L53158J00135J49370L08156
1884.6H26567531P3015q0585L06010M30107J26302J03772K89440K31803R119J3769
1904.9H28070283J50204J03354O8069J53958J9968j97649m9174J87755K13504J10745
1925.3H28831017N8949Q9467m2022j85728p8797J3649j96039l07262k8849R6142r8705
$$ plain form
1947.8 828151822 827977240 827897310 827781439 827551901 827371478 827279747 827078402 826733947 826496899 826455295
1968.2 826455295 826360106 826170325 826069295 825952172 825696886 825470805 825401247 825314999 825062454 824774146
1988.6 824774146 824577332 824427187 824265838 824140072 824026048 823792577 823479652 823254049 823045790 822721362
2009 822721362 822411776 822222531 821975887 821617782 821361661 821189582 820890546 820504248 820257246 820120335
2029.4 820120335 819876373 819554090 819309533 819054902 818688214 818417013 818328619 818156600 817834198 817634463
2049.8 817634463 817550421 817321539 817012787 816860855 816777289 816565573 816352427 816303492 816251040 816065848
2070.2 816065848 815954506 815956295 815833569 815605640 815519452 815504193 815334320 815163672 815160513 815123439 814947724
2092.6 814947724 814864874 814904749 814826071 814680696 814702988 814784586 814717948 814649701 814720452 814737141 814606786
$$ packed form
1947.8H28151822j74582p9930j15871k29538j80423r1731k01345l44455k37048m1604
1968.2H26455295r5189j89781j01030j17123k55286k26081o9558q6248k52545k88308
1988.6H24774146j96814j50145j61349j25766j14024k33471l12925k25603k08259l24428
2009H22721362l09586j89245k46644l58105k56121j72079k99036l86298k47002j36911
2029.4H20120335k43962l22283k44557k54631l66688k71201q8394j72019l22402j99735
2049.8H17634463q4042k28882l08752j51932q3566k11716k13146m8935n2452j85192
2070.2H16065848j11342J789j22726k27929q6188j5259j69873j70648l159l7074j75715
2092.6H14947724q2850L9875p8678j45375K2292Q1598o6638o8247P0751J6689j30355
$$ plain form
2115 814606786 814554632 814664900 814737260 814718246 814804852 814963341 814986169 814991415 815152764 815318465 815330744
2137.5 815330744 815345407 815496325 815626442 815665722 815802932 816045046 816171050 816215158 816385865 816606104
2157.9 816606104 816711545 816816926 817044020 817234218 817286372 817420959 817707241 817905188 818002582 818191648
2178.2 818191648 818410993 818510056 818603992 818793118 818926990 818952203 819059014 819288015 819405973 819374025
2198.6 819374025 819440782 819610000 819662690 819666624 819790006 819917262 819929481 819945812 820024252 820047438 820004344
2221.1 820004344 820022583 820114970 820146859 820116758 820150077 820185065 820113897 820053875 820088983 820067942 819957972
2243.5 819957972 819907665 819909155 819836080 819720566 819698155 819709778 819617033 819530368 819577217 819618642 819564223
2265.9 819564223 819550991 819612741 819615543 819580734 819650114 819775701 819818199 819832861 819940388 820054650 820060134
$$ packed form
2115H14606786n2154J10268P2360j9014Q6606J58489K2828N246J61349J65701J2279
2137.5H15330744J4663J50918J30117L9280J37210K42114J26004M4108J70707K20239
2157.9H16606104J05441J05381K27094J90198N2154J34587K86282J97947R7394J89066
2178.2H18191648K19345R9063R3936J89126J33872K5213J06811K29001J17958l1948
2198.6H19374025O6757J69218N2690L934J23382J27256J2219J6331P8440K3186m3094
2221.1H20004344J8239R2387L1889l0101L3319L4988p1168o0022L5108k1041j09970
2243.5H19957972n0307J490p3075j15514k2411J1623r2745q6665M6849M1425n4419
2265.9H19564223j3232O1750K802l4809O9380J25587M2498J4662J07527J14262N484
$$ plain form
2288.4 820060134 820046604 820119441 820208669 820245087 820296943 820362508 820366800 820369005 820456922 820537686 820540726 820593894
2312.9 820593894 820720851 820791721 820834517 821030557 821334898 821493089 821558714 821802497 822123647 822243154
2333.3 822243154 822252929 822337985 822454453 822620749 823062181 823544681 823409319 822837770 822515428 822705507
2353.6 822705507 823144674 823647976 824096084 824319482 824413836 824677289 825040638 825258732 825385511 825572014
2374 825572014 825760901 825831711 825852752 825947523 826064765 826123714 826181054 826266944 826339543 826391995 826464713
2396.5 826464713 826538205 826539457 826524019 826559186 826569855 826523542 826476514 826427877 826361716 826307118 826259613 826165259
2421 826165259 826011419 825859547 825763404 825689793 825593829 825501621 825421393 825317204 825185061 825082958 825008929
2443.4 825008929 824880958 824722826 824597836 824477732 824319780 824142754 823988140 823849559 823691130 823510647
$$ packed form
2288.4H20060134j3530P2837Q9228L6418N1856O5565M292K205Q7917Q0764L040N3168
2312.9H20593894J26957P0870M2796J96040L04341J58191O5625K43783L21150J19507
2333.3H22243154R775Q5056J16468J66296M41432M82500j35362n71549l22342J90079
2353.6H22705507M39167N03302M48108K23398R4354K63453L63349K18094J26779J86503
2374H25572014J88887P0810K1041R4771J17242N8949N7340Q5890P2599N2452P2718
2396.5H26464713P3492J252j5438L5167J0669m6313m7028m8637o6161n4598m7505r4354
2421H26165259j53840j51872r6143p3611r5964r2208q0228j04189j32143j02103p4029
2443.4H25008929j27971j58132j24990j20104j57952j77026j54614j38581j58429j80483
$$ plain form
2463.8 823510647 823347330 823214948 823056757 822846055 822644234 822462320 822263300 822073579 821887732 821668446
2484.2 821668446 821449101 821271360 821112633 820931554 820756376 820612788 820438206 820230901 820063055 819906414
2504.6 819906414 819683492 819447160 819309711 819209754 819031239 818825841 818662107 818493724 818284750 818077564
2525 818077564 817900002 817704380 817470193 817263007 817080200 816857219 816616714 816404939 816219032 816029787
2545.4 816029787 815845609 815681100 815476835 815230548 815025628 814831853 814576566 814315617 814082563 813832700
2565.8 813832700 813562393 813280642 812981367 812642217 812277198 811942816 811595738 811161637 810717642 810353339
2586.2 810353339 809978485 809517741 809064448 808651209 808199227 807698905 807194173 806682348 806142390 805583835
2606.6 805583835 805037320 804486632 803895175 803312838 802760780 802167177 801541686 800958157 800377965 799737692
$$ packed form
2463.8H23510647j63317j32382j58191k10702k01821j81914j99020j89721j85847k19286
2484.2H21668446k19345j77741j58727j81079j75178j43588j74582k07305j67846j56641
2504.6H19906414k22922k36332j37449r9957j78515k05398j63734j68383k08974k07186
2525H18077564j77562j95622k34187k07186j82807k22981k40505k11775j85907j89245
2545.4H16029787j84178j64509k04265k46287k04920j93775k55287k60949k33054k49863
2565.8H13832700k70307k81751k99275l39150l65019l34382l47078m34101m43995l64303
2586.2H10353339l74854m60744m53293m13239m51982n00322n04732n11825n39958n58555
2606.6H05583835n46515n50688n91457n82337n52058n93603o25491n83529n80192o40273
$$ plain form
2626.9 799737692 799074590 798446536 797862232 797288001 796705484 796143651 795598567 795049012 794511795 793960392
2647.3 793960392 793360233 792759359 792226613 791732371 791177809 790584683 790037513 789515913 788976312 788424313
2667.7 788424313 787890613 787369490 786809802 786239445 785698831 785145283 784584701 784038842 783441544 782795370
2688.1 782795370 782211065 781674147 781076252 780432880 779819369 779207408 778525889 777789533 777082562 776427805
2708.5 776427805 775783658 775145650 774483144 773755670 773012221 772314489 771651030 770987451 770327449 769654512
2728.9 769654512 768940866 768213034 767529368 766892314 766238809 765576839 764944732 764280915 763580382 762913048
2749.3 762913048 762258828 761572361 760859907 760143399 759403467 758627772 757844150 757033408 756177425 755316019
2769.7 755316019 754483998 753658473 752764046 751798689 750848770 749912560 748937607 747946441 746971905 745965838
$$ packed form
2626.9G99737692o63102o28054n84304n74231n82517n61833n45084n49555n37217n51403
2647.3G93960392o00159o00874n32746m94242n54562n93126n47170n21600n39601n51999
2667.7G88424313n33700n21123n59688n70357n40614n53548n60582n45859n97298o46174
2688.1G82795370n84305n36918n97895o43372o13511o11961o81519p36356p06971o54757
2708.5G76427805o44147o38008o62506p27474p43449o97732o63459o63579o60002o72937
2728.9G69654512p13646p27832o83666o37054o53505o61970o32107o63817p00533o67334
2749.3G62913048o54220o86467p12454p16508p39932p75695p83622q10742q55983q61406
2769.7G55316019q32021q25525q94427r65357r49919r36210r74953r91166r74536j006067
$$ plain form
2790.1 745965838 744872391 743731499 742560685 741337419 740085363 738810837 737490118 736138701
2806.4 736138701 734794319 733429015 731992304 730502188 728985965 727438807 725851059 724212945
2822.7 724212945 722535193 720799983 718923867 716894805 714759886 712444067 709809959 706770837
2839.1 706770837 703214765 698993027 694099426 688926160 684248030 680693030 678316474 676759839
2855.4 676759839 675587356 674412012 672937870 671005726 668578565 665757000 662778258 659914255
2871.7 659914255 657331347 655081868 653181016 651520967 649888694 648178935 646378577 644468606
2888 644468606 642457843 640368462 638184786 635879815 633504391 631121933 628658652 625978649 623059094
2906.4 623059094 619924545 616434336 612430453 608100176 603927493 600296676 597316563 594992220
$$ packed form
2790.1G45965838j093447j140892j170814j223266j252056j274526j320719j351417
2806.4G36138701j344382j365304j436711j490116j516223j547158j587748j638114
2822.7G24212945j677752j735210j876116k029062k134919k315819k634108l039122
2839.1G06770837l556072m221738m893601n173266m678130l555000k376556j556635
2855.4F76759839j172483j175344j474142j932144k427161k821565k978742k864003
2871.7F59914255k582908k249479j900852j660049j632273j709759j800358j909971
2888F44468606k010763k089381k183676k304971k375424k382458k463281k680003k919555
2906.4F23059094l134549l490209m003883m330277m172683l630817k980113k324343
$$ plain form
2922.7 594992220 593327463 592296839 591808319 591728210 592077792 593028188 594635665 596804559 599384129
2941 599384129 602142751 604766965 606941581 608500063 609529316 610178113 610574722 610962033 611559391
2959.4 611559391 612357736 613221586 614127398 615106761 616072714 616972148 617868423 618807733 619826853
2977.8 619826853 620926201 622030437 623134613 624230564 625223339 626126885 626896441 627329051 627431750
2996.1 627431750 627294242 626890540 626271427 625515878 624661446 623762429 622835040 621787906 620522380
3014.5 620522380 619050980 617438853 615727484 613934100 612030387 610034943 608064115 606157959
3030.8 606157959 604260027 602263391 600124657 597978652 595860898 593647182 591330886 588993132
3047.1 588993132 586658657 584293604 581876993 579443574 577020407 574623406 572284818 570046842
$$ packed form
2922.7E94992220j664757j030624m88520q0109L49582R50396J607477K168894K579570
2941E99384129K758622K624214K174616J558482J029253O48797L96609L87311N97358
2959.4F11559391P98345Q63850R05812R79363R65953Q99434Q96275R39310J019120
2977.8F19826853J099348J104236J104176J095951R92775R03546P69556M32610J02699
2996.1F27431750j37508m03702o19113p55549q54432q99017r27389j047134j265526
3014.5F20522380j471400j612127j711369j793384j903713j995444j970828j906156
3030.8F06157959j897932j996636k138734k146005k117754k213716k316296k337754
3047.1E88993132k334475k365053k416611k433419k423167k397001k338588k237976
$$ plain form
3063.4 570046842 567895949 565731227 563485742 561196744 558959007 556825340 554734230 552567184
3079.7 552567184 550292134 547976315 545668900 543386936 541107297 538755596 536338627 533936143
3096 533936143 531577110 529201031 526727140 524199724 521702766 519195080 516572535 513899684 511326671
3114.4 511326671 508779764 506103635 503219306 500147402 497068346 494125068 491233170 488258004
3130.7 488258004 485216647 482183695 479202002 476215154 473088682 469853133 466618717 463405579
3147 463405579 460264266 457165778 453922004 450507998 447103471 443753719 440394074 437059373 433780462
3165.4 433780462 430483639 427128404 423779249 420459956 417130530 413816482 410541087 407250106
3181.7 407250106 403951138 400706708 397505343 394305736 391099066 387882411 384700030 381581843
$$ packed form
3063.4E70046842k150893k164722k245485k288998k237737k133667k091110k167046
3079.7E52567184k275050k315819k307415k281964k279639k351701k416969k402484
3096E33936143k359033k376079k473891k527416k496958k507686k622545k672851k573013
3114.4E11326671k546907k676129k884329l071904l079056k943278k891898k975166
3130.7D88258004l041357l032952k981693k986848l126472l235549l234416l213138
3147D63405579l141313l098488l243774l414006l404527l349752l359645l334701l278911
3165.4D33780462l296823l355235l349155l319293l329426l314048l275395l290981
3181.7D07250106l298968l244430l201365l199607l206670l216655l182381l118187
$$ plain form
3198 381581843 378468156 375371277 372347862 369365394 366411060 363505423 360615909 357737601 354891807
3216.4 354891807 352084726 349345952 346653432 343967229 341312766 338722736 336190552 333684087
3232.7 333684087 331161588 328649372 326217115 323850691 321530521 319290072 317083389 314836115
3249 314836115 312623888 310538769 308530301 306488544 304408729 302381903 300431192 298501074 296575844
3267.4 296575844 294687092 292787164 290828764 288877636 286990881 285160422 283356994 281553447
3283.7 281553447 279760271 277986974 276239425 274530411 272809237 271039426 269241810 267441660
3300 267441660 265702426 264078885 262469560 260728568 258870929 257003337 255210429 253502369 251822084
3318.4 251822084 250133485 248458713 246793151 245083258 243351758 241666332 240016863 238416359
$$ packed form
3198C81581843l113687l096879l023415k982468k954334k905637k889514k878308k845794
3216.4C54891807k807081k738774k692520k686203k654463k590030k532184k506465
3232.7C33684087k522499k512216k432257k366424k320170k240449k206683k247274
3249C14836115k212227k085119k008468k041757k079815k026826j950711j930118j925230
3267.4B96575844j888752j899928j958400j951128j886755j830459j803428j803547
3283.7B81553447j793176j773297j747549j709014j721174j769811j797616j800150
3300B67441660j739234j623541j609325j740992j857639j867592j792908j708060j680285
3318.4B51822084j688599j674772j665562j709893j731500j685426j649469j600504
$$ plain form
3334.7 238416359 236907870 235389322 233757988 232085213 230439141 228877559 227439463 225972086
3351 225972086 224363327 222764269 221336290 220023975 218682632 217322886 216111913 215040520 213882953
3369.3 213882953 212532118 211166322 210041225 209141925 208321676 207537889 206808731 206177071 205737457
3387.7 205737457 205528691 205314100 204835936 204326525 204183176 204294935 204214573 203878716 203694120 203792214
3408.1 203792214 203975052 204158574 204343438 204531878 204796046 205208197 205725208 206336886 207115069 208056018
3428.5 208056018 208995014 209976733 211150661 212262303 213095888 213920891 215006843 216351494 217888474
3446.8 217888474 219442382 220949143 222535297 224268153 226154953 228150845 230090961 232002065
3463.2 232002065 234188795 236619711 238821536 240641415 242514506 244695440 247094601 249527067
$$ packed form
3334.7B38416359j508489j518548j631334j672775j646072j561582j438096j467377
3351B25972086j608759j599058j427979j312315j341343j359746j210973j071393j157567
3369.3B13882953j350835j365796j125097q99300q20249p83787p29158o31660m39614
3387.7B05737457k08766k14591m78164n09411j43349J11759q0362l35857j84596R8094
3408.1B03792214J82838J83522J84864J88440K64168M12151N17011O11678P78183R40949
3428.5B08056018R38996R81719J173928J111642Q33585Q25003J085952J344651J536980
3446.8B17888474J553908J506761J586154J732856J886800J995892J940116J911104
3463.2B32002065K186730K430916K201825J819879J873091K180934K399161K432466
$$ plain form
3479.5 249527067 251846462 254191101 256719410 259294391 261806995 264371455 267079592 269935995
3495.8 269935995 272763610 275509268 278366953 281238556 283920705 286691666 289844930 293226570
3512.1 293226570 296532720 299662381 302786499 306095898 309708387 313399881 316916078 320457429
3528.4 320457429 324163616 327943444 331889361 335990518 339985579 343976855 348212570 352692842
3544.7 352692842 357113808 361263186 365535885 370197147 374883413 379491240 384259820 389045417
3561.1 389045417 393543750 398341238 404397905 410704643 416107446 421319991 426921338 432746023
3577.4 432746023 438712060 444644958 450238556 456113994 463153601 470190942 476173967 482325196
3593.7 482325196 489242524 496288002 503310978 510232866 516583979 522701025 529608309 536967516
$$ packed form
3479.5B49527067K319395K344639K528309K574981K512604K564460K708137K856403
3495.8B69935995K827615K745658K857685K871603K682149K770961L153264L381640
3512.1B93226570L306150L129661L124118L309399L612489L691494L516197L541351
3528.4C20457429L706187L779828L945917M101157L995061L991276M235715M480272
3544.7C52692842M420966M149378M272699M661262M686266M607827M768580M785597
3561.1C89045417M498333M797488O056667O306738N402803N212545N601347N824685
3577.4D32746023N966037N932898N593598N875438P039607P037341N983025O151229
3593.7D82325196O917328P045478P022976O921888O351113O117046O907284P359207
$$ plain form
3610 536967516 544048548 550913215 557441950 564745545 573190928 580415487 585664153 590684950 598437965
3628.4 598437965 607670188 614567995 620585024 626848340 632962704 638916790 644281864 648645699
3644.7 648645699 653208077 660163343 667983711 673251390 677570045 683105767 688411832 692654252
3661 692654252 696474135 699661076 702278435 705724359 709619761 712318301 715862691 720392525 723632276
3679.4 723632276 726159394 728309512 729985416 732229829 735604465 738784850 741164804 743088663
3695.7 743088663 744637549 746086955 747969210 749838769 750892699 751400054 752344012 754412532 756451547
3714 756451547 757529199 758164465 758841813 759647846 760579824 761628151 762290418 762340963 762434781 763368130
3734.4 763368130 765220344 766580105 766387105 765903711 766855955 767878294 768074036 769202888 770994663
$$ packed form
3610E36967516P081032O864667O528735P303595Q445383P224559N248666N020797P753015
3628.4E98437965R232223O897807O017029O263316O114364N954086N365074M363835
3644.7F48645699M562378O955266P820368N267679M318655N535722N306065M242420
3661F92654252L819883L186941K617359L445924L895402K698540L544390M529834L239751
3679.4G23632276K527118K150118J675904K244413L374636L180385K379954J923859
3695.7G43088663J548886J449406J882255J869559J053930N07355R43958K068520K039015
3714G56451547J077652O35266O77348Q06033R31978J048327O62267N0545R3818R33349
3734.4G63368130J852214J359761j93000m83394R52244J022339J95742J128852J791775
$$ plain form
3752.8 770994663 771863878 772179902 772886395 773847759 774381220 774683475 775009036 775568843 776505411 777232647
3773.2 777232647 777472377 777626097 778077006 778593898 778931797 779313922 779730320 780076265 780261993 780151188
3793.6 780151188 780027807 779919565 779849589 780457914 781060815 781402349 782260895 782834291 782527745 782022238
3814 782022238 782009780 781989455 782054901 782951653 783630550 783802152 783883274 783739448 783475339 783226728 783183992
3836.4 783183992 783553064 784088969 784683645 785261333 785284579 784353673 782894790 782806933 784725785 785814106
3856.8 785814106 785684645 785305798 785195470 785321534 785056829 784798443 785195887 785746157 786101460 785995483
3877.2 785995483 785753191 785811484 785811722 786051512 786323011 786146104 786266088 786629498 786412179 785784781
3897.6 785784781 785332024 785349250 785939634 786760092 787216246 787294924 787166119 786817312 786475420 786503732
$$ packed form
3752.8G70994663Q69215L16024P06493R61364N33461L02255L25561N59807R36568P27236
3773.2G77232647K39730J53720M50909N16892L37899L82125M16398L45945J85728j10805
3793.6G80151188j23381j08242o9976O08325O02901L41534Q58546N73396l06546n05507
3814G82022238j2458k0325O5446Q96752O78897J71602Q1122j43826k64109k48611m2736
3836.4G83183992L69072N35905N94676N77688K3246r30906j458883q7857J918852J088321
3856.8G85814106j29461l78847j10328J26064k64705k58386L97444N50270L55303j05977
3877.2G85995483k42292N8293K38K39790K71499j76907J19984L63410k17319o27398
3897.6G85784781m52757J7226N90384Q20458M56154P8678j28805l48807l41892K8312
$$ plain form
3918 786503732 786745250 786799848 786827743 786976218 786911488 786763370 786974669 787303448 787370980 787245333 787106872
3940.4 787106872 787154973 787315249 787367761 787407398 787511945 787609458 787718356 787865937 787985742 788071692
3960.8 788071692 788178504 788247347 788240969 788270056 788386106 788506329 788633943 788810492 788959742 789068222
3981.2 789068222 789190173 789263904 789224803 789199769 789319754 789476037 789543211 789598882
3997.5 789598882
$$ packed form
3918G86503732K41518N4598K7895J48475o4730j48118K11299L28779O7532j25647j38461
3940.4G87106872M8101J60276N2512L9637J04547R7513J08898J47581J19805Q5950
3960.8G88071692J06812O8843o378K9087J16050J20223J27614J76549J49250J08480
3981.2G89068222J21951P3731l9101k5034J19985J56283O7174N5671
3997.5G89598882
##END=$$ End of the data block
