##TITLE=$$ Begin of the data block
##JCAMP-DX=5.00 $$ ACD/SpecManager v 10.08
##SPECTROMETER/DATA SYSTEM=Alpha
##DATE=14 Apr 2014 11:23:48
##DATA TYPE=INFRARED SPECTRUM
##DATA CLASS=XYDATA
##ORIGIN=
##OWNER=
##NPOINTS=1765
##FIRSTX=399.75695801
##LASTX=3997.56933594
##MAXX=3997.56933594
##MINX=399.75695801
##MAXY=0.82913905
##MINY=0.20392215
##XFACTOR=1.0000000000
##YFACTOR=1.000000000000000e-9
##FIRSTY=0.54409504
##DELTAX=2.03957629
##XUNITS=1/CM
##YUNITS=ARBITRARY UNITS
##XYDATA=(X++(Y..Y))
399.8 544095039 543612540 543427527 541790545 539734900 539295137 538856685 536852658 535201848 535140932
418.1 535140932 535048366 534519255 534887314 535333216 534542680 533575594 533196926 531999290 530141473 529700279
438.5 529700279 530006409 529345334 528909743 529724717 529854894 528509438 527802289 527924418 526848555
456.9 526848555 525343180 525240898 525080323 523602486 522394478 522086501 520855784 518722236 517698050
475.2 517698050 517240286 515895903 514707208 514589429 514094830 512704074 511982858 511863232 510736763
493.6 510736763 509260535 508744538 507904470 505894780 504532993 504244924 503160655 501359344 500496626
511.9 500496626 499833792 497857332 495929629 495276183 494095147 491735578 490077525 489228934 487476856
530.3 487476856 485446632 484587997 483859479 482364774 481339097 481135964 480410367 479071379 478328228
548.6 478328228 477831155 476441264 474769622 473683983 472383499 470445156 468748957 467143267 464547962
567 464547962 461407363 458897233 456556648 453607470 450954944 449146420 447024614 444446295 442465425
585.4 442465425 440870136 438757658 436466902 434728503 433081955 430932432 428717881 426664412
601.7 426664412 424235672 421841860 420672566 420556456 420143396 419523537 420124382 422366470 425559789
620 425559789 429480761 434049577 438327551 442005873 445903629 450167269 453864843 456918955 459965914
638.4 459965914 462256640 462892830 463496268 466126829 469665647 471803725 472224444 471848965 472632498
656.7 472632498 476931930 483980805 490222275 493844628 497468144 503369629 507095993 509179950
673.1 509179950 512202203 515800714 518706024 521252692 524285257 527057648 528854012 530621231
689.4 530621231 532804489 534300447 535006106 536048353 537409902 538298845 539300084 541278780 543515265
707.7 543515265 545375347 547645032 550680935 553472996 555790544 558683872 562008381 564685702
724 564685702 567157686 570157528 572985232 575051785 577058077 579366684 581264496 582726359 584529698
742.4 584529698 586656392 588431716 590054214 592098832 594116926 595645249 597304344 599396110
758.7 599396110 601215780 602636039 604331255 606302261 607797384 608771086 609698117 610258162 609880269
777.1 609880269 608907580 607899904 606685877 605244756 604405522 604793847 606168211 608594060 612728000
795.4 612728000 618402481 624634862 631083310 637744129 643880367 648885787 653092563 656778574
811.7 656778574 659395576 660766661 661498308 661476135 659934342 656989992 653308630 648813069 643336117
830.1 643336117 637579441 632155418 626836658 621597230 616962790 612933099 609091997 606006086
846.4 606006086 604908586 606153548 609550536 615350723 623578012 633311033 643559098 654119015
862.7 654119015 664722860 674419999 682738423 690016389 696184218 700743437 703933001 706337094
879.1 706337094 707530022 706985056 705394804 703426957 700778425 697565138 694974840 693638921 693061292
897.4 693061292 693173826 694466114 696433783 697979152 699056625 699844778 699438632 697227836 693897128
915.8 693897128 689963102 685213804 680227578 676370621 673990965 672569215 672211766 673075378 674208879
934.1 674208879 674830317 675474763 676405311 676801682 676443040 675949335 674954176 672368050 668297768
952.5 668297768 663346887 656961024 648515701 638517678 627262115 614104390 599001944 582858741
968.8 582858741 566194296 549354017 533524871 519785941 507892668 497294426 488129169 480286658
985.1 480286658 473060906 466368675 460813046 456361979 452482015 449232101 446844101 444872618
1001.4 444872618 442700386 440156490 437025428 432725251 427174628 421107858 414987892 408788323
1017.7 408788323 402808309 397474766 392590880 387779117 383215845 379092246 375157535 371295184
1034.1 371295184 367795348 364772260 361975461 359315544 356916100 354619116 352141291 349717587
1050.4 349717587 347952545 347173214 347512811 349159002 351778656 354370147 356082618 356575221 355545551
1068.7 355545551 352864742 349218905 345580518 342251599 339116216 336253226 333569407 330554932
1085 330554932 326934934 323016703 319271624 316164821 314276099 313918561 314798653 316346705 318208009
1103.4 318208009 320157230 321834922 322962046 323510766 323274016 321702391 318378031 313401282 307822257
1121.8 307822257 303730130 302559674 303591788 305156827 306042999 306145042 306562722 308206022 310908139
1140.1 310908139 314044803 317038655 319490463 321464241 323309302 325212598 327309698 329946220
1156.4 329946220 333479553 338013977 343611062 350483477 358665645 367767394 377342939 387114942
1172.7 387114942 396739900 405822247 414253265 422058135 428899318 434269816 437957853 439888239
1189.1 439888239 440015316 438751936 437001616 435597390 435035497 435666054 437586725 440284312 442964107
1207.4 442964107 445200652 446857095 447787344 448094785 448215812 448403865 448609024 448937744 449694633
1225.8 449694633 450961292 452577740 454534352 456928313 459620416 462390184 465235680 468123823
1242.1 468123823 470737875 472875416 474642724 476017267 476869255 477415919 478087783 479070187 480445743
1260.4 480445743 482477158 485308766 488807976 492883116 497627795 502978146 508632898 514503479
1276.8 514503479 520720124 527200758 533757210 540523648 547653973 554836869 561718166 568324983
1293.1 568324983 574617267 580325246 585410118 590069830 594314158 597981036 601150751 604032457
1309.4 604032457 606530547 608497798 610118866 611696780 613267899 614741802 616241157 617793262
1325.7 617793262 619138539 620159686 620913208 621251523 621067584 620778978 620896876 621213973 621371508
1344.1 621371508 621575594 621973574 622257948 622223854 622035444 621628046 620650053 619177878 617663503
1362.4 617663503 616067350 614096463 612101495 610399067 608772039 607173860 605549634 603131950
1378.7 603131950 598951936 593809187 590623498 590791404 592036963 592108071 591302991 590148091 588513911
1397.1 588513911 586467028 584044635 581020176 577739060 574781895 572047770 569348216 566857338
1413.4 566857338 564646602 562769711 561590910 560900629 560344815 559833348 559241772 558910251 558804929
1431.8 558804929 558450997 558686316 560258269 561826527 563098967 564591587 566588104 569306076 572479129
1450.1 572479129 575725973 579282522 585340500 594789147 603067279 609835148 617525697 626060307
1466.4 626060307 633713126 641369820 651219010 661753356 670372963 676921546 681888878 685730159
1482.8 685730159 688010573 688589573 688363194 687851369 686157942 682933509 679132938 675457597 671146035
1501.1 671146035 665684998 659057438 651987255 646047354 640481591 634679198 628970027 623883665
1517.4 623883665 619859636 616714895 613837004 610919476 608219743 605559111 602657378 600022912
1533.7 600022912 597621143 594933629 592833340 592284560 592365623 592397869 592314541 592609346 593333542 593809009
1554.1 593809009 593727529 594904602 597963870 598906875 598178983 596987903 595191658 592788458 589610875
1572.5 589610875 585447550 580449402 575223744 569665134 563321531 556237817 548681855 540920436
1588.8 540920436 532825172 524421990 516002417 507721841 499361813 490884811 482565433 474438131
1605.1 474438131 466254532 457996637 449931324 441986948 433732003 425423563 418418884 411968887
1621.4 411968887 405321062 399240583 393872023 389015257 384789646 381302863 379077017 378386945
1637.8 378386945 378457129 379104823 380308360 382909626 386814028 389817536 393855065 401473671 407761544
1656.1 407761544 412468582 417806685 424600422 432128251 438682318 445817918 454703540 463064730
1672.4 463064730 471767426 481612086 490398228 498106182 507048130 519826889 531859159 541315675
1688.8 541315675 550660670 559112310 568543851 579586864 591308117 605858088 618347287 628432691
1705.1 628432691 638821721 647954226 655501664 661851585 667858362 675297618 682799816 688231349
1721.4 688231349 692923188 697765231 702097476 705774903 709152341 713996708 719644964 723694026
1737.7 723694026 727838635 732675850 737094402 741154552 745315373 750020921 754944623 759001553
1754 759001553 762550890 765903711 768760979 771817744 774759471 776797593 778337538 780021846 782379568
1772.4 782379568 784903467 786826253 788526118 790204704 791734815 793376625 795106530 796227157
1788.7 796227157 796973765 798529327 800412536 801568508 802415192 803711295 805203795 806294203 807142556
1807 807142556 808063447 808987796 809802413 810678422 811618567 812341928 812783360 813273668 813925207 814365029
1827.4 814365029 814914942 816050172 817011774 817466676 818014503 818585336 818639457 818715274 819605172 820619285
1847.8 820619285 821178377 821600199 822153270 822594464 822806716 823156297 823647141 823794723 823570967 823730171
1868.2 823730171 824486732 825071692 825393081 825806081 826135933 826218486 826373696 826702178 826805472 826734602
1888.6 826734602 827010453 827417433 827543437 827648640 827944756 828180015 828194976 828227639 828377664 828454912
1909 828454912 828510523 828672945 828701913 828509629 828458786 828656852 828906417 829039335 829077899 829139054 829094648
1931.5 829094648 828897595 828788221 828794122 828612089 828313470 828285098 828377426 828262031 828082740 828026533
1951.9 828026533 827924907 827679992 827467799 827360213 827166438 826825082 826588273 826560676 826489806 826315522
1972.3 826315522 826212287 826098323 825873315 825671315 825575531 825436115 825160921 824899435 824741781 824597836
1992.6 824597836 824419558 824284196 824172020 823943913 823635995 823406279 823182940 822851539 822553277 822369337
2013 822369337 822101653 821732581 821504831 821361125 821056485 820658028 820416033 820259392 819975495 819665074
2033.4 819665074 819474280 819242895 818857789 818586051 818538070 818390310 818043649 817802846 817695260 817457259
2053.8 817457259 817144394 817012191 816944599 816707909 816465855 816393137 816318154 816144049 816076636 816113353
2074.2 816113353 815982342 815725982 815632701 815625966 815457046 815277338 815276980 815261006 815086305 814986229 815038741
2096.7 815038741 814985514 814832807 814841032 814930856 814861178 814765871 814830780 814866900 814738154 814693749 814830303
2119.1 814830303 814896882 814859390 814951658 815123796 815155864 815148234 815275013 815423369 815450788 815500915 815685511
2141.5 815685511 815821588 815841198 815945923 816165566 816300094 816366196 816551149 816783369 816881478 816966891
2161.9 816966891 817201674 817412555 817483425 817636728 817929924 818131328 818223953 818392634 818606079 818720639
2182.3 818720639 818833768 819041848 819178581 819184422 819258988 819445610 819542110 819521248 819583833 819737256 819798708
2204.8 819798708 819814920 819942594 820077121 820097387 820142627 820267737 820300937 820227802 820219696 820298553 820311606
2227.2 820311606 820259631 820295155 820350945 820290387 820227385 820253193 820219994 820100725 820074916 820137024 820099056
2249.6 820099056 819965482 819893181 819853365 819750130 819686472 819741726 819774568 819718063 819709063 819778681 819807053
2272.1 819807053 819796145 819863141 819977105 820015192 820036352 820155323 820273161 820285261 820280373 820342958 820417345
2294.5 820417345 820453048 820500135 820556223 820564032 820558429 820612550 820681989 820713878 820791423 820950031 821052015
2316.9 821052015 821062922 821186960 821449220 821612716 821667790 821871340 822197437 822329879 822335839 822486699
2337.3 822486699 822708368 822903812 823303580 823760569 823612452 823008299 822684586 822897315 823289394 823775828
2357.7 823775828 824343324 824751377 824949205 825100183 825243413 825372696 825549066 825746834 825880766 825948000
2378.1 825948000 826025963 826150477 826254427 826294899 826355696 826453269 826502442 826526642 826612175 826716483 826742709
2400.6 826742709 826721489 826730430 826739371 826703727 826668561 826637089 826564670 826482534 826429665 826361716 826234937 826082945
2425 826082945 825966477 825892329 825823247 825748146 825670004 825564682 825421751 825289607 825183928 825052977 824891269
2447.5 824891269 824745715 824642241 824542761 824407101 824241757 824060023 823878229 823718905 823572338 823409021
2467.9 823409021 823218226 823014081 822827220 822641671 822427452 822227240 822050631 821859062 821660221 821472049
2488.3 821472049 821288288 821095347 820910633 820768893 820624590 820437610 820264637 820111632 819918454 819706559
2508.7 819706559 819552541 819420099 819210589 818982482 818821430 818649948 818418503 818202794 818029583 817850947
2529 817850947 817650080 817454338 817260802 817039967 816835105 816662967 816444755 816196084 816008389 815860987
2549.4 815860987 815663457 815414131 815202773 815030694 814806819 814543426 814293444 814025819 813740373 813461781
2569.8 813461781 813166499 812839806 812483430 812122345 811763465 811359107 810933113 810551167 810158789 809706330
2590.2 809706330 809274435 808863997 808379054 807841778 807332456 806835294 806301475 805749178 805219054 804669857
2610.6 804669857 804060400 803460956 802906156 802345097 801764548 801176786 800571144 799923539 799260914 798653960
2631 798653960 798100829 797524214 796914041 796347260 795813859 795256317 794694126 794132829 793549478 792961299
2651.4 792961299 792409241 791879594 791321635 790746808 790188134 789644599 789118648 788607955 788079500 787511885
2671.8 787511885 786935627 786391914 785856545 785293996 784738600 784206927 783627212 782997787 782415092 781863749
2692.2 781863749 781269968 780647755 780013919 779335976 778638124 777976871 777336657 776667535 775960684 775265157
2712.6 775265157 774569929 773847044 773152351 772485912 771799564 771107674 770437360 769769371 769070029 768339336
2733 768339336 767647624 767023861 766373694 765696645 765080214 764470220 763806641 763123810 762435496 761726677
2753.4 761726677 760996580 760267019 759510636 758709431 757918715 757143915 756354690 755533099 754689038 753860593
2773.8 753860593 752997279 752051055 751079500 750094593 749074340 748066306 747096002 746082544 744970143
2792.2 744970143 743828058 742697120 741513014 740242779 738944292 737644792 736305118 734930098
2808.5 734930098 733533978 732092381 730637789 729183555 727673113 726079643 724410176 722702205
2824.8 722702205 720940471 719040394 717013538 714894295 712587833 709993660 707030356 703502476
2841.1 703502476 699247956 694329441 689141095 684431791 680846751 678454816 676899374 675739765
2857.4 675739765 674574554 673110664 671179712 668721795 665856838 662879109 660071075 657542169
2873.7 657542169 655317008 653409004 651718020 650089204 648421645 646629930 644682586 642625153
2890.1 642625153 640495777 638289511 635993958 633640885 631272376 628832102 626184285 623279750
2906.4 623279750 620121121 616576433 612551868 608262420 604126155 600469112 597431362 595099270
2922.7 595099270 593501627 592527151 592019677 591916442 592284918 593252063 594869018 597024977 599565029
2941 599565029 602308869 604904413 607004642 608519554 609568655 610286713 610767365 611161292 611681163
2959.4 611681163 612435341 613322079 614272773 615285158 616235971 617104471 618000388 618950963 619999826
2977.8 619999826 621141374 622247398 623317778 624406278 625440717 626356840 627075374 627488554 627629876
2996.1 627629876 627523303 627118826 626496196 625753522 624907494 623996794 623056889 622006536 620745063
3014.5 620745063 619292617 617690146 615964234 614157021 612268686 610324800 608386934 606476784
3030.8 606476784 604582369 602585375 600414693 598233044 596112669 593935847 591648459 589287162
3047.1 589287162 586933017 584569037 582117379 579660356 577255487 574875474 572561681 570339918
3063.4 570339918 568187058 566028833 563777685 561490536 559293211 557191312 555102766 552918553
3079.7 552918553 550613165 548291087 545992851 543705285 541434348 539086223 536617398 534156084
3096 534156084 531777680 529415488 526964664 524430990 521925092 519426346 516813993 514165044 511616886
3114.4 511616886 509058654 506339848 503451705 500428677 497376204 494421333 491532266 488592982
3130.7 488592982 485589385 482578933 479586422 476565331 473439068 470193505 466882199 463606238
3147 463606238 460466802 457399577 454203993 450828701 447415054 444061011 440751314 437434882 434101880
3165.4 434101880 430781424 427463174 424133778 420801759 417457700 414120674 410838455 407578468
3181.7 407578468 404293299 401037335 397848159 394650757 391410202 388193667 385040253 381911427
3198 381911427 378761590 375648648 372625083 369647890 366709828 363817185 360918760 358016968 355188102
3216.4 355188102 352417201 349656522 346937329 344267577 341617286 338993579 336444467 333969623
3232.7 333969623 331489056 328985482 326523453 324129343 321820617 319612235 317433029 315199822
3249 315199822 312951624 310808808 308788389 306763798 304694682 302648753 300647080 298692584 296797633
3267.4 296797633 294931471 293037266 291121840 289215505 287339568 285530001 283732116 281870216
3283.7 281870216 280014277 278246343 276547819 274838895 273060799 271274775 269522876 267764300
3300 267764300 266049951 264451027 262839764 261059195 259172440 257317245 255545437 253834456 252122790
3318.4 252122790 250401109 248711869 247048363 245357469 243649513 241984591 240354985 238755375
3334.7 238755375 237216666 235684887 234071031 232411146 230783135 229218632 227745041 226271525
3351 226271525 224699095 223111048 221618026 220237568 218898684 217559129 216327295 215228632 214081943
3369.3 214081943 212758109 211419836 210309401 209393486 208536357 207704663 206953064 206334382 205907404
3387.7 205907404 205686405 205440968 204979226 204554617 204491884 204619572 204512119 204138264 203922153 204053044
3408.1 204053044 204298571 204476506 204617605 204807907 205100089 205483213 205939695 206527188 207288012 208229288
3428.5 208229288 209237427 210281655 211435109 212512642 213357165 214188933 215276703 216649070 218183264
3446.8 218183264 219705746 221210644 222814903 224550217 226399496 228348613 230304852 232312351
3463.2 232312351 234581068 237003818 239169821 240972281 242810845 244944483 247340903 249829084
3479.5 249829084 252170354 254453540 256935358 259514630 262016267 264582723 267335236 270215511
3495.8 270215511 273025125 275741726 278613716 281539947 284255773 287043452 290183604 293543935
3512.1 293543935 296858400 299963146 303055257 306403548 310043842 313682705 317149937 320694357
3528.4 320694357 324421972 328254730 332275927 336379170 340291202 344222486 348463356 352957726
3544.7 352957726 357391745 361588150 365892828 370541126 375207037 379805654 384580851 389381766
3561.1 389381766 393889546 398662120 404665142 410980105 416447312 421667039 427210629 432975948
3577.4 432975948 438911706 444894642 450610816 456542075 463496119 470488459 476533681 482687473
3593.7 482687473 489539266 496578723 503635168 510537684 516848147 522990048 530001402 537439883
3610 537439883 544512331 551361024 557899117 565173090 573516905 580677032 585982621 591117620 598921478
3628.4 598921478 608111799 614959478 620943546 627219558 633393526 639354944 644651771 648985147
3644.7 648985147 653562486 660497606 668299317 673568249 677873850 683401525 688733160 692986667
3661 692986667 696800411 700037956 702749074 706226647 710097969 712830901 716383636 720822394 724009991
3679.4 724009991 726556957 728726327 730380476 732592463 735992908 739194095 741498709 743357599
3695.7 743357599 744915485 746378124 748247027 750065684 751048684 751580536 752635121 754742980 756776571
3714 756776571 757868528 758534968 759250164 760045588 760927141 761943042 762601852 762678742 762827039 763820112
3734.4 763820112 765701532 767030776 766809821 766356885 767306745 768241882 768411100 769596279 771425247
3752.8 771425247 772307217 772635043 773340821 774258196 774720073 774968684 775285423 775884509 776845992 777530611
3773.2 777530611 777691305 777794480 778258741 778818190 779190481 779627919 780116558 780499160 780669749 780534208
3793.6 780534208 780379593 780186772 780070186 780730903 781392813 781757355 782578290 783082843 782757819 782294333
3814 782294333 782357275 782438099 782541215 783339441 783930182 784074008 784136593 784023404 783812284 783549726
3834.4 783549726 783473194 783881247 784482956 785087407 785609603 785599470 784731269 783352911 783240914 785073876
3854.8 785073876 786108375 785941184 785530686 785386562 785533428 785396397 785269558 785676420 786137521
3873.1 786137521 786443591 786353469 786120474 786191761 786210716 786432266 786714256 786595225 786693752 786976397
3893.5 786976397 786737144 786132097 785695910 785713077 786303341 787130237 787565231 787558615 787330925 786966443
3913.9 786966443 786724210 786861837 787092924 787102938 787122667 787236631 787155807 787045777 787290394 787634671
3934.3 787634671 787667215 787482083 787346661 787399232 787520528 787570834 787648261 787801743 787953854 788052499
3954.7 788052499 788130164 788223028 788344681 788494229 788589418 788594723 788586676 788626492 788698435 788824618 789003789
3977.1 789003789 789157808 789302588 789444804 789501011 789450884 789424181 789572120 789806247 789940774 790017784
3997.5 790017784
##END=$$ End of the data block
