##TITLE=$$ Begin of the data block
##JCAMP-DX=5.00 $$ ACD/SpecManager v 10.08
##SPECTROMETER/DATA SYSTEM=Alpha
##DATE=14 Apr 2014 11:23:48
##DATA TYPE=INFRARED SPECTRUM
##DATA CLASS=XYDATA
##ORIGIN=
##OWNER=
##NPOINTS=1765
##FIRSTX=399.75695801
##LASTX=3997.56933594
##MAXX=3997.56933594
##MINX=399.75695801
##MAXY=0.82925421
##MINY=0.20427248
##XFACTOR=1.0000000000
##YFACTOR=1.000000000000000e-9
##FIRSTY=0.54420197
##DELTAX=2.03957629
##XUNITS=1/CM
##YUNITS=ARBITRARY UNITS
##XYDATA=(X++(Y..Y))
399.8 544201970 543308735 543051541 541705489 539971054 539618850 539135575 536987662 535229266 535420775
418.1 535420775 535669386 535056531 535138369 535068929 533604801 532578886 532938898 532325327 530279517 529517829
438.5 529517829 529979527 529593706 529067397 529508531 529390216 528122485 527612865 527854919 526918650 525505364
458.9 525505364 525239527 524812400 523338199 522349715 522037804 520619273 518536687 517872930 517639041
477.3 517639041 516063154 514568329 514431417 513943493 512504518 511940002 512103975 511035919 509318233
495.6 509318233 508525193 507557690 505539894 504248261 504096031 503014684 501140535 500447094 499983341
514 499983341 498001337 495961070 495147973 493906349 491658926 490079522 489142478 487293452 485240519
532.3 485240519 484390080 483653486 482127815 481247455 481313914 480595171 479084224 478313893 477853119 476488948
552.7 476488948 474972814 474115103 472870141 470814943 469019681 467335492 464581847 461296350 458814561
571.1 458814561 456579804 453692257 451016247 449106365 446925759 444314897 442320853 440776348
587.4 440776348 438665390 436290562 434554964 433104575 431162089 428970188 426829636 424340129
603.7 424340129 421947598 420836538 420753300 420280606 419571131 420157731 422467828 425717711 429619372
622.1 429619372 434120506 438353568 442042798 446016222 450329423 453973740 456928641 459901303
638.4 459901303 462235034 463016152 463730335 466376930 469864458 471931577 472315997 471973747 472818524
656.7 472818524 477124900 484154522 490423262 494062632 497643739 503555655 507410765 509594500
673.1 509594500 512624979 516179502 519030929 521551192 524541676 527187765 528917432 530769825
689.4 530769825 533056498 534603536 535328984 536377966 537740648 538647175 539670408 541656256 543918967
707.7 543918967 545822680 548152983 551206052 553955078 556231737 559064984 562417805 565244377
724 565244377 567758381 570646882 573376477 575423539 577431381 579723954 581621647 583086073 584867597
742.4 584867597 586993754 588793337 590416014 592420220 594412744 595943153 597560883 599603653
758.7 599603653 601476729 603004873 604722559 606626570 608056307 608996212 609906316 610472381 610107005
777.1 610107005 609139979 608128250 606900454 605526626 604846060 605292916 606582522 608972847 613158524
795.4 613158524 618826568 624969900 631357074 638036788 644225180 649219513 653318286 656908453
811.7 656908453 659572303 661095500 661881864 661772728 660136461 657156646 653502643 649079621 643657684
830.1 643657684 637866855 632350922 626987576 621771753 617146134 613115728 609374583 606383681
846.4 606383681 605196953 606316805 609697044 615527511 623803139 633527160 643693328 654206038
862.7 654206038 664816439 674542665 682900488 690216839 696411192 700964987 704090774 706390083
879.1 706390083 707525671 707017779 705489874 703563988 700958371 697771370 695138395 693712771 693090141
897.4 693090141 693252981 694608688 696556687 698076785 699170113 699971676 699577689 697343707 693934679
915.8 693934679 689917684 685136616 680176318 676371217 674015760 672557056 672158480 673026562 674195409
934.1 674195409 674853504 675502479 676386595 676693380 676256001 675737739 674732983 672126591 668053985
952.5 668053985 663122237 656753600 648319364 638351917 627136827 613977492 598851502 582721829
968.8 582721829 566062510 549171925 533325672 519663632 507850468 497277230 488107085 480230033
985.1 480230033 472968966 466269583 460729241 456312597 452450246 449195355 446805507 444806606
1001.4 444806606 442581683 440021813 436907262 432626098 427085966 420988441 414826542 408612221
1017.7 408612221 402637929 397340119 392491877 387688339 383150220 379091412 375208646 371363074
1034.1 371363074 367881507 364873946 362076849 359427094 357041448 354713380 352173865 349735469
1050.4 349735469 347996354 347223252 347546667 349169046 351780683 354384035 356098950 356583774 355541557
1068.7 355541557 352862567 349245042 345621914 342288285 339157045 336310059 333638012 330609620
1085 330609620 326977342 323090374 319387794 316297919 314413577 314073473 314957827 316455215 318265229
1103.4 318265229 320209682 321905524 323050290 323600233 323358744 321790427 318471581 313507915 307960927
1121.8 307960927 303885758 302688658 303672433 305184424 306052983 306194246 306645125 308282554 310986876
1140.1 310986876 314151555 317175061 319632709 321571141 323386043 325308144 327440470 330101639
1156.4 330101639 333638996 338126421 343650788 350508809 358735859 367856383 377390563 387111872
1172.7 387111872 396732271 405859530 414326459 422103912 428888142 434220016 437888473 439804792
1189.1 439804792 439917982 438655406 436927229 435542613 434997201 435664415 437608331 440293938 442967802
1207.4 442967802 445209235 446858823 447778672 448089868 448225349 448428392 448646337 448984355 449738264
1225.8 449738264 450970024 452538908 454483300 456897020 459595293 462359846 465213448 468107313
1242.1 468107313 470739216 472912341 474690288 476065040 476941615 477512419 478188425 479176223 480546534
1260.4 480546534 482543796 485358417 488869309 492933393 497650802 502991021 508640707 514505923
1276.8 514505923 520721734 527204990 533748031 540446877 547496796 554673612 561605632 568251967
1293.1 568251967 574566603 580294907 585392535 590048313 594276607 597943068 601131141 604008257
1309.4 604008257 606477916 608443975 610108137 611726940 613288462 614733338 616251171 617856860
1325.7 617856860 619231761 620251834 620986938 621297479 621112585 620860755 621001363 621300459 621441007
1344.1 621441007 621641755 622031569 622319937 622303605 622126520 621718407 620721996 619225979 617708087
1362.4 617708087 616126537 614164531 612171531 610494435 608887017 607258558 605604351 603180647
1378.7 603180647 598993957 593862236 590689898 590843737 592087090 592170238 591357112 590181887 588544846
1397.1 588544846 586512804 584097385 581090629 577828586 574852109 572105527 569435596 566972077
1413.4 566972077 564740121 562827945 561664283 560983479 560401917 559889197 559317768 558985591 558862507
1431.8 558862507 558525085 558819890 560420752 561958611 563181460 564640880 566637397 569372952 572547138
1450.1 572547138 575785995 579363048 585467815 594928086 603174746 609929860 617630601 626157820
1466.4 626157820 633797526 641469479 651344001 661880434 670477629 676983356 681910992 685739458
1482.8 685739458 688033044 688629746 688393354 687831581 686110735 682926357 679169357 675468504 671130657
1501.1 671130657 665729582 659213185 652148783 646112323 640487194 634688199 629026294 623981774
1517.4 623981774 619978428 616847992 613966227 611025214 608303130 605646372 602775991 600169301
1533.7 600169301 597778261 595121920 593100011 592622578 592710793 592715204 592607379 592880428 593588054 594069302
1554.1 594069302 594001651 595167339 598198473 599128425 598394334 597206295 595409572 592975855 589775562
1572.5 589775562 585635126 580646873 575385451 569800854 563455582 556386590 548844635 541084349
1588.8 541084349 532976508 524564147 516167521 507931173 499572426 491055429 482723743 474603295
1605.1 474603295 466399461 458097577 450013310 442096353 433881372 425587624 418570817 412095726
1621.4 412095726 405404925 399300635 393941551 389077961 384812951 381294638 379095346 378445953
1637.8 378445953 378515750 379147142 380343169 382954121 386872262 389895350 393977761 401614517 407858044
1656.1 407858044 412542343 417901427 424714416 432245106 438807338 445961058 454877108 463263631
1672.4 463263631 471969485 481793493 490552276 498253763 507228196 520034790 532036126 541454017
1688.8 541454017 550787747 559256017 568714023 579763830 591466486 605996788 618500769 628613293
1705.1 628613293 638984203 648075461 655607462 661965549 668000042 675447643 682913005 688333750
1721.4 688333750 693046272 697896957 702239513 705937862 709334314 714220464 719905674 723943353
1737.7 723943353 728038669 732812583 737194300 741265655 745461464 750183344 755092144 759130061
1754 759130061 762685478 766053796 768921793 771987915 774921536 776942670 778472126 780150890 782503307
1772.4 782503307 785029709 786966860 788677692 790360153 791893065 793526053 795230210 796322167
1788.7 796322167 797058761 798618793 800499260 801683068 802588344 803894103 805329263 806371570 807236493
1807 807236493 808210433 809168041 809971213 810820580 811761916 812497675 812945843 813444853 814086735 814517319
1827.4 814517319 815083146 816206455 817133784 817576110 818127155 818717837 818796575 818882525 819773436 820769370
1847.8 820769370 821293712 821701050 822266817 822710276 822898030 823229790 823732078 823913813 823738694 823933423
1868.2 823933423 824677110 825213015 825504303 825914264 826234400 826316535 826491416 826818824 826899230 826823771
1888.6 826823771 827116609 827534854 827660561 827775776 828090847 828316450 828300416 828333735 828518867 828616142
1909 828616142 828662515 828821540 828855872 828655720 828596711 828787744 829003513 829101145 829153597 829254210 829225957
1931.5 829225957 829046190 828963637 828961730 828762472 828466415 828423738 828485489 828355551 828182995 828149140 828071773
1953.9 828071773 827837527 827629089 827516973 827307880 826960742 826724827 826682329 826594353 826426446 826342106
1974.3 826342106 826233745 825979292 825747848 825681150 825584948 825309038 825009406 824790955 824618399 824482501
1994.7 824482501 824401319 824294090 824042737 823736191 823526561 823311210 822983861 822682619 822486043 822221041
2015.1 822221041 821857452 821603358 821422875 821106732 820724308 820524275 820421696 820162356 819827437 819599807
2035.5 819599807 819356680 818988919 818732679 818660140 818468392 818113148 817899108 817808747 817566872 817249179
2055.9 817249179 817119718 817067504 816870391 816665471 816587985 816483498 816293180 816227436 816265821 816138685
2076.3 816138685 815902650 815826654 815797746 815587878 815402627 815416217 815404773 815246642 815155387 815177023 815092504
2098.7 815092504 814955711 815000534 815097690 815021694 814924657 814973056 815000415 814885378 814835489 814952195 815032601
2121.1 815032601 815023720 815103889 815234959 815244794 815263152 815445244 815619171 815621853 815624595 815786660 815941930
2143.6 815941930 815993667 816130042 816368163 816492558 816535115 816711545 816942990 817039609 817133009 817361653
2164 817361653 817545593 817605495 817768037 818059504 818243861 818339527 818543553 818779171 818863213 818915009 819094121
2186.4 819094121 819258630 819306016 819408715 819608688 819696784 819667995 819751561 819925904 819977760 819979489 820106983
2208.8 820106983 820244968 820252180 820256352 820338786 820366919 820325196 820361435 820475221 820510089 820470035 820493340
2231.3 820493340 820530653 820473671 820421457 820448399 820408881 820273399 820226729 820275366 820227623 820091724 820048511
2253.7 820048511 820041955 819920778 819832921 819903016 819942176 819874227 819870591 819955766 819980204 819951117 820006073 820115209
2278.2 820115209 820174575 820231855 820345223 820438564 820452332 820453823 820516706 820582509 820592105 820630670 820717454 820750713
2302.7 820750713 820750535 820797801 820841074 820865512 820956349 821101904 821196854 821236730 821379066 821620524 821752787
2325.1 821752787 821825445 822078764 822385132 822467804 822466075 822584510 822736859 822880089 823286593 823785603
2345.5 823785603 823675931 823133409 822850287 823069155 823508561 823935270 824265242 824563801 824858367 825081527
2365.9 825081527 825280726 825487256 825674713 825882971 826059282 826139927 826201439 826304734 826402247 826449752
2386.3 826449752 826506078 826599419 826668918 826728165 826837480 826918364 826892436 826861501 826894820 826905549 826855779
2408.7 826855779 826817214 826795340 826749980 826704204 826662898 826569080 826404989 826237559 826135874 826067388 825969815
2431.2 825969815 825868309 825784266 825684667 825555980 825431943 825323462 825198948 825062811 824931145 824802697
2451.5 824802697 824666202 824509025 824337900 824174881 824031413 823895514 823744833 823573053 823387861 823186398
2471.9 823186398 822983384 822783530 822581470 822400928 822215259 822005510 821827352 821677685 821493626 821272790
2492.3 821272790 821074009 820926070 820770800 820581794 820430040 820294559 820079446 819839418 819688439 819576204
2512.7 819576204 819399059 819193423 819003940 818774700 818525434 818344653 818199217 818018019 817817986 817625284
2533.1 817625284 817415893 817176163 816937685 816741407 816579938 816404819 816215456 816005766 815755844 815517187
2553.5 815517187 815330148 815143645 814909577 814659476 814420104 814152479 813844740 813564479 813314795 812992156
2573.9 812992156 812604845 812259972 811917782 811493754 811060429 810672641 810269654 809835613 809406936 808968484
2594.3 808968484 808499157 808006585 807496309 806963086 806407332 805850029 805309832 804764390 804176271 803586483
2614.7 803586483 803035200 802478731 801893830 801315367 800734043 800086856 799396515 798753023 798175752 797605932
2635.1 797605932 797032535 796488643 795924842 795323551 794754326 794211149 793639600 793062627 792539001 792043030
2655.5 792043030 791483045 790881455 790335000 789825737 789310038 788783252 788220286 787621677 787036598 786511600
2675.9 786511600 785992384 785413980 784831762 784278035 783699751 783101261 782542050 781983256 781378388 780768216
2696.3 780768216 780144095 779472172 778767765 778066993 777401149 776749790 776085496 775424242 774748147 774023235
2716.7 774023235 773286581 772588849 771917224 771236598 770543993 769842863 769141316 768457949 767808974 767181933
2737.1 767181933 766535103 765894592 765275538 764605522 763899982 763241529 762601197 761898160 761163116 760455191
2757.5 760455191 759718239 758910954 758082330 757260084 756441236 755621076 754809618 753990829 753094852 752131820
2777.9 752131820 751176953 750231504 749250293 748243511 747248054 746224344 745107770 743932903 742786467
2796.2 742786467 741632462 740395606 739103556 737773776 736412942 735068560 733719289 732285142
2812.5 732285142 730794311 729303896 727769375 726151347 724483252 722805560 721059263 719165325
2828.9 719165325 717159569 715061903 712772667 710166454 707149267 703597128 699359834 694452107
2845.2 694452107 689290702 684632599 681055367 678623915 677063167 675927579 674754679 673266530
2861.5 673266530 671318233 668853164 665995002 663003981 660154283 657600880 655370533 653457105
2877.8 653457105 651766479 650144756 648501635 646745384 644803405 642736316 640648365 638507247
2894.1 638507247 636202872 633794665 631410241 628973484 626317620 623418868 620282114 616736412
2910.4 616736412 612677515 608358026 604220510 600573659 597539127 595212340 593602955 592598796
2926.8 592598796 592110395 592048228 592394590 593322575 594951689 597148359 599705279 602424145 605018139
2945.1 605018139 607172191 608749986 609851360 610558271 610957146 611331701 611907423 612684548 613576472
2963.5 613576472 614531457 615515530 616453111 617335439 618236482 619181573 620203018 621339858 622499406
2981.8 622499406 623583853 624612808 625623047 626601815 627382278 627773464 627855539 627727032 627318680
3000.2 627318680 626689017 625966907 625155091 624260724 623325169 622278571 621015429 619538665 617909431
3018.5 617909431 616182983 614392817 612512469 610538900 608581007 606689870 604772329 602741182
3034.9 602741182 600629687 598549664 596478105 594282746 591960847 589586020 587204874 584806681
3051.2 584806681 582351327 579917669 577560961 575211048 572856665 570583344 568439424 566312730
3067.5 566312730 564092875 561834276 559602022 557435632 555327952 553157866 550880373 548566639
3083.8 548566639 546249509 543932736 541624069 539291382 536921084 534568727 532236338 529842138
3100.1 529842138 527344346 524791360 522281349 519805491 517213821 514556050 511998594 509437144
3116.4 509437144 506705999 503776670 500715911 497668594 494727015 491837233 488889337 485880703
3132.8 485880703 482871830 479879588 476871341 473759085 470527291 467263430 464028060 460870862
3149.1 460870862 457754850 454506487 451100230 447711349 444407433 441110760 437794566 434500009
3165.4 434500009 431193441 427822858 424457431 421138227 417812645 414492756 411231816 407984346
3181.7 407984346 404711545 401449651 398203611 394960105 391715348 388483524 385314882 382194340
3198 382194340 379074126 376002759 372993559 369991362 366998404 364054948 361168683 358325213 355507344
3216.4 355507344 352705836 349946856 347225100 344515860 341856480 339279950 336763322 334283143
3232.7 334283143 331789374 329255074 326765686 324368089 322041780 319807589 317647815 315469205
3249 315469205 313260615 311122566 309095323 307091504 305065840 303040475 301013112 299003124 297068089
3267.4 297068089 295233339 293397218 291480988 289542288 287606269 285673350 283789843 281978548
3283.7 281978548 280227184 278511524 276808292 275102317 273360938 271581292 269790113 268007785
3300 268007785 266298354 264683276 263041168 261276513 259426445 257559419 255748779 254028171 252329111
3318.4 252329111 250631213 249007344 247398466 245662972 243878573 242218286 240647644 239064366
3334.7 239064366 237484530 235914037 234303668 232677892 231061652 229475841 228003219 226557374
3351 226557374 224990770 223398715 221922144 220545158 219184980 217852846 216679096 215617359 214451596
3369.3 214451596 213134751 211840108 210719958 209750727 208871320 208045781 207298398 206681103 206259429
3387.7 206259429 206030771 205752209 205278948 204879105 204846010 204996511 204888880 204505995 204272479 204344273
3408.1 204344273 204546437 204750925 204905093 205060527 205359608 205805838 206308588 206907392 207687601 208653077
3428.5 208653077 209657326 210694000 211852849 212901846 213691264 214537427 215645090 216949761 218444601
3446.8 218444601 219992295 221530482 223173916 224939585 226797268 228741869 230700821 232687891
3463.2 232687891 234895855 237275362 239440322 241265669 243130565 245271146 247641414 250091493
3479.5 250091493 252422631 254735529 257242322 259807765 262296945 264835715 267543495 270442933
3495.8 270442933 273302853 276035547 278910637 281849742 284552693 287304908 290448487 293794334
3512.1 293794334 297045469 300132662 303242296 306606948 310301960 314005077 317498088 321047783
3528.4 321047783 324790657 328615606 332603633 336733073 340696484 344624013 348843396 353337139
3544.7 353337139 357770354 361960143 366265416 370895565 375547022 380174905 384996921 389803022
3561.1 389803022 394250184 398974091 404985905 411303580 416754067 421987563 427577496 433398813
3577.4 433398813 439358264 445276618 450917870 456891716 463972718 471011043 477025688 483199030
3593.7 483199030 490059227 496996939 503971934 510934472 517325521 523441434 530385435 537842453
3610 537842453 544985652 551849544 558358729 565604091 573932230 581094742 586407006 591539323 599340379
3628.4 599340379 608550072 615410745 621360958 627565444 633699417 639727592 645133495 649489641
3644.7 649489641 654052198 661011279 668789625 674013972 678329766 683861196 689141870 693360329
3661 693360329 697174788 700400591 703088760 706571698 710487425 713255644 716785252 721154332 724303544
3679.4 724303544 726882637 729148746 730902791 733123541 736428559 739544451 741815448 743659854
3695.7 743659854 745236278 746755540 748681843 750530064 751536667 752074957 753093123 755168378
3712 755168378 757165849 758212328 758873761 759601772 760430753 761382341 762403131 763019979 763096511 763234615
3732.4 763234615 764170885 766013443 767361462 767161131 766722500 767764091 768839538 769080997 770227134
3750.7 770227134 771929562 772692084 772958636 773649752 774558783 774982452 775211632 775602341 776294112
3769.1 776294112 777245224 777869463 778033733 778191388 778687179 779241681 779591680 779972970 780380368 780738235
3789.5 780738235 780989647 780947089 780851066 780747175 780654132 781212628 781812131 782162368 782942235 783445716
3809.9 783445716 783151925 782673895 782666147 782674432 782782018 783672333 784389675 784654915 784741223 784540474
3830.3 784540474 784272909 784044087 784024417 784455121 785029888 785610437 786122799 786052287 785129666 783808768
3850.7 783808768 783744276 785490334 786492705 786361456 785977542 785870731 786029816 785822511 785614610
3869 785614610 786010444 786500812 786790431 786649227 786401927 786545813 786685467 786930740 787151337 787026942
3889.4 787026942 787166893 787463784 787221849 786599338 786127508 786125720 786696911 787504554 787962258 788047969
3909.8 788047969 787919939 787562609 787271917 787397087 787623584 787558019 787519336 787687302 787652552 787517309
3930.2 787517309 787758350 788111508 788147092 787978411 787829340 787858486 787966669 787997544 788094223 788289130
3950.6 788289130 788452208 788563788 788643956 788685262 788726032 788822770 788937867 789002240 789031625 789076865 789143085
3973.1 789143085 789258242 789426565 789582133 789704263 789811492 789896905 789912283 789911568 790028036 790208638
3993.4 790208638 790336668 790443659
3997.5 790443659
##END=$$ End of the data block
