##TITLE=$$ Begin of the data block
##JCAMP-DX=5.00 $$ ACD/SpecManager v 10.08
##SPECTROMETER/DATA SYSTEM=Alpha
##DATE=14 Apr 2014 11:23:48
##DATA TYPE=INFRARED SPECTRUM
##DATA CLASS=XYDATA
##ORIGIN=
##OWNER=
##NPOINTS=1765
##FIRSTX=399.75695801
##LASTX=3997.56933594
##MAXX=3997.56933594
##MINX=399.75695801
##MAXY=0.82937986
##MINY=0.20450413
##XFACTOR=1.0000000000
##YFACTOR=1.000000000000000e-9
##FIRSTY=0.54381049
##DELTAX=2.03957629
##XUNITS=1/CM
##YUNITS=ARBITRARY UNITS
##XYDATA=(X++(Y..Y))
399.8E43810487j000107l6418j338601j872838k59876K3127j352370j265049l72767
418.1E36335588p25925p80583K22445J10268j089334q83699j68383j226246j858950
436.5E29935181k92897L58760p21276n39064P80881L10897j130283q00073j65760j141250
456.9E26595116j358271q7976k75076j449048j087428l00228j289308k123475r10759
475.2E17713547l57032j300573j189113j68443o19352j413285m76420l0339j469255
493.6E10689735j891613p07686q84413k013147j217604j2398q82327j701355q00133
511.9E00579059o62625k021491k043933q34495j262337k267629j537263q38995j733631
530.3D87376660j969010q74251p79181j460255p67529J16170p48277j556396p52598
$$ plain form
399.8 543810487 542810380 542773962 541435361 539562523 539302647 539325774 537973404 536708355 536335588
418.1 536335588 535609663 534829080 535051525 535161793 534072459 533188760 533020377 531794131 529935181
436.5 529935181 529642284 530001044 529279768 528740704 529521585 529832482 528702199 527902126 527736366 526595116
456.9 526595116 525236845 525148869 524873793 523424745 522337317 522037089 520747781 518624306 517713547
475.2 517713547 517356515 516055942 514866829 514698386 514079034 512665749 512189329 512158990 510689735
493.6 510689735 508798122 508090436 507206023 505192876 503975272 503962874 503080547 501379192 500579059
511.9 500579059 499916434 497894943 495851010 495016515 493754178 491486549 489949286 489110291 487376660
530.3 487376660 485407650 484533399 483754218 482293963 481526434 481642604 480894327 479337931 478585333
548.6D78585333m27068j424312j630306r68665j302779k051085j795411j632512k651751
567D64701444l219456k444744k172172k822309k761484k129346k276331k517760j924395
585.4D42433447j581759k135038k252877j533478j457125k159238k335012k118170
601.7D26860750k372772k297252j152158j64092m26918o53267N73635K290190L176987
620D25835103L880799M539042M207433L709554M065752M360438L604948K909482K943039
638.4D60055590K229511O63996P22766K718091L515750K135366M59522l62098Q48860
656.7D72987354M410833P114470O278962L659606L565639N700260L715516K281785
673.1E09714425L186524L609597K821505K393246K860129K750337J966119J946807
$$ plain form
548.6 478585333 478158265 476733953 475103647 474134982 472832203 470781118 468985707 467353195 464701444
567 464701444 461481988 459037244 456865072 454042763 451281279 449151933 446875602 444357842 442433447
585.4 442433447 440851688 438716650 436463773 434930295 433473170 431313932 428978920 426860750
601.7 426860750 424487978 422190726 421038568 420874476 420447558 419794291 420367926 422658116 425835103
620 425835103 429715902 434254944 438462377 442171931 446237683 450598121 454203069 457112551 460055590
638.4 460055590 462285101 462949097 463671863 466389954 469905704 472041070 472500592 472138494 472987354
656.7 472987354 477398187 484512657 490791619 494451225 498016864 503717124 507432640 509714425
673.1 509714425 512900949 516510546 519332051 521725297 524585426 527335763 529301882 531248689
689.4E31248689K268195J506328O80030J042962J357615Q17001Q91208J930714K333224
707.7E44075966K007186K313912K973736K758801K371132K894103L294170K745331
724E65434337K511859K957999K817393K064049J960516K247155J873016J487374J824618
742.4E85178316K115845J754523J608908K028167K013326J530885J644612K131522
758.7F00006104J906991J433908J669229J963019J446903R05811Q75652N09799m11749
777.1F10305667r67383r70185j212240j459538p93696M06444J323402K446234M192472
795.4F13271177N663752O198347O425679O665706O168843M994094M142880L596008
811.7F57126486K564252J417994P91669j7822j599967l023625l709018m487395n470097
$$ plain form
689.4 531248689 533516884 535023212 535703242 536746204 538103819 538920820 539812028 541742742 544075966
707.7 544075966 546083152 548397064 551370800 554129601 556500733 559394836 562689006 565434337
724 565434337 567946196 570904195 573721588 575785637 577746153 579993308 581866324 583353698 585178316
742.4 585178316 587294161 589048684 590657592 592685759 594699085 596229970 597874582 600006104
758.7 600006104 601913095 603347003 605016232 606979251 608426154 609331965 610207617 610717416 610305667
777.1 610305667 609338284 608368099 607155859 605696321 604902625 605309069 606632471 609078705 613271177
795.4 613271177 618934929 625133276 631558955 638224661 644393504 649387598 653530478 657126486
811.7 657126486 659690738 661108732 661900401 661882579 660282612 657258987 653549969 649062574 643592477
830.1F43592477n735874n363882n276799n269230m669070l983378l691018k941429
846.4F06661797j095057J200676L400564N775988Q198440R719789J0176719J0449230
862.7F54488146J0538400R677827Q328080P362664O235659M487216L075183K296626
879.1G06489801J061321n82874j520872j917303k595663l127038k574861j398147o10888
897.4F93223476J44542J335203J938343J485587J068294P94172m48644k293051l383159
915.8F93864763l943622m727125m942894l815353k356828j464247m31955Q32200J129508
934.1F74144447O15001O18875Q98182M01080l18885m67122j011550k609253m064500
952.5F68206275m971982o472766q489191r921611j1181414j3201356j5187085j6142666
$$ plain form
830.1 643592477 637856603 632492721 627215922 621946692 617277622 613294244 609603226 606661797
846.4 606661797 605566740 606767416 610167980 615943968 624142408 633862197 644038916 654488146
862.7 654488146 665026546 674704373 683032453 690395117 696630776 701117992 704193175 706489801
879.1 706489801 707551122 706968248 705447376 703530073 700934410 697807372 695232511 693834364 693223476
897.4 693223476 693368018 694703221 696641564 698127151 699195445 699989617 699540973 697247922 693864763
915.8 693864763 689921141 685194016 680251122 676435769 674078941 672614694 672182739 673014939 674144447
934.1 674144447 674759448 675378323 676276505 676677585 676358700 675891578 674880028 672270775 668206275
952.5 668206275 663234293 656761527 648272336 638350725 627169311 613967955 598780870 582638204
968.8E82638204j6624808j6847968j5820563j3662398j1814356j0559618r152085p869840
985.1D80286568p272541o704867n536914m427135l881454l288687k428412j999974
1001.4D44746584k204687k550572l122896m307806n531460o037236o131708o224573
1017.7D08635646n969733n295366m851937m784942m520208m065513l896892l846795
1034.1C71404260l468275k969741k751738k640099k394855k329886k520710k394318
1050.4C49934638j720548q05140K85536J612962K602845K587229J721710M85569j070767
1068.7C55634034k701164l625214l623992l325254l154367k899200k663821k947747
1085C30693275l569842l891170l730118l090292j885802l74883Q92430J573921J850605
$$ plain form
968.8 582638204 566013396 549165428 533344865 519682467 507868111 497308493 488156408 480286568
985.1 480286568 473014027 466309160 460772246 456345111 452463657 449174970 446746558 444746584
1001.4 444746584 442541897 439991325 436868429 432560623 427029163 420991927 414860219 408635646
1017.7 408635646 402665913 397370547 392518610 387733668 383213460 379147947 375251055 371404260
1034.1 371404260 367935985 364966244 362214506 359574407 357179552 354849666 352328956 349934638
1050.4 349934638 348214090 347408950 347694486 349307448 351910293 354497522 356219232 356704801 355634034
1068.7 355634034 352932870 349307656 345683664 342358410 339204043 336304843 333641022 330693275
1085 330693275 327123433 323232263 319502145 316411853 314526051 314151168 315043598 316617519 318468124
1103.4C18468124J944065J721978J172513N44935k62528j602620l374309m993081n545169
1121.8C08073908m100531j234770R62615J512825Q92938J72525M85331J661271K701938
1140.1C11128050L137708K984792K443254J972526J863957J961737K171219K649933
1156.4C30313176L458887M430503N533218O871015Q203268R108544R555667R730339
1172.7C87204617R573818R034186Q423388P827759O833970N334706L660589J910388
1189.1D39803421J13339j262367j728952j363516n13613O74665J921624K658516K667338
1207.4D42970455K252280J653970Q96960K63661J10627K35706K65986L59833P69436
1225.8D49778914J243204J550615J910836K403110K736568K828360K890915K903372
$$ plain form
1103.4 318468124 320412189 322134167 323306680 323851615 323589087 321986467 318612158 313619077 308073908
1121.8 308073908 303973377 302738607 303701222 305214047 306106985 306279510 306764841 308426112 311128050
1140.1 311128050 314265758 317250550 319693804 321666330 323530287 325492024 327663243 330313176
1156.4 330313176 333772063 338202566 343735784 350606799 358810067 367918611 377474278 387204617
1172.7 387204617 396778435 405812621 414236009 422063768 428897738 434232444 437893033 439803421
1189.1 439803421 439916760 438654393 436925441 435561925 435048312 435722977 437644601 440303117 442970455
1207.4 442970455 445222735 446876705 447773665 448037326 448147953 448383659 448649645 449009478 449778914
1225.8 449778914 451022118 452572733 454483569 456886679 459623247 462451607 465342522 468245894
1242.1D68245894K630055K164930J777410J375139Q67397N69999O77496R63271J355141
1260.4D80626732K023220K821893L457814M009664M715353N338550N599320N830586
1276.8E14423132O235719O498575O538689O705046P047891P147134O913185O655812
1293.1E68165183O310701N699337N090535M693210M269600L685295L211975K906621
1309.4F04032457K476752J962959J669407J625598J579821J479626J524031J566469
1325.7F17917120J343847J037597P83563L39449k00630k96294R6261K67565J29581
1344.1F21418059K28405M44412L30567r775j98543m23908r85026j473964j499295j569927
1364.5F16261005j963138k008498j706421j618803j621783j670897k433776m167974
$$ plain form
1242.1 468245894 470875949 473040879 474818289 476193428 477060825 477630824 478308320 479271591 480626732
1260.4 480626732 482649952 485471845 488929659 492939323 497654676 502993226 508592546 514423132
1276.8 514423132 520658851 527157426 533696115 540401161 547449052 554596186 561509371 568165183
1293.1 568165183 574475884 580175221 585265756 589958966 594228566 597913861 601125836 604032457
1309.4 604032457 606509209 608472168 610141575 611767173 613346994 614826620 616350651 617917120
1325.7 617917120 619260967 620298564 621082127 621421576 621220946 620924652 621020913 621288478 621418059
1344.1 621418059 621646464 622090876 622421443 622411668 622213125 621789217 620804191 619330227 617830932 616261005
1364.5 616261005 614297867 612289369 610582948 608964145 607342362 605671465 603237689 599069715
1380.8E99069715n132616l190100J55687J239479Q1360p64728j125693j658618k071381
1399.1E86603105k417862k999068l259182k969980k755940k697587k468109k191186
1415.5E64844191j861393j166881p11619n72265m91261n78046l35216j01567l22461
1433.8E58703482K97427J592279J517117J218200J460194J973868K701640L148734
1450.1E72612941L225863L578663O133795R489655Q233726O736160P688761Q507251
1466.4F26206815P623852P687330R930134J0568022Q563519O476343M945695L841162
1482.8F85842872K271235N89668k02715n51581j755119l185868l719091l697753m373134
1501.1F71218514n441129o505608o963969n974829n636990n828619n669772n014539
$$ plain form
1380.8 599069715 593937099 590746999 590902686 592142165 592223525 591458797 590333104 588674486 586603105
1399.1 586603105 584185243 581186175 577926993 574957013 572201073 569503486 567035377 564844191
1415.5 564844191 562982798 561815917 561104298 560532033 560040772 559462726 559127510 559025943 558703482
1433.8 558703482 559000909 560593188 562110305 563328505 564788699 566762567 569464207 572612941
1450.1 572612941 575838804 579417467 585551262 595040917 603274643 610010803 617699564 626206815
1466.4 626206815 633830667 641517997 651448131 662016153 670579672 677056015 682001710 685842872
1482.8 685842872 688114107 688703775 688501060 687949479 686194360 683008492 679289401 675591648 671218514
1501.1 671218514 665777385 659271777 652307808 646332979 640695989 634867370 629197598 624183059
1517.4F24183059l982425l151655k903462k932787k691745k628744k861440k611697
1533.7F00419104k391159k616525j975835n18560L1591k0802j04666L14832P46846
1552.1E93884826M92394l1650J241922L029764Q73863p63535j207829j805007k439320
1570.5E93275428l212631m126906m970908n274356n597711o352663p079720p541835
1586.8E49118698p748545q112490q431911q411527q248925q373231q524537q321285
1603.1D82946247q114338q212656q304536q097887p933438q187741q259893p021069
1619.4D18814689o481707o709606o148278n391062m869371m229665l445119k189308
1635.7C79350573p44790R54O38097J242936K663374L936797L012091M104167P663042
$$ plain form
1517.4 624183059 620200634 617048979 614145517 611212730 608520985 605892241 603030801 600419104
1533.7 600419104 598027945 595411420 593435585 592917025 592948616 592927814 592823148 593137980 593884826
1552.1 593884826 594377220 594345570 595587492 598617256 599491119 598727584 597519755 595714748 593275428
1570.5 593275428 590062797 585935891 580964983 575690627 570092916 563740253 556660533 549118698
1586.8 549118698 541370153 533257663 524825752 516414225 508165300 499792069 491267532 482946247
1603.1 482946247 474831909 466619253 458314717 450216830 442283392 434095651 425835758 418814689
1619.4 418814689 412332982 405623376 399475098 394084036 389214665 384985000 381539881 379350573
1635.7 379350573 378605783 378606737 379244834 380487770 383151144 387087941 390100032 394204199 401867241
1654.1D01867241O207466M643947N349725O841898P590681O638319P208526Q885473
1670.4D55233276Q322507Q697718R834469Q750438P703513Q972735J2775540J1988044
1686.7E32278240R418189R318590Q454740R445489J1048078J1734903J4528752J2462914
1703F18689895J0101854J0367454R071946P530927O376148O036698P447064P489682
1719.3F83111668N428016M706859M859209M346908L707289L449798M915655N581438
1735.7G20106840L945589M128099M848838M421770M089117M194439M693210M877746
1752G55305648M045963L570497L343225K830326L049195K919316K013982J576543J777589
1770.3G80432284K406299K474964J875162J701593J694739J543880J640796J692534
$$ plain form
1654.1 401867241 408074707 412718654 418068379 424910277 432500958 439139277 446347803 455233276
1670.4 455233276 463555783 472253501 482087970 490838408 498541921 507514656 520290196 532278240
1686.7 532278240 541696429 551015019 559469759 568915248 579963326 591698229 606226981 618689895
1703 618689895 628791749 639159203 648231149 655762076 662138224 668174922 675621986 683111668
1719.3 683111668 688539684 693246543 698105752 702452660 706159949 709609747 714525402 720106840
1735.7 720106840 724052429 728180528 733029366 737451136 741540253 745734692 750427902 755305648
1752 755305648 759351611 762922108 766265333 769095659 772144854 775064170 777078152 778654695 780432284
1770.3 780432284 782838583 785313547 787188709 788890302 790585041 792128921 793769717 795462251
1786.7G95462251J085520P65085J573264J849890J147926Q89182J314998J448512J046955
1805H06583583Q48890R39667R43720Q36432Q71599Q96335O94453M66168N16951O41346
1825.4H14239144M63486O06835J107335Q90791M42148N59985N68033P1346J22309Q93176
1845.8H19964588R55879N14150M27365N80907M48227J95086L48389M96805J46449j91391
1866.2H23886454K03431P46250N37157K94208M07398L17514Q6308J91450L46780Q8274
1886.6H27105224p8738K81513M09901J16289R2208K94507K22385j4365L0637J90198
1907H28649759R9659K3604J24156L0935j61529l1232J80780J97888R4592O0142J11103
1929.4H29379857k1995j81138p7724J8835j80185k91646m2200N7221j39535j93715
$$ plain form
1786.7 795462251 796547771 797312856 798886120 800736010 801883936 802773118 804088116 805536628 806583583
1805 806583583 807432473 808372140 809315860 810152292 811023891 811920226 812614679 813080847 813597798 814239144
1825.4 814239144 814702630 815309465 816416800 817307591 817749739 818309724 818877757 818949103 819071412 819964588
1845.8 819964588 820920467 821434617 821861982 822442889 822891116 823086202 823434591 823931396 824077845 823886454
1866.2 823886454 824089885 824836135 825373292 825667500 826074898 826392412 826478720 826670170 827016950 827105224
1886.6 827105224 827026486 827307999 827717900 827834189 827926397 828220904 828443289 828428924 828459561 828649759
1907 828649759 828749418 828773022 828897178 828928113 828766584 828735352 828916132 829114020 829208612 829268754 829379857
1929.4 829379857 829357862 829176724 829099000 829117835 828937650 828646004 828603804 828661025 828521490 828327775
1949.8H28327775p0274q8870k14041j92165j13785k24352l43442j96755r835r1791
1970.2H26782465j94252j14262j23799k36749j93775n2810j10149k96116l13282k01106
1990.6H24946165j54793j57058j01805j01626k32816k89976k00868k20835l37601k90036
2011H22858751j87755k83062l81291k47836j58787k93851l76523k19285j36554k84851
2031.4H20288956l34203k28643k57075l72172k64704q3506j73807l26514j99855q4340
2051.8H17964137k32280l02136j43528r3460k25544k04861n0545q6605j87040n9843
2072.2H16378295L2545j38641k27868o6817k6345j93596j81914O318j6093j80244r5308
2094.6H15290332M6611o3479j30534K9504O8426r7036r0480P0989M5001r6678m3810
$$ plain form
1949.8 828327775 828257501 828168631 827954590 827762425 827648640 827424288 827080846 826884091 826874256 826782465
1970.2 826782465 826588213 826473951 826350152 826113403 825919628 825866818 825756669 825460553 825147271 824946165
1990.6 824946165 824791372 824634314 824532509 824430883 824198067 823908091 823707223 823486388 823148787 822858751
2011 822858751 822670996 822387934 822006643 821758807 821600020 821306169 820929646 820710361 820573807 820288956
2031.4 820288956 819954753 819726110 819469035 819096863 818832159 818748653 818574846 818248332 818048477 817964137
2051.8 817964137 817731857 817429721 817286193 817192733 816967189 816762328 816711783 816625178 816438138 816378295
2072.2 816378295 816410840 816272199 816044331 815977514 815951169 815757573 815575659 815581977 815565884 815385640 815290332
2094.6 815290332 815336943 815273464 815142930 815172434 815240860 815143824 815053344 815124333 815169334 815072656 815028846
2117.1H15028846R3699M0710l3140R9539J75655L2425k742J37866J51753K1160M0591
2139.5H15786362J83224J44780L6001J35303K30729R9481K1874J72615K43187J13011
2159.9H17166567J01745K26676J84894P0274J60694K82764J85729R3460J87933K30849
2180.3H18891585J31845J18673J78874J10030J8716J07109K06948J09076J1861R0540
2200.7H19975257J35243L6776J7583J21594J10507j610K4200J05023K7180n2571K8193
2223.1H20527375Q4638J1981j7524M9710K2710q2731n0366M7206J789q0169k8312J3709
2247.6H20500016r1016j50323m4167P75q8215p3075L9100J8299n7101l636N5492M053
2272.1H20110202j1087Q7321J29461N1141L5823J21057J01268k0087j4245R1016Q3446
$$ plain form
2117.1 815028846 815122545 815163255 815130115 815229654 815405309 815437734 815434992 815572858 815724611 815745771 815786362
2139.5 815786362 815969586 816114366 816150367 816285670 816516399 816615880 816637754 816810369 817053556 817166567
2159.9 817166567 817268312 817494988 817679882 817750156 817910850 818193614 818379343 818472803 818660736 818891585
2180.3 818891585 819023430 819142103 819320977 819431007 819449723 819556832 819763780 819872856 819884717 819975257
2200.7 819975257 820110500 820147276 820164859 820286453 820396960 820395350 820419550 820524573 820551753 820499182 820527375
2223.1 820527375 820612013 820623994 820606470 820656180 820678890 820596159 820545793 820592999 820594788 820514619 820486307 820500016
2247.6 820500016 820409000 820258677 820214510 820215285 820127070 820053995 820093095 820111394 820054293 820050657 820106149 820110202
2272.1 820110202 820099115 820186436 820315897 820367038 820402861 820523918 820625186 820605099 820590854 820681870 820765316
2294.5H20765316J0431L9339P4923J0789j4186N6803N8949J8954Q8394J35422M3511
2316.9H21288645o914J37389K76208J59323L6836J92642K91943J19567N4300J64211
2337.3H22714150J54555J20163L35574M39763p5340n50449l45290K00689M04060M06384
2357.7H23804259L88980K82288K50757K66850J95503J68979K50518L11792K38240J05023
2378.1H26263189R3520J34766Q7142M1127Q1659R7453M0591J8120P1168Q0883J6451
2400.6H27026069J1981M9650Q94p7068o1870j6093l8088o4611n5969q6129j48654j67191
2425H26372921j13666p4565j04964j08003o4552o6996j17004j11043q7202j45435j79947
2447.5H25199544j26183j17957j85609j85013j24395j25706j68145j73211j53124j57833
$$ plain form
2294.5 820765316 820775747 820815086 820890009 820900798 820886612 820943415 821002364 821021318 821109712 821245134 821288645
2316.9 821288645 821281731 821419120 821695328 821854651 821891487 822084129 822376072 822495639 822549939 822714150
2337.3 822714150 822868705 822988868 823324442 823764205 823688865 823138416 822793126 822993815 823397875 823804259
2357.7 823804259 824193239 824475527 824726284 824993134 825188637 825357616 825608134 825919926 826158166 826263189
2378.1 826263189 826356709 826491475 826578617 826619744 826701403 826798856 826839447 826857567 826928735 827009618 827026069
2400.6 827026069 827038050 827087700 827088594 827011526 826949656 826933563 826895475 826830864 826774895 826688766 826540112 826372921
2425 826372921 826259255 826184690 826079726 825971723 825907171 825840175 825723171 825612128 825524926 825379491 825199544
2447.5 825199544 825073361 824955404 824769795 824584782 824460387 824334681 824166536 823993325 823840201 823682368
2467.9H23682368j80185j97232j94192j96933k21909k07662j83940j97768j80066j51038
2488.3H21771443j91510k29895j76609j19090j54554j97828j80185j69039k03490k12908
2508.7H19936335j53422j32680j89185k09391j85371j97053k16901j91689j64211j76250
2529H18120182j94967j83046j91212k37644k34842j93834k00629k18988j86384j67310
2549.4H16111326k12610k41935k05636j95384k43664k61545k47538k65300k93851k87235
2569.8H13656628k80976l28660l58641l23415l46661m26233m20272l68118l95477m63009
2590.2H09945166m53055m09305m46021n20528n22435n11944n52654n65887n37753n44846
2610.6H04880738n82158n72384n60879n96703o13152n80967n85437o58154o72639n98132
$$ plain form
2467.9 823682368 823502183 823304951 823110759 822913826 822691917 822484255 822300315 822102547 821922481 821771443
2488.3 821771443 821579933 821350038 821173429 821054339 820899785 820701957 820521772 820352733 820149243 819936335
2508.7 819936335 819782913 819650233 819461048 819251657 819066286 818869233 818652332 818460643 818296432 818120182
2529 818120182 817925215 817742169 817550957 817313313 817078471 816884637 816684008 816465020 816278636 816111326
2549.4 816111326 815898716 815656781 815451145 815255761 815012097 814750552 814503014 814237714 813943863 813656628
2569.8 813656628 813375652 813046992 812688351 812364936 812018275 811592042 811171770 810803652 810408175 809945166
2590.2 809945166 809492111 809082806 808636785 808116257 807593822 807081878 806529224 805963337 805425584 804880738
2610.6 804880738 804298580 803726196 803165317 802568614 801955462 801374495 800789058 800130904 799458265 798860133
2631G98860133n48959n74112n95629n80967n84960n80072n36084n19216n65172n99861
2651.4G93175101n59509n43177n94377n58973m67419m87149n37276n21064n23508n65707
2671.8G87816942n78463n45562n39124n76138n66662n47170n98192o35505n88119n55098
2692.2G82086909n99146o23345o12498o51836o97434o85454o63518o70433o77884o56247
2712.6G75549114o72043p38501p38263o78301o69778o93917o89506o97315p10785o64413
2733G68596292o06478o31094o97314o88017o31571o33359o61671o63698o88254p22230
2753.4G61972606p15315p04765p37548p90954p92503p56860p86305q59201q77320q65817
2773.8G54086018q96156r39846r41336r59695j013934j013756r89735j039386j112163
$$ plain form
2631 798860133 798311174 797737062 797141433 796560466 795975506 795395434 794859350 794340134 793774962 793175101
2651.4 793175101 792615592 792072415 791478038 790919065 790451646 789964497 789427221 788906157 788382649 787816942
2671.8 787816942 787238479 786692917 786153793 785577655 785010993 784463823 783865631 783230126 782642007 782086909
2692.2 782086909 781487763 780864418 780251920 779600084 778902650 778217196 777553678 776883245 776205361 775549114
2712.6 775549114 774877071 774138570 773400307 772722006 772052228 771358311 770668805 769971490 769260705 768596292
2733 768596292 767989814 767358720 766661406 765973389 765341818 764708459 764046788 763383090 762694836 761972606
2753.4 761972606 761257291 760552526 759814978 759024024 758231521 757474661 756688356 755829155 754951835 754086018
2773.8 754086018 753189862 752250016 751308680 750348985 749335051 748321295 747331560 746292174 745180011
2792.2G45180011j129389j146317j205265j259506j263082j266360j319945j364827
2808.5G35225320j392901j445055j490414j499951j534641j620352j671612j673520
2824.8G22896874j727462j864314j999021k117872k321422k623737l021836l588617
2841.1G03632593m252434m856824n136252m693091l578067k379775j563370j194119
2857.4F75978661j199961j489163j948416k449572k830088k958596k821028k551675
2873.7F57730162k240062j894533j664043j640796j688302j776457j939714k073168
2890.1F42813087k139152k202332k277553k337873k403736k500713k651095k856255
2906.4F23444378l114819l538668m055858m330099m176557l666341k983987k279342
$$ plain form
2792.2 745180011 744050622 742904305 741699040 740439534 739176452 737910092 736590147 735225320
2808.5 735225320 733832419 732387364 730896950 729396999 727862358 726242006 724570394 722896874
2824.8 722896874 721169412 719305098 717306077 715188205 712866783 710243046 707221210 703632593
2841.1 703632593 699380159 694523335 689387083 684693992 681115925 678736150 677172780 675978661
2857.4 675978661 674778700 673289537 671341121 668891549 666061461 663102865 660281837 657730162
2873.7 657730162 655490100 653595567 651931524 650290728 648602426 646825969 644886255 642813087
2890.1 642813087 640673935 638471603 636194050 633856177 631452441 628951728 626300633 623444378
2906.4 623444378 620329559 616790891 612735033 608404934 604228377 600562036 597578049 595298707
2922.7E95298707j627326j028418m86255n9306L68535R49264J591503K156198K567709
2941E99730611K768755K646804K141356J514316J064121P19250M42445L93689N55038
2959.4F11976385P78914R03487R50754R99331R38356Q65698R27269R87411J034558
2977.8F20362163J129388J151443J088321J021028R63032R28998P88212M47333J21593
2996.1F28001511j24156l91961n93125p28250q43763q60870q77917j065850j317203
3014.5F21198416j484692j616836j705766j743912j858235j981735j958668j882017
3030.8F06966555j893461k023339k152800k128840k081037k171516k317071k397835
3047.1E89800656k377451k364993k409458k394676k369881k394855k377689k291977
$$ plain form
2922.7 595298707 593671381 592642963 592156708 592097402 592465937 593415201 595006704 597162902 599730611
2941 599730611 602499366 605146170 607287526 608801842 609865963 610585213 611027658 611421347 611976385
2959.4 611976385 612755299 613658786 614609540 615608871 616547227 617412925 618340194 619327605 620362163
2977.8 620362163 621491551 622642994 623731315 624752343 625715375 626644373 627432585 627879918 628001511
2996.1 628001511 627877355 627485394 626892269 626164019 625320256 624459386 623581469 622515619 621198416
3014.5 621198416 619713724 618096888 616391122 614647210 612788975 610807240 608848572 606966555
3030.8 606966555 605073094 603049755 600896955 598768115 596687078 594515562 592198491 589800656
3047.1 589800656 587423205 585058212 582648754 580254078 577884197 575489342 573111653 570819676
3063.4E70819676k189517k143502k183020k221942k206922k172530k138018k183438
3079.7E53380787k287447k309382k299130k284706k253294k333879k452254k418459
3096E34742236k322137k357066k493381k562106k534092k516925k585769k629160k571404
3114.4E12170196k592147k761602k932847l007769k987028k916902k891540k942711
3130.7D89137650k987832l003508l013343l052473l168166l236949l204435l197521
3147D64273423l165215l112525l223181l399163l402800l332019l330737l326595l305018
3165.4D34676170l313869l332972l306240l283233l353297l392280l299802l243834
3181.7D08150643l280729l289729l231228l158539l164530l209859l184706l150165
$$ plain form
3063.4 570819676 568630159 566486657 564303637 562081695 559874773 557702243 555564225 553380787
3079.7 553380787 551093340 548783958 546484828 544200122 541946828 539612949 537160695 534742236
3096 534742236 532420099 530063033 527569652 525007546 522473454 519956529 517370760 514741600 512170196
3114.4 512170196 509578049 506816447 503883600 500875831 497888803 494971901 492080361 489137650
3130.7 489137650 486149818 483146310 480132967 477080494 473912328 470675379 467470944 464273423
3147 464273423 461108208 457995683 454772502 451373339 447970539 444638520 441307783 437981188 434676170
3165.4 434676170 431362301 428029329 424723089 421439856 418086559 414694279 411394477 408150643
3181.7 408150643 404869914 401580185 398348957 395190418 392025888 388816029 385631323 382481158
3198C82481158l151864l105909l037125l011047k966911k895623k889902k897829k839237
3216.4C55685711k769768k733022k739281k721280k649068k597005k532094k451331
3232.7C34492862k477735k517849k441287k352119k290278k239019k232134k256573
3249C15685868k219051k095669k031088k069891k084821k038092j980662j957864j948177
3267.4B97260553j892329j876801j924842j925558j868695j816839j822830j860529
3283.7B82272130j834273j743168j680642j682848j732170j781375j777351j739174
3300B68301129j706123j661360j658917j747936j838863j875549j823038j724750j699328
3318.4B52565265j705498j657933j622930j703098j768709j719638j666218j575962
$$ plain form
3198 382481158 379329294 376223385 373186260 370175213 367208302 364312679 361422777 358524948 355685711
3216.4 355685711 352915943 350182921 347443640 344722360 342073292 339476287 336944193 334492862
3232.7 334492862 332015127 329497278 327055991 324703872 322413594 320174575 317942441 315685868
3249 315685868 313466817 311371148 309340060 307270169 305185348 303147256 301166594 299208730 297260553
3267.4 297260553 295368224 293491423 291566581 289641023 287772328 285955489 284132659 282272130
3283.7 282272130 280437857 278694689 277014047 275331199 273599029 271817654 270040303 268301129
3300 268301129 266595006 264933646 263274729 261526793 259687930 257812381 255989343 254264593 252565265
3318.4 252565265 250859767 249201834 247578904 245875806 244107097 242387459 240721241 239145279
3334.7B39145279j460418j499817j637742j662090j626730j566351j433417j448944
3351B26809770j594097j592487j481056j379549j305342j266301j186028j109019j180008
3369.3B14715883j353070j358643j111716q97333q51721q63716p81238o03214l89144
3387.7B06506088j96710k32711m57555m57794j04785J49012n9888l74064k67461M9219
3408.1B04553351J95607K09585J81943J75298K88680M29421M96150O07848P80165R40457
3428.5B08858505J000211J060396J153767J025394P92235Q59141J116559J310080J489371
3446.8B18665659J530454J527295J655936J775771J862586J959696J936749J911655
3463.2B32825801K147764K411604K261996J859322J833573K117083K327561K407193
$$ plain form
3334.7 239145279 237684861 236185044 234547302 232885212 231258482 229692131 228258714 226809770
3351 226809770 225215673 223623186 222142130 220762581 219457239 218190938 217004910 215895891 214715883
3369.3 214715883 213362813 212004170 210892454 209995121 209143400 208279684 207498446 206895232 206506088
3387.7 206506088 206309378 206076667 205619112 205161318 205056533 205205545 205145657 204771593 204504132 204553351
3408.1 204553351 204748958 204958543 205140486 205315784 205604464 206033885 206530035 207137883 207918048 208858505
3428.5 208858505 209858716 210919112 212072879 213098273 213890508 214749649 215866208 217176288 218665659
3446.8 218665659 220196113 221723408 223379344 225155115 227017701 228977397 230914146 232825801
3463.2 232825801 234973565 237385169 239647165 241506487 243340060 245457143 247784704 250191897
3479.5B50191897K364814K368540K522439K582758K501995K541572K696365K829283
3495.8B70599663K799869K780169K954453K928645K668142K766013L143072L329456
3512.1B93969482L258109L123701L169566L367663L632009L666222L481865L544271
3528.4C21212888L744155L814846L945887M064888L936142L935724M237026M552603
3544.7C53444159M506201M199802M297913M669368M677415M609167M806817M852682
3561.1C90063524M526884M725784N945861O256193N407035N223096N609393N857915
3577.4D33615685N983412N919635N647570N963981P038623P029146O032974O163746
3593.7D83394772O873011O975055O984204O962836O393552O148398P007181P470608
$$ plain form
3479.5 250191897 252556711 254925251 257447690 260030448 262532443 265074015 267770380 270599663
3495.8 270599663 273399532 276179701 279134154 282062799 284730941 287496954 290640026 293969482
3512.1 293969482 297227591 300351292 303520858 306888521 310520530 314186752 317668617 321212888
3528.4 321212888 324957043 328771889 332717776 336782664 340718806 344654530 348891556 353444159
3544.7 353444159 357950360 362150162 366448075 371117443 375794858 380404025 385210842 390063524
3561.1 390063524 394590408 399316192 405262053 411518246 416925281 422148377 427757770 433615685
3577.4 433615685 439599097 445518732 451166302 457130283 464168906 471198052 477231026 483394772
3593.7 483394772 490267783 497242838 504227042 511189878 517583430 523731828 530739009 538209617
3610E38209617P135451O887495O502986P231713Q337199P117272N231738N108178P844984
3628.4E99606633R198070O790995N938411O252289O167293O022453N406976M374682
3644.7F49757802M557372O923198P757724N212783M301787N548715N317390M233242
3661F93610013L799498L197908K689302L537774L962338K765894L553033M410267L117799
3679.4G24643826K505839K193392J708090K249837L376245L122569K242863J853049
3695.7G43895710J591384J509607J892328J820326J019060N51761J024007K073050
3712G55377233J980603J068592O77049O98566Q12471R46761J038908O49870P1704J41442
3732.4G63463199R74715J842022J327932j82808m31776J019359J044690J82510J120925
$$ plain form
3610 538209617 545345068 552232563 558735549 565967262 574304461 581421733 586653471 591761649 599606633
3628.4 599606633 608804703 615595698 621534109 627786398 633953691 639976144 645383120 649757802
3644.7 649757802 654315174 661238372 668996096 674208879 678510666 684059381 689376771 693610013
3661 693610013 697409511 700607419 703296721 706834495 710796833 713562727 717115760 721526027 724643826
3679.4 724643826 727149665 729343057 731051147 733300984 736677229 739799798 742042661 743895710
3695.7 743895710 745487094 746996701 748889029 750709355 751728415 752280176 753304183 755377233
3712 755377233 757357836 758426428 759103477 759802043 760614514 761561275 762600183 763250053 763321757 763463199
3732.4 763463199 764437914 766279936 767607868 767425060 766993284 768012643 769057333 769239843 770360768
3750.7G70360768J760542Q20697K89440P19785R61483M73857K17736K97784O27876
3769.1G76529968R85205O81221J72437J33395M88996N50330L24190L87251M79341M06384
3789.5G81138718J77682j57416j40906j13845q0466O04510O28531L75271Q27432N31077
3809.9G83790588k97963m69208K8789J5616R6858R02236O47425J18673L9041j21832
3830.3G84750223j84595j87159j5676L77834M63247M82202N31852L0875q76129j377403
3850.7G83995271j47701J781524J127898m0531l69191j48296J26183j90795j57654
3869G85976708M23849M63604K39552j55926k14100J25945R1731K73109K26318j71840
3889.4G87278950J43886L54290k16603o51837n29945n2213N78403Q48353N04553Q9407
$$ plain form
3750.7 770360768 772121310 772942007 773231447 773951232 774912715 775386572 775604308 775902092 776529968
3769.1 776529968 777515173 778196394 778368831 778502226 778991222 779541552 779865742 780252993 780732334 781138718
3789.5 781138718 781316400 781158984 781018078 780904233 780823767 781428277 782056808 782432079 783259511 783790588
3809.9 783790588 783492625 783023417 783052206 783067822 783164680 784066916 784714341 784833014 784872055 784750223
3830.3 784750223 784565628 784378469 784362793 784740627 785203874 785686076 786217928 786248803 785372674 783995271
3850.7 783995271 783847570 785629094 786756992 786716461 786347270 786198974 786325157 786134362 785976708
3869 785976708 786400557 786864161 787103713 786947787 786733687 786859632 786951363 787224472 787450790 787278950
3889.4 787278950 787422836 787777126 787560523 786908686 786378741 786326528 786904931 787753284 788257837 788347244
3909.8G88347244k00152l93927k59519J26243K14219j848K1935J16765p9572j04606
3930.2G87786782K29835L31343Q8930r2090j23739O378J02222p331j5021J08123J50919
3952.7G88566351J36495J04904P3075J11759J71900J14977J7345J7643O9618R2268
3973.1G89476335J02341J04964R4891J24037J55806Q6010l2902k6703J18435K01165
3993.4G90404379J34409J17421
3997.5G90656209
$$ plain form
3909.8 788347244 788147092 787753165 787493646 787619889 787834108 787832260 787854195 787970960 787891388 787786782
3930.2 787786782 788016617 788347960 788436890 788344800 788221061 788227439 788329661 788322330 788307309 788415432 788566351
3952.7 788566351 788702846 788807750 788880825 788992584 789164484 789279461 789296806 789314449 789384067 789476335
3973.1 789476335 789578676 789683640 789778531 789902568 790058374 790144384 790111482 790084779 790203214 790404379
3993.4 790404379 790538788 790656209
3997.5 790656209
##END=$$ End of the data block
