##TITLE=$$ Begin of the data block
##JCAMP-DX=5.00 $$ ACD/SpecManager v 10.08
##SPECTROMETER/DATA SYSTEM=Alpha
##DATE=14 Apr 2014 11:23:48
##DATA TYPE=INFRARED SPECTRUM
##DATA CLASS=XYDATA
##ORIGIN=
##OWNER=
##NPOINTS=1765
##FIRSTX=399.75695801
##LASTX=3997.56933594
##MAXX=3997.56933594
##MINX=399.75695801
##MAXY=0.82967460
##MINY=0.20524047
##XFACTOR=1.0000000000
##YFACTOR=1.000000000000000e-9
##FIRSTY=0.54414243
##DELTAX=2.03957629
##XUNITS=1/CM
##YUNITS=ARBITRARY UNITS
##XYDATA=(X++(Y..Y))
$$ plain form
399.8 544142425 543551505 543436706 542039335 539987445 539158881 538584113 537114441 536083519 536127210
418.1 536127210 535835147 535280526 535634875 535694599 534251332 533164620 533323705 532352626 530220926
436.5 530220926 529623389 530062020 529688656 529280841 529615939 529405117 528301656 527947903 528181434 527037442
456.9 527037442 525326669 525070548 524905801 523579717 522580266 522264540 521031737 519143999 518261552
475.2 518261552 517661333 516025722 514639616 514648378 514312744 512828052 512036681 511789203 510319233
493.6 510319233 508665025 508269548 507573962 505634725 504434109 504363000 503343821 501496673 500550866
511.9 500550866 499807090 497885287 496028692 495289475 493976176 491644293 490137041 489288807 487423539
530.3 487423539 485282779 484351873 483720303 482385814 481446147 481318533 480601579 479167163 478390127
$$ packed form
399.8E44142425n90920j14799j397371k051890q28564n74768j469672j030922M3691
418.1E36127210k92063n54621L54349N9724j443267j086712J59085r71079k131700
436.5E30220926n97537M38631l73364m07815L35098k10822j103461l53753K33531j143992
456.9E27037442j710773k56121j64747j326084r99451l15726j232803j887738q82447
475.2E18261552o00219j635611j386106Q762l35634j484692p91371k47478j469970
493.6E10319233j654208l95477o95586j939237j200616p1109j019179j847148r45807
511.9E00550866p43776j921803j856595p39217j313299k331883j507252q48234j865268
530.3D87423539k140760r30906o31570j334489r39667j27614p16954j434416p77036
$$ plain form
548.6 478390127 477933705 476568192 475029141 474226356 473068953 470972598 469073385 467402726 464737773
567 464737773 461514413 459069192 456875622 453992814 451223195 449182600 446931928 444349319 442447454
585.4 442447454 440980941 438875973 436514288 434918880 433610380 431622803 429318398 427156359
601.7 427156359 424673438 422315449 421226889 421129912 420724332 420059264 420613408 422913402 426121533
620 426121533 429988682 434552491 438850999 442545235 446510613 450828820 454500526 457473993 460422933
638.4 460422933 462681979 463376135 464095056 466778308 470266879 472405106 472881496 472567648 473481476
656.7 473481476 477904469 484965384 491217107 494872034 498420924 504168749 507912338 510118544
673.1 510118544 513187289 516756177 519655406 522168398 525156796 527957678 529824913 531682611
$$ packed form
548.6D78390127m56422j365513j539051q02785j157403k096355j899213j670659k664953
567D64737773l223360k445221k193570k882808k769619k040595k250672k582609j901865
585.4D42447454j466513k104968k361685j595408j308500j987577k304405k162039
601.7D27156359k482921k357989j088560r6977m05580o65068N54144K299994L208131
620D26121533L867149M563809M298508L694236L965378M318207L671706K973467K948940
638.4D60422933K259046O94156P18921K683252L488571K138227M76390l13848R13828
656.7D73481476M422993P060915O251723L654927L548890N747825L743589K206206
673.1E10118544L068745L568888K899229K512992K988398K800882J867235J857698
$$ plain form
689.4 531682611 533924103 535384595 535994530 536969781 538371325 539338887 540385425 542392790 544622898
707.7 544622898 546479642 548787117 551863790 554712772 557089269 559971571 563305140 566061258
724 566061258 568518221 571430087 574245572 576298475 578213573 580474615 582406044 583863616 585590601
742.4 585590601 587629378 589368641 591020584 593110144 595165193 596708059 598322213 600394487
758.7 600394487 602294922 603757322 605382919 607262671 608695984 609650075 610580564 611109674 610671818
777.1 610671818 609669566 608662963 607443869 606030047 605283141 605757654 607189834 609665155 613785982
795.4 613785982 619379640 625531375 631927490 638554275 644644558 649587512 653779805 657503426
811.7 657503426 660140634 661498308 662180722 662065029 660420418 657415986 653747082 649292886 643793523
$$ packed form
689.4E31682611K241492J460492O09935R75251J401544R67562J046538K007365K230108
707.7E44622898J856744K307475L076673K848982K376497K882302L333569K756118
724E66061258K456963K911866K815485K052903J915098K261042J931429J457572J726985
742.4E85590601K038777J739263J651943K089560K055049J542866J614154K072274
758.7F00394487J900435J462400J625597J879752J433313R54091R30489N29110m37856
777.1F10671818j002252j006603j219094j413822p46906M74513J432180K475321M120827
795.4F13785982N593658O151735O396115O626785O090283M942954M192293L723621
811.7F57503426K637208J357674O82414j15693j644611l004432l668904m454196n499363
$$ plain form
830.1 643793523 638001859 632631242 627374828 622165978 617622077 613716424 609969079 606957436
846.4 606957436 605873764 607070088 610400259 616156101 624400735 634122252 644283772 654772460
862.7 654772460 665337920 674985766 683235168 690471292 696660757 701213241 704276145 706505358
879.1 706505358 707593381 707068741 705563962 703645229 701049030 697941542 695401013 694000125 693360388
897.4 693360388 693500280 694839597 696775854 698253512 699317634 700123966 699687600 697380364 693959951
915.8 693959951 689980865 685233533 680307209 676511884 674143076 672687352 672277212 673076510 674138725
934.1 674138725 674710512 675325513 676231802 676610768 676249504 675755322 674738705 672142446 668082297
952.5 668082297 663095713 656621337 648123443 638159037 626952946 613770306 598607242 582478523
$$ packed form
830.1F43793523n791664n370617n256414n208850m543901l905653l747345l011643
846.4F06957436j083672J196324L330171N755842Q244634R721517J0161520J0488688
862.7F54772460J0565460R647846Q249402P236124O189465M552484L062904K229213
879.1G06505358J088023n24640j504779j918733k596199l107488k540529j400888o39737
897.4F93360388J39892J339317J936257J477658J064122Q06332m36366k307236l420413
915.8F93959951l979086m747332m926324l795325k368808j455724m10140P99298J062215
934.1F74138725N71787O15001R06289L78966l61264m94182j016617k596259m060149
952.5F68082297m986584o474376q497894r964406j1206091j3182640j5163064j6128719
$$ plain form
968.8 582478523 565899909 549154818 533431172 519788027 507923663 497318417 488163948 480304092
985.1 480304092 473021984 466285676 460728645 456316173 452445686 449144632 446712583 444692045
1001.4 444692045 442410946 439806253 436698020 432401150 426857889 420827866 414718002 408499718
1017.7 408499718 402533948 397280961 392503172 387780160 383271724 379187167 375308424 371529520
1034.1 371529520 368118703 365154296 362380862 359710902 357277364 354956955 352501690 350141108
1050.4 350141108 348406285 347599506 347908169 349521577 352086246 354626954 356298745 356728375 355632901
1068.7 355632901 352953464 349359035 345723480 342344195 339186728 336346775 333704710 330734044
1085 330734044 327169091 323347956 319692820 316614389 314738065 314409077 315306783 316837490 318678826
$$ packed form
968.8E82478523j6578614j6745091j5723646j3643145j1864364j0605246r154469p859856
985.1D80304092p282108o736308n557031m412472l870487l301054k432049k020538
1001.4D44692045k281099k604693l108233m296870n543261o030023o109864o218284
1017.7D08499718n965770n252987m777789m723012m508436m084557l878743l778904
1034.1C71529520l410817k964407k773434k669960k433538k320409k455265k360582
1050.4C50141108j734823q06779L08663J613408K564669K540708J671791M29630j095474
1068.7C55632901k679437l594429l635555l379285l157467k839953k642065k970666
1085C30734044l564953l821135l655136l078431j876324l28988Q97706J530707J841336
$$ plain form
1103.4 318678826 320656419 322379619 323509276 324030071 323765039 322167277 318814754 313807964 308215469
1121.8 308215469 304119676 302909374 303858489 305373698 306288928 306447595 306912452 308587283 311310679
1140.1 311310679 314457864 317437559 319862157 321812451 323663622 325606644 327759445 330453485
1156.4 330453485 333985955 338437408 343953490 350824535 359035760 368100017 377594173 387318641
1172.7 387318641 396912932 405953825 414359003 422135293 428930491 434256762 437905282 439814150
1189.1 439814150 439922810 438638628 436911613 435555786 435022384 435674101 437601060 440286011 442961097
1207.4 442961097 445198566 446848214 447773963 448098689 448247194 448453158 448684484 449066371 449871957
1225.8 449871957 451127112 452702433 454669118 457100064 459784210 462547839 465455860 468404442
$$ packed form
1103.4C18678826J977593J723200J129657N20795k65032j597762l352523n006790n592495
1121.8C08215469m095793j210302R49115J515209R15230J58667M64857J674831K723396
1140.1C11310679L147185K979695K424598J950294J851171J943022K152801K694040
1156.4C30453485L532470M451453N516082O871045Q211225R064257R494156R724468
1172.7C87318641R594291R040893Q405178P776290O795198N326271L648520J908868
1189.1D39814150J08660j284182j727015j355827n33402O51717J926959K684951K675086
1207.4D42961097K237469J649648R25749L24726J48505K05964K31326L81887Q05586
1225.8D49871957J255155J575321J966685K430946K684146K763629K908021K948582
$$ plain form
1242.1 468404442 471043020 473216414 474993318 476347178 477220982 477814347 478505343 479490846 480849236
1260.4 480849236 482841343 485640734 489081115 493057966 497721016 503016472 508625805 514462173
1276.8 514462173 520648301 527092576 533606887 540304542 547355354 554517508 561430037 568060994
1293.1 568060994 574375749 580123067 585264444 589986265 594249904 597918630 601141334 604061544
1309.4 604061544 606537104 608506382 610190451 611843467 613452613 614923358 616417706 617976427
1325.7 617976427 619338810 620399415 621187806 621528685 621337712 621041834 621135056 621415198 621567905
1344.1 621567905 621804714 622232437 622551739 622550488 622361124 621942341 620963037 619498730 617996216 616395593
1364.5 616395593 614410579 612415433 610734999 609128714 607501328 605814457 603345156 599138081
$$ packed form
1242.1D68404442K638578K173394J776904J353860Q73804N93365O90996R85503J358390
1260.4D80849236J992107K799391L440381L976851M663050N295456N609333N836368
1276.8E14462173O186128O444275O514311O697655P050812P162154O912529O630957
1293.1E68060994O314755N747318N141377M721821M263639L668726L222704K920210
1309.4F04061544K475560J969278J684069J653016J609146J470745J494348J558721
1325.7F17976427J362383J060605P88391L40879j90973k95878R3222K80142J52707
1344.1F21567905K36809M27723L19302j251j89364m18783r79304j464307j502514j600623
1364.5F16395593j985014j995146j680434j606285j627386j686871k469301m207075
$$ plain form
1380.8 599138081 594018459 590862274 591012359 592256486 592359960 591574669 590428710 588793218 586739182
1399.1 586739182 584316015 581298411 578018665 575041413 572296321 569625437 567180395 564989746
1415.5 564989746 563121378 561968207 561274827 560691893 560183585 559626639 559320092 559203446 558849156
1433.8 558849156 559125781 560694873 562196910 563421249 564900279 566889822 569591403 572742939
1450.1 572742939 575977504 579555750 585680902 595154226 603363156 610065162 617752850 626317739
1466.4 626317739 633985937 641659796 651551306 662112415 670696139 677186966 682131529 685973525
1482.8 685973525 688257992 688846529 688614964 688041866 686276972 683068156 679304421 675562203 671194971
1501.1 671194971 665804923 659348488 652379036 646370053 640741765 634945452 629299760 624314725
$$ packed form
1380.8E99138081n119622l156185J50085J244127J03474p85291j145959j635492k054036
1399.1E86739182k423167l017604l279746k977252k745092k670884k445042k190649
1415.5E64989746j868368j153171o93380n82934n08308n56946l06547j16646l54290
1433.8E58849156K76625J569092J502037J224339J479030J989543K701581L151536
1450.1E72742939L234565L578246O125152R473324Q208930O702006P687688Q564889
1466.4F26317739P668198P673859R891510J0561109Q583724O490827M944563L841996
1482.8F85973525K284467N88537k31565n73098j764894l208816l763735l742218m367232
1501.1F71194971n390048o456435o969452o008983n628288n796313n645692m985035
$$ plain form
1517.4 624314725 620393217 617311180 614403248 611424148 608720303 606106102 603269696 600690365
1533.7 600690365 598315775 595669925 593648434 593159020 593234897 593217552 593123913 593466520 594218850 594689190
1554.1 594689190 594635427 595887959 598942399 599818587 599068403 597881377 596073508 593633533 590415001
1572.5 590415001 586242616 581260681 576023579 570423245 564037561 556949556 549423277 541661739
1588.8 541661739 533520460 525076151 516649246 508390367 500044644 491563469 483250141 475109607
1605.1 475109607 466876477 458569288 450469553 442529529 434338659 426079899 419037849 412506104
1621.4 412506104 405776292 399660408 394273669 389362097 385087281 381609470 379412621 378703564
1637.8 378703564 378760666 379426807 380668789 383333474 387265146 390266538 394361854 402035952 408275515
$$ packed form
1517.4F24314725l921508l082037k907932k979100k703845k614201k836406k579331
1533.7F00690365k374590k645850k021491m89414P5877j7345r3639L42607P52330M70340
1554.1E94689190n3763J252532L054440Q76188p50184j187026j807869k439975l218532
1572.5E90415001m172385m981935n237102n600334o385684p088005p526279p761538
1588.8E41661739q141279q444309q426905q258879q345723q481175q313328q140534
1605.1D75109607q233130q307189q099735p940024q190870q258760p042050o531745
1621.4D12506104o729812o115884n386739m911572m274816l477811k196849p09057
1637.8C78703564N7102O66141J241982K664685L931672L001392M095316P674098O239563
$$ plain form
1656.1 408275515 412940711 418315798 425190955 432761997 439336896 446516097 455445647 463841170
1672.4 463841170 472570419 482394099 491146326 498849899 507795751 520559847 532539725 541928411
1688.8 541928411 551224530 559661388 569091380 580137134 591887832 606451452 618918717 628991783
1705.1 628991783 639363825 648480535 656035304 662401557 668446600 675931454 683405161 688786507
1721.4 688786507 693481326 698346615 702694356 706404030 709852636 714752495 720332444 724298537
1737.7 724298537 728427589 733250499 737654865 741753995 745976508 750693619 755568147 759582698
1754 759582698 763126016 766460598 769298494 772361815 775280833 777306437 778905451 780662537 783034384
1772.4 783034384 785520434 787411451 789102674 790788114 792338669 793987870 795701981 796827018
$$ packed form
1656.1D08275515M665196N375087O875157P571042O574899P179201Q929550Q395523
1672.4D63841170Q729249R823680Q752227P703573Q945852J2764096J1979878R388686
1688.8E41928411R296119Q436858R429992J1045754J1750698J4563620J2467265J0073066
1705.1F28991783J0372042R116710P554769O366253O045043P484854P473707N381346
1721.4F88786507M694819M865289M347741L709674L448606M899859N579949L966093
1737.7G24298537M129052M822910M404366M099130M222513M717111M874528M014551
1754G59582698L543318L334582K837896L063321K919018K025604J599014J757086K371847
1772.4G83034384K486050J891017J691223J685440J550555J649201J714111J125037
$$ plain form
1788.7 796827018 797603369 799147904 800972700 802118421 803025544 804353416 805786908 806814313 807670653
1807 807670653 808629572 809581995 810416996 811283827 812193930 812912166 813381851 813905716 814552784 814977884
1827.4 814977884 815551698 816677928 817586482 818029761 818597555 819167495 819239497 819376051 820267856 821204364
1847.8 821204364 821704209 822118640 822689235 823142469 823351562 823700845 824190199 824345291 824175239 824373305
1868.2 824373305 825081289 825601041 825912833 826338112 826662183 826751947 826929331 827241302 827314198 827267647
1888.6 827267647 827587008 827987134 828073502 828169703 828499258 828744352 828733861 828767180 828943074 829028487
1909 829028487 829078078 829228759 829245269 829067826 829048336 829247177 829456151 829551339 829596519 829674602 829623044
1931.5 829623044 829449475 829404831 829436481 829242527 828941047 828890860 828918695 828752756 828582585 828563213
$$ packed form
1788.7G96827018P76351J544535J824796J145721R07123J327872J433492J027405Q56340
1807H07670653R58919R52423Q35001Q66831R10103P18236M69685N23865O47068M25100
1827.4H14977884N73814J126230R08554M43279N67794N69940P2002J36554Q91805R36508
1847.8H21204364M99845M14431N70595M53234K09093L49283M89354J55092j70052J98066
1868.2H24373305P07984N19752L11792M25279L24071Q9764J77384L11971P2896m6551
1888.6H27267647L19361M00126Q6368R6201L29555K45094j0491L3319J75894Q5413
1909H29028487M9591J50681J6510j77443j9490J98841K08974R5188M5180P8083n1558
1931.5H29623044j73569m4644L1650j93954l01480n0187K7835j65939j70171j9372
$$ plain form
1951.9 828563213 828488529 828262925 828075707 827967346 827730358 827364624 827143192 827124834 827037454 826845765
1972.3 826845765 826743424 826630831 826391041 826196969 826145411 826031864 825755417 825478554 825293958 825142205
1992.6 825142205 824981391 824870467 824772418 824536979 824224710 824013650 823796272 823451638 823149562 822957098
2013 822957098 822685957 822333157 822104990 821953118 821657360 821262658 821017206 820867479 820602357 820306003
2033.4 820306003 820091903 819816291 819435537 819190919 819114447 818914711 818567634 818368971 818269014 818002403
2053.8 818002403 817697763 817595184 817538917 817323267 817109883 817038059 816934526 816734612 816667020 816704690
2074.2 816704690 816566467 816322267 816240311 816221833 816056728 815903187 815919697 815898716 815711975 815607965
2094.6 815607965 815654516 815598726 815464556 815491140 815564513 815466106 815378428 815452635 815472364 815349936 815306425
$$ packed form
1951.9H28563213p4684k25604j87218j08361k36988l65734k21432j8358q7380j91689
1972.3H26845765j02341j12593k39790j94072n1558j13547k76447k76863j84596j51753
1992.6H25142205j60814j10924r8049k35439l12269k11060k17378l44634l02076j92464
2013H22957098k71141l52800k28167j51872k95758l94702k45452j49727k65122k96354
2033.4H20306003k14100k75612l80754k44618p6472j99736l47077j98663r9957k66611
2053.8H18002403l04640j02579n6267k15650k13384p1824j03533j99914o7592L7670
2074.2H16704690j38223k44200q1956j8478j65105j53541J6510k0981j86741j04010
2094.6H15607965M6551n5790j34170K6584P3373r8407q7678P4207J9729j22428m3511
$$ plain form
2117.1 815306425 815399885 815444469 815440178 815567732 815733314 815739453 815739810 815907001 816067755 816080093 816131592
2139.5 816131592 816322446 816458702 816490054 816614687 816837490 816944063 816965342 817135572 817383587 817500234
2159.9 817500234 817617655 817857742 818031967 818073094 818207264 818497062 818716705 818846107 819052815 819259465
2180.3 819259465 819345057 819439948 819620967 819746375 819788873 819921613 820135355 820210636 820173979 820269465 820451260
2202.7 820451260 820487320 820478916 820612311 820748329 820771337 820805073 820887089 820905328 820874214 820917785 821000755
2225.2 821000755 820994377 820955217 821004093 821040034 820949078 820871294 820911109 820908725 820805728 820760846 820781946 820732594
2249.6 820732594 820642054 820627749 820614755 820507944 820435345 820469499 820471585 820412457 820433378 820533991 820558310
2272.1 820558310 820522904 820589066 820705056 820737123 820769310 820899308 821004868 820982695 820957780 821032465 821123838
$$ packed form
2117.1H15306425R3460M4584m291J27554J65582O139L57J67191J60754J2338N1499
2139.5H16131592J90854J36256L1352J24633K22803J06573K1279J70230K48015J16647
2159.9H17500234J17421K40087J74225M1127J34170K89798K19643J29402K06708K06650
2180.3H19259465Q5592R4891J81019J25408M2498J32740K13742P5281l6657R5486J81795
2202.7H20451260L6060q404J33395J36018K3008L3736Q2016J8239l1114M3571Q2970
2225.2H21000755o378l9160M8876L5941r0956p7784L9815k384j02997m4882K1100m9352
2249.6H20732594r0540j4305j2994j06811p2599L4154K086n9128K0921J00613K4319
2272.1H20558310l5406O6162J15990L2067L2187J29998J05560k2173k4915P4685R1373
$$ plain form
2294.5 821123838 821170032 821216524 821262538 821265936 821283579 821366072 821418643 821421146 821478665 821584165 821645200 821664810
2319 821664810 821782053 822024703 822195590 822285891 822502196 822753608 822811365 822781861 822847009 822965741 823130310
2341.4 823130310 823564649 824094415 824049830 823528826 823184550 823310196 823691964 824104309 824427247 824682295
2361.8 824682295 824956357 825254798 825468302 825634122 825905800 826265812 826539159 826654255 826733947 826858163
2382.2 826858163 826973975 827047110 827121258 827196538 827236235 827275634 827374041 827464819 827467382 827468216 827509165 827476442
2406.7 827476442 827380419 827345967 827333331 827257931 827176630 827128887 827063799 826940536 826776147 826662481 826617360
2429.1 826617360 826535761 826425195 826345026 826255023 826138496 826032937 825919449 825751305 825564504 825440049
2449.5 825440049 825355291 825208962 825024009 824878871 824747562 824590027 824433148 824283898 824106872 823901713
$$ packed form
2294.5H21123838M6194M6492M6014L398J7643Q2493N2571K503N7519J05500O1035J9610
2319H21664810J17243K42650J70887R0301K16305K51412N7757k9504O5148J18732J64569
2341.4H23130310M34339N29766m4585n21004l44276J25646L81768M12345L22938K55048
2361.8H24682295K74062K98441K13504J65820K71678L60012K73347J15096P9692J24216
2382.2H26858163J15812P3135P4148P5280L9697L9399R8407R0778K563Q34M0949l2723
2406.7H27476442r6023l4452j2636p5400q1301m7743o5088j23263j64389j13666m5121
2429.1H26617360q1599j10566q0169r0003j16527j05559j13488j68144j86801j24455
2449.5H25440049q4758j46329j84953j45138j31309j57535j56879j49250j77026k05159
$$ plain form
2469.9 823901713 823693812 823500097 823299885 823089302 822913170 822749436 822558999 822384417 822234333 822042823
2490.3 822042823 821814001 821626902 821476579 821301341 821126759 820988655 820829451 820592880 820349097 820211411
2510.7 820211411 820117891 819943249 819719672 819524467 819334507 819113970 818907917 818739653 818562746 818355024
2531.1 818355024 818144679 817938447 817718863 817512333 817322552 817103744 816882074 816717505 816558957 816323221
2551.5 816323221 816065729 815878272 815700054 815449059 815190971 814977348 814727485 814414859 814109027 813810408
2571.9 813810408 813464284 813097119 812769294 812422574 812009394 811614931 811260164 810859442 810401380 809964061
2592.3 809964061 809547246 809064984 808516800 807990670 807484388 806937099 806370854 805838764 805319965 804749489
2612.7 804749489 804152429 803584695 803006232 802392125 801805794 801235378 800590694 799920797 799326062 798757851
$$ packed form
2469.9H23901713k07901j93715k00212k10583j76132j63734j90437j74582j50084j91510
2490.3H22042823k28822j87099j50323j75238j74582j38104j59204k36571k43783j37686
2510.7H20211411r3520j74642k23577j95205j89960k20537k06053j68264j76907k07722
2531.1H18355024k10345k06232k19584k06530j89781k18808k21670j64569j58548k35736
2551.5H16323221k57492j87457j78218k50995k58088k13623k49863l12626l05832k98619
2571.9H13810408l46124l67165l27825l46720m13180l94463l54767m00722m58062m37319
2592.3H09964061m16815m82262n48184n26130n06282n47289n66245n32090n18799n70476
2612.7H04749489n97060n67734n78463o14107n86331n70416o44684o69897n94735n68211
$$ plain form
2633.1 798757851 798148751 797551334 797001779 796441376 795865476 795328379 794800818 794223189 793622971 793065310
2653.5 793065310 792527020 791932583 791327178 790802300 790313840 789798558 789275348 788747668 788187802 787616849
2673.9 787616849 787090540 786589205 786041439 785470903 784921587 784336984 783702075 783079505 782483637 781905234
2694.3 781905234 781322062 780696809 780018747 779309630 778628707 777984262 777307749 776607633 775937617 775237799
2714.6 775237799 774480879 773777962 773149312 772494137 771798551 771128178 770467401 769774020 769089162 768439651
2735 768439651 767784238 767100394 766449749 765852988 765224695 764548123 763857603 763146162 762406051 761669695
2755.4 761669695 760973990 760238230 759399712 758572042 757820308 757044315 756195247 755333900 754496396 753641307
2775.8 753641307 752734601 751803577 750829697 749791741 748776853 747819126 746801853 745674074 744529963
$$ packed form
2633.1G98757851o09100n97417n49555n60403n75900n37097n27561n77629o00218n57661
2653.5G93065310n38290n94437o05405n24878m88460n15282n23210n27680n59866n70953
2673.9G87616849n26309n01335n47766n70536n49316n84603o34909o22570n95868n78403
2694.3G81905234n83172o25253o78062p09117o80923o44445o76513p00116o70016o99818
2714.6G75237799p56920p02917o28650o55175o95586o70373o60777o93381o84858o49511
2735G68439651o55413o83844o50645n96761o28293o76572o90520p11441p40111p36356
2755.4G61669695o95705p35760q38518q27670p51734p75993q49068q61347q37504q55089
2775.8G53641307r06706r31024r73880j037956j014888r57727j017273j127779j144111
$$ plain form
2794.2 744529963 743393958 742197216 740950882 739698410 738392413 737030625 735684097 734314084
2810.5 734314084 732856631 731355190 729847848 728309453 726707101 725054741 723393261 721672654
2826.8 721672654 719787240 717756867 715631306 713309109 710673571 707654238 704094112 699852288
2843.1 699852288 694979966 689853311 685186982 681591570 679190397 677652121 676466763 675249934
2859.5 675249934 673758686 671819627 669368863 666499436 663487494 660649002 658121347 655926347
2875.8 655926347 654049098 652355254 650705516 649038017 647263646 645326614 643272400 641158938
2892.1 641158938 638972819 636669099 634299934 631923378 629452765 626765668 623850346 620702803
2908.4 620702803 617165327 613159835 608896196 604756653 601098716 598086596 595752835 594086707
$$ packed form
2794.2G44529963j136005j196742j246334j252472j305997j361788j346528j370013
2810.5G34314084j457453j501441j507342j538395j602352j652360j661480j720607
2826.8G21672654j885414k030373k125561k322197k635538l019333l560126m241824
2843.1F99852288m872322n126655m666329l595412k401173j538276j185358j216829
2859.5F75249934j491248j939059k450764k869427l011942k838492k527655k195000
2875.8F55926347j877249j693844j649738j667499j774371j937032k054214k113462
2892.1F41158938k186119k303720k369165k376556k470613k687097k915322l147543
2908.4F20702803l537476m005492m263639m139543l657937l012120k333761j666128
$$ plain form
2924.7 594086707 593043983 592561662 592517972 592885256 593830943 595438957 597604394 600183845 602950037
2943.1 602950037 605566323 607717216 609267414 610339880 611070871 611521900 611910224 612481415 613273621
2961.4 613273621 614175677 615124822 616123438 617079914 617963254 618865311 619808197 620837629 621984005
2979.8 621984005 623144329 624258518 625325441 626314163 627222478 627973258 628397822 628515959 628400385
2998.1 628400385 628007054 627395928 626641333 625756979 624827206 623918176 622943401 621756315 620311916
3016.5 620311916 618655920 616903782 615128577 613262177 611308813 609362364 607436121 605507612
3032.8 605507612 603505075 601392686 599294484 597223401 595049679 592744887 590355873 587969601
3049.1 587969601 585596561 583176076 580755472 578369260 576009333 573700011 571449935 569278181
$$ packed form
2924.7E94086707j042724m82321m3690L67284R45687J608014K165437K579451K766192
2943.1F02950037K616286K150893J550198J072466P30991M51029L88324N71191P92206
2961.4F13273621R02056R49145R98616R56476Q83340R02057R42886J029432J146376
2979.8F21984005J160324J114189J066923R88722R08315P50780M24564J18137j15574
2998.1F28400385l93331o11126p54595q84354r29773r09030r74775j187086j444399
3016.5F20311916j655996j752138j775205j866400j953364j946449j926243j928509
3032.8F05507612k002537k112389k098202k071083k173722k304792k389014k386272
3049.1E87969601k373040k420485k420604k386212k359927k309322k250076k171754
$$ plain form
3065.5 569278181 567145646 564930379 562654793 560437739 558306336 556227267 554086626 551820815
3081.8 551820815 549494505 547143042 544807971 542532444 540232301 537836313 535419643 533053756
3098.1 533053756 530691266 528241694 525695682 523139954 520610929 518026650 515420139 512888849
3114.4 512888849 510312974 507552445 504620790 501594841 498574585 495650262 492797077 489872366
3130.7 489872366 486842096 483805090 480809420 477787852 474627823 471365660 468109548 464882791
3147 464882791 461725026 458621889 455408245 452011585 448600918 445280194 441970676 438651025 435351670
3165.4 435351670 432044923 428697795 425346076 422033817 418710470 415362537 412074208 408806413
3181.7 408806413 405502707 402248412 399071872 395904481 392716259 389506847 386294246 383130759
$$ packed form
3065.5E69278181k132535k215267k275586k217054k131403k079069k140641k265811
3081.8E51820815k326310k351463k335071k275527k300143k395988k416670k365887
3098.1E33053756k362490k449572k546012k555728k529025k584279k606511k531290
3114.4E12888849k575875k760529k931655l025949l020256k924323k853185k924711
3130.7D89872366l030270l037006k995670l021568l160029l262163l256112l226757
3147D64882791l157765l103137l213644l396660l410667l320724l309518l319651l299355
3165.4D35351670l306747l347128l351719l312259l323347l347933l288329l267795
3181.7D08806413l303706l254295l176540l167391l188222l209412l212601l163487
$$ plain form
3198 383130759 380016625 376930445 373894036 370896250 367925078 365016729 362134337 359230936 356375277
3216.4 356375277 353602678 350857615 348124474 345445395 342808783 340201020 337666124 335192651
3232.7 335192651 332701147 330178052 327700615 325319499 323038816 320824355 318605304 316368133
3249 316368133 314172953 312041879 309964240 307913154 305833876 303755939 301759720 299822599 297899276
3267.4 297899276 296019167 294136226 292193025 290277958 288415849 286525071 284642398 282849193
3283.7 282849193 281125784 279422522 277721941 275998712 274221957 272409081 270621270 268908560
3300 268908560 267253101 265623569 263958037 262169361 260301709 258448660 256648093 254929245 253255665
3318.4 253255665 251558572 249858528 248187765 246502385 244803473 243138537 241474837 239830807
$$ packed form
3198C83130759l114134l086180l036409k997786k971172k908349k882392k903401k855659
3216.4C56375277k772599k745063k733141k679079k636612k607763k534896k473473
3232.7C35192651k491504k523095k477437k381116k280683k214461k219051k237171
3249C16368133k195180k131074k077639k051086k079278k077937j996219j937121j923323
3267.4B97899276j880109j882941j943201j915067j862109j890778j882673j793205
3283.7B82849193j723409j703262j700581j723229j776755j812876j787811j712710
3300B68908560j655459j629532j665532j788676j867652j853049j800567j718848j673580
3318.4B53255665j697093j700044j670763j685380j698912j664936j663700j644030
$$ plain form
3334.7 239830807 238289997 236785725 235207453 233573288 231916741 230307937 228843704 227406487
3351 227406487 225845188 224252537 222751334 221348822 220021755 218758434 217604265 216523141 215360880
3369.3 215360880 214051083 212746292 211666703 210781753 209919766 209032461 208229885 207612067 207219109
3387.7 207219109 207025468 206783846 206290111 205788746 205647513 205757841 205694959 205392927 205240473 205368742
3408.1 205368742 205548868 205712721 205900550 206099197 206393227 206828848 207322299 207924813 208724514 209640607
3428.5 209640607 210541040 211533636 212705627 213787109 214629337 215521261 216675192 218023151 219528526
3446.8 219528526 221076012 222582161 224148601 225856945 227699369 229638398 231583640 233571962
3463.2 233571962 235812306 238225237 240395635 242204696 244061634 246223167 248620421 251066566
$$ packed form
3334.7B39830807j540810j504272j578272j634165j656547j608804j464233j437217
3351B27406487j561299j592651j501203j402512j327067j263321j154169j081124j162261
3369.3B15360880j309797j304791j079589q84950q61987q87305q02576o17818l92958
3387.7B07219109j93641k41622m93735n01365j41233J10328o2882l02032j52454J28269
3408.1B05368742J80126J63853J87829J98647K94030M35621M93451O02514P99701R16093
3428.5B09640607R00433R92596J171991J081482Q42228Q91924J153931J347959J505375
3446.8B19528526J547486J506149J566440J708344J842424J939029J945242J988322
3463.2B33571962K240344K412931K170398J809061J856938K161533K397254K446145
$$ plain form
3479.5 251066566 253376275 255673438 258170038 260728180 263210118 265753210 268445998 271270841
3495.8 271270841 274063826 276820749 279747486 282669544 285376847 288203031 291370779 294703066
3512.1 294703066 297968954 301046550 304124177 307482809 311189830 314893395 318385452 321962476
3528.4 321962476 325737089 329579860 333548963 337613076 341558605 345532537 349774599 354273051
3544.7 354273051 358732879 362923265 367192954 371828526 376528382 381172717 385962009 390755266
3561.1 390755266 395260781 400058419 406108946 412429631 417845428 423022479 428564161 434374958
3577.4 434374958 440370142 446339339 452008009 457984746 465041012 472020149 477994680 484219074
3593.7 484219074 491204500 498231351 505224884 512176096 518557549 524691045 531665325 539103627
$$ packed form
3479.5B51066566K309709K297163K496600K558142K481938K543092K692788K824843
3495.8B71270841K792985K756923K926737K922058K707303K826184L167748L332287
3512.1B94703066L265888L077596L077627L358632L707021L703565L492057L577024
3528.4C21962476L774613L842771L969103M064113L945529L973932M242062M498452
3544.7C54273051M459828M190386M269689M635572M699856M644335M789292M793257
3561.1C90755266M505515M797638O050527O320685N415797N177051N541682N810797
3577.4D34374958N995184N969197N668670N976737P056266O979137N974531O224394
3593.7D84219074O985426P026851O993533O951212O381453O133496O974280P438302
$$ plain form
3610 539103627 546193063 553035021 559545755 566784620 575109303 582282543 587603688 592739165 600526750
3628.4 600526750 609706044 616572618 622545898 628727436 634806335 640782773 646155834 650541604
3644.7 650541604 655186951 662199974 669964731 675118089 679349899 684870243 690220714 694474816
3661 694474816 698231220 701373875 704066753 707656384 711628377 714331269 717825234 722276926 725478649
3679.4 725478649 727989256 730123818 731796443 734058738 737462401 740642548 742966652 744835496
3695.7 744835496 746381581 747855008 749728918 751529276 752538443 753107548 754130244 756188750
3712 756188750 758182883 759206653 759807944 760514975 761365652 762320340 763381660 764064491 764171600
3730.3 764171600 764355421 765355587 767195225 768487096 768249273 767755687 768699408 769723058 769967735
$$ packed form
3610E39103627P089436O841958O510734P238865Q324683P173240N321145N135477P787585
3628.4F00526750R179294O866574N973280O181538O078899N976438N373061M385770
3644.7F50541604M645347P013023P764757N153358M231810N520344N350471M254102
3661F94474816L756404L142655K692878L589631L971993K702892L493965M451692L201723
3679.4G25478649K510607K134562J672625K262295L403663L180147K324104J868844
3695.7G44835496J546085J473427J873910J800358J009167N69105J022696K058506
3712G56188750J994133J023770O01291P07031Q50677R54688J061320O82831J07109
3730.3G64171600J83821J000166J839638J291871k37823m93586R43721J023650K44677
$$ plain form
3748.7 769967735 771153927 772911549 773727834 774044514 774743438 775631428 776066422 776320398 776690483
3767.1 776690483 777357638 778342009 779028773 779242575 779405773 779844344 780330181 780654430 781019926 781418800
3787.5 781418800 781790495 782010496 781927407 781872392 781790972 781666994 782236993 782838643 783143044 783905447
3807.8 783905447 784440219 784182429 783759475 783854783 783942461 784040034 784851134 785454094 785604298 785673082
3828.2 785673082 785571933 785383165 785143435 785061300 785411954 785949945 786557257 787130237 787116945 786192000
3848.6 786192000 784809589 784719050 786503255 787500918 787344992 786970794 786870122 787018061 786818564
3867 786818564 786631942 787051558 787577987 787897050 787767231 787550032 787690461 787774324 788008451 788200498
3887.4 788200498 787991941 788112998 788472176 788283646 787677526 787175953 787121534 787672400 788473308 788914025
$$ packed form
3748.7G69967735J186192J757622Q16285L16680O98924Q87990M34994K53976L70085
3767.1G76690483O67155R84371O86764K13802J63198M38571M85837L24249L65496L98874
3787.5G81418800L71695K20001q3089n5015q1420j23978N69999O01650L04401P62403
3807.8G83905447N34772k57790m22954R5308Q7678R7573Q11100O02960J50204O8784
3828.2G85673082j01149j88768k39730q2135L50654N37991O07312N72980j3292r24945
3848.6G86192000j382411r0539J784205R97663j55926l74198j00672J47939j99497
3867G86818564j86622M19616N26429L19063j29819k17199J40429Q3863K34127J92047
3887.4G88200498k08557J21057L59178j88530o06120n01573n4419N50866Q00908M40717
$$ plain form
3907.8 788914025 788968682 788831949 788540721 788300872 788350821 788487077 788475513 788524747 788674951 788634181
3928.2 788634181 788524091 788691401 788990438 789103448 789003372 788863957 788930953 789107144 789156675 789187908
3948.6 789187908 789278865 789366722 789448798 789529383 789609313 789693117 789803088 789944410 790050149 790095806 790144205
3971 790144205 790240884 790387571 790513813 790589392 790721595 790908098 790971518 790859103 790781975 790916264 791136742
3993.4 791136742 791277170 791390419
3997.5 791390419
$$ packed form
3907.8G88914025N4657j36733k91228k39849M9949J36256j1564M9234J50204m0770
3928.2G88634181j10090J67310K99037J13010j00076j39415O6996J76191M9531L1233
3948.6G89187908R0957Q7857Q2076Q0585P9930Q3804J09971J41322J05739M5657M8399
3971G90144205R6679J46687J26242P5579J32203J86503O3420j12415p7128J34289K20478
3993.4G91136742J40428J13249
3997.5G91390419
##END=$$ End of the data block
