##TITLE=$$ Begin of the data block
##JCAMP-DX=5.00 $$ ACD/SpecManager v 10.08
##SPECTROMETER/DATA SYSTEM=Alpha
##DATE=14 Apr 2014 11:23:48
##DATA TYPE=INFRARED SPECTRUM
##DATA CLASS=XYDATA
##ORIGIN=
##OWNER=
##NPOINTS=1765
##FIRSTX=399.75695801
##LASTX=3997.56933594
##MAXX=3997.56933594
##MINX=399.75695801
##MAXY=0.83868390
##MINY=0.41484052
##XFACTOR=1.0000000000
##YFACTOR=1.000000000000000e-9
##FIRSTY=0.65453631
##DELTAX=2.03957629
##XUNITS=1/CM
##YUNITS=ARBITRARY UNITS
##XYDATA=(X++(Y..Y))
399.8F54536307k687395j466274Q96394l94225k419412q52466Q86321l22699j349926
418.1F46826625q3625j55449j621664p93338N30780o96719j247227K82228K49624j060069
438.5F42231166m06265Q76665l2067j101315O4850R24229l57687j012981J34051J55806
458.9F41476452j072824m76122P08342l38972j532316o09338n2214j079559j022041
477.3F36001408L40104L36528p16507l48986M84705l48985j300037l63350K61903j046300
497.7F33300483j361191K80857N08130j023949r44554L44276k79963j546681o19829
516F28657579K90811j066386j667917k48432m530j389921j020849M97520k21848j576841
536.4F22249186m72844O07491o56188j157820L62933L14534j422942j115441M94897
$$ plain form
399.8 654536307 651848912 650382638 651279032 650884807 648465395 647612929 648499250 648176551 646826625
418.1 646826625 646743000 646587551 644965887 644172549 644703329 644006610 642759383 643041611 643291235 642231166
438.5 642231166 641824901 642701566 642669499 641568184 641633034 642557263 642199576 641186595 641320646 641476452
458.9 641476452 640403628 639927506 640635848 640296876 638764560 638155222 638103008 637023449 636001408
477.3 636001408 636341512 636678040 635961533 635612547 636097252 635748267 634448230 634084880 634346783 633300483
497.7 633300483 631939292 632220149 632728279 631704330 630759776 631104052 630824089 629277408 628657579
516 628657579 628948390 627882004 626214087 625965655 625961125 624571204 623550355 624047875 623826027 622249186
536.4 622249186 621776342 622383833 621727645 620569825 620932758 621247292 619824350 618708909 619203806
554.8F19203806j84536j817524r38893K50876j217544k130449n74589m18901k147675
573.1F10024571j742482R3580n38648j961767o46413O36936q17597j382411O58095
591.5F04323864J097977q92281p42853J173079L78430j399517r3460J431703j22726
609.8F05154216j155853O46651J290560q2612R22262L461898K936720J083672K181411
628.2F16438925L607810J955330P44224K392053K674938L12328r6679J839280J811386
646.5F31679595L50654J074075J811922k80559r25183K508580M251242K007782Q08001
664.9F43286109K038658K381384J197577K248764L409862J697123K54154K163053L021359
683.3F61698043O36697J311K017975J615823o63042r7394J540422K87712r90153R21846
$$ plain form
554.8 619203806 619019270 617201746 616262853 616513729 615296185 613165736 612591147 612172246 610024571
573.1 610024571 608282089 608375669 607837021 605875254 605228841 605865777 605048180 603665769 604323864
591.5 604323864 605421841 604529560 603786707 604959786 605338216 603938699 603845239 605276942 605154216
609.8 605154216 603998363 604645014 605935574 605852962 606775224 610237122 613173842 614257514 616438925
628.2 616438925 620046735 622002065 622746289 625138342 627813280 628125608 628028929 629868209 631679595
646.5 631679595 632030249 633104324 634916246 634635687 633710504 636219084 640470326 642478108 643286109
664.9 643286109 645324767 647706151 648903728 651152492 654562354 656259477 656513631 658676684 661698043
683.3 661698043 662334740 662336051 664354026 665969849 665306807 665209413 666749835 667037547 666047394 666969240
703.7F66969240K198338M19557p0452K012908J964212m17769l36647J599073J307309
722F75645769N13732K313733L488183J445890L71813K109945K125263j88171j14441
740.4F87711716J946330J481771r7871J185596K707839J193583J55390J927912K368867
758.7G00581133K17080J8359J968145J536250m68552J67370J516819r6619j758337
777.1G03681648n01633J32799j748144j938165M50313J051784l6120J321911L923715
795.4G06338108L711760K613723M047453N163014L293097K051056L259480L045916
811.7G33523607P85709N03182J647294J48415k437174k281487j695812l675282n099952
830.1G21418500l607631k594173l684520l524185j718521j768052k982617j719773
$$ plain form
703.7 666969240 669167578 669587135 669516683 671529591 673493803 673076034 672739387 674338460 675645769
722 675645769 676159501 678473234 681961417 683407307 683779120 685889065 688014328 687826157 687711716
740.4 687711716 689658046 691139817 691041946 692227542 694935381 696128964 696284354 698212266 700581133
758.7 700581133 700798213 700816572 702784717 704320967 703852415 704019785 705536604 705439985 703681648
777.1 703681648 703180015 703312814 701564670 699626505 700076818 701128602 701092482 702414393 706338108
795.4 706338108 710049868 712663591 716711044 721874058 725167155 727218211 730477691 733523607
811.7 733523607 734309316 734812498 736459792 736608207 734171033 731889546 730193734 726518452 721418500
830.1 721418500 717810869 715216696 711532176 708007991 706289470 704521418 701538801 699819028
846.4F99819028P57695J251459J665175M411876O585061O005049N805075P373751P293224
864.8G40967393N110323M532338N269408L832280J577497J820385K376974L75211j402259
883.1G64459550p96437q92639k748132k842784r54628n96046j255512O9856J821399
901.5G56264627J152873J25229R50456J003087j171053k461433j977027k632856m245460
919.8G47008443l757417j916886j559317j542687J75237J468242N31613j08659Q78155
938.2G41176724Q88885n73636p49409J89901m94600k113104k242922k170086l860414
956.6G30051339n516827n642355o256998q202195r177208q705616q758843r074449
972.9F68716848p783353n748928n071819m914820l682435k653598k999604l069103
$$ plain form
846.4 699819028 700576723 701828182 703493357 707905233 714490294 720495343 726300418 733674169 740967393
864.8 740967393 746077716 750610054 755879462 759711742 761289239 763109624 765486598 765861809 764459550
883.1 764459550 763663113 762770474 760022342 757179558 756224930 755628884 754373372 754443228 756264627
901.5 756264627 757417500 757542729 758493185 759496272 758325219 755863786 753886759 751253903 747008443
919.8 747008443 743251026 741334140 739774823 738232136 738407373 739875615 740407228 740298569 741176724
938.2 741176724 742065609 741491973 740742564 740932465 740437865 738324761 736081839 733911753 730051339
956.6 730051339 724534512 718892157 712635159 704432964 695255756 686550140 677791297 668716848
972.9 668716848 660933495 655184567 650112748 645197928 641515493 638861895 635862291 632793188
989.2F32793188k009928j525462j965761j607478n80728n98192j296639j285613j267135
1007.5F20656252k280593l145397k854883k708733l349901l285944k297342k003491
1023.9E98729968k394557k034128j268565j362145j669526j106561n23030q04723r89079
1042.2E86577654m75228l75152r96470j081169m29153j27494m5479P57277J623035
1060.6E85427821J412511P81714N90206Q5175j063705j601577j147568q58843r49800
1078.9E82675934n51224J6332k47717q83639q73685o34730q01980o48141K40266Q29578
1099.3E79120994O63936P04884J163543J101911O36935O36279P04527N5671q46982
1117.7E83941698j291990j506388j466990n98550O34015J133859P97629N45562Q12471
$$ plain form
989.2 632793188 630783260 629257798 627292037 625684559 625103831 624505639 623209000 621923387 620656252
1007.5 620656252 618375659 615230262 612375379 609666646 606316745 603030801 600733459 598729968
1023.9 598729968 596335411 594301283 593032718 591670573 590001047 588894486 588371456 587566733 586577654
1042.2 586577654 586102426 585727274 584730804 583649635 583220482 583092988 583047509 583804786 585427821
1060.6 585427821 586840332 587622046 588212252 588297427 587233722 585632145 584484577 583625734 582675934
1078.9 582675934 582124710 582141042 581893325 581009686 580136001 579501271 578699291 578051150 578291416 579120994
1099.3 579120994 579784930 580489814 581653357 582755268 583392203 584028482 584733009 584788680 583941698
1117.7 583941698 582649708 581143320 579676330 579077780 579711795 580845654 581643283 582188845 583001316
1136E83001316J025080J075328J386404J534223J043856O68467R27150J072705Q71360
1154.4E92605889J163184J982093K472163K724707L519892M508734M860819N015552
1170.7F18853033N545914N771458N256772M806995M712284M077434K750695J608551
1187F53383136O19828q08596k061784k327025k122045k055108j695812r10402n41806
1205.4F41480386q17239r47714q61347j204550j685202j550496j170754j243472j307905
1223.7F30691707q08716l33726l22878j68741L60369N64993L72469N19872Q47518O11842
1244.1F32334709J78039K31147K95818j48416m62949j81198N2333k3663L12328J050234
1264.5F33638382J364529J375973J835049K456843K519966K440393K822101L115832
$$ plain form
1136 583001316 584026396 585101724 586488128 588022351 589066207 589734674 590661824 591734529 592605889
1154.4 592605889 593769073 595751166 598223329 600948036 604467928 608976662 613837481 618853033
1170.7 618853033 624398947 630170405 635427177 640234172 644946456 649023890 651774585 653383136
1187 653383136 654002964 653194368 651132584 648805559 646683514 644628406 642932594 642022192 641480386
1205.4 641480386 640663147 639715433 638854086 637649536 635964334 634413838 633243084 631999612 630691707
1223.7 630691707 629882991 629549265 629226387 629057646 629418015 629983008 630355477 630875349 631722867 632334709
1244.1 632334709 632512748 632743895 633039713 632891297 632428348 632247150 632299483 632275820 632588148 633638382
1264.5 633638382 635002911 636378884 638213933 640670776 643190742 645631135 648453236 651569068
1280.8F51569068K911151K940655L436207L522814L041863K846062K921701K498448
1297.2F75687969J938820K035141K257883J906276J591265J862645J963079J466811
1313.5F90709889J258373J559437J447856J015007J141370J458287J090288M96388
1329.8G00176895M58538M20928j59502n18143q0466L50535K21371K43545N78225L93986
1350.2G02085912j05023l4750O9082o61194j736164k519906k731562k349376j917422
1368.5F90099597k045035l464401n035997l733098l85404J473189J443684J787066
1384.9F80139601K408564J676619O28829J63734n43773j435280j808524j533270j620829
1403.2F78075671k250790j983881j359880j531542j586497q58724o92069j531780j263380
$$ plain form
1280.8 651569068 654480219 657420874 660857081 664379895 667421758 670267820 673189521 675687969
1297.2 675687969 677626789 679661930 681919813 683826089 685417354 687279999 689243078 690709889
1313.5 690709889 691968262 693527699 694975555 695990562 697131932 698590219 699680507 700176895
1329.8 700176895 700635433 701056361 700896859 700378716 700298250 700648785 700870156 701113701 701691926 702085912
1350.2 702085912 701980889 701946139 702015221 701354027 699617863 697097957 694366395 692017019 690099597
1368.5 690099597 688054562 684590161 679554164 675821066 675435662 676908851 678352535 680139601
1384.9 680139601 682548165 684224784 684853613 685017347 684473574 683038294 681229770 679696500 678075671
1403.2 678075671 675824881 673841000 672481120 670949578 669363081 668504357 667812288 666280508 665017128
1421.6F65017128m36246o10114j285255j806378j716137j620352k493501k696991j580178
1439.9F50771976j583934k033949j777053j768708k215803k234280j491845o85930
1456.2F36980474O48141K662778L746807M206360N890310R758889J3995946J6014516
1472.6F93904221J3061106R223998P076204N215585L870547L013253J701236k22862
1488.9G36843288j209915r44137j597822l138661l301979k570331k388835l515243
1505.2G18176365n559921m820764l723860l379643k752304k378762k198219k309144
1521.5F91053748k028584j931966k231240j480877j216591k126515j550078m43816
1537.8F78044081j435638k122700o58512M45306O85930O46353J216591J958727K009869
$$ plain form
1421.6 665017128 664580882 663970768 662685513 660879135 659162998 657542646 655049145 652352154 650771976
1439.9 650771976 649188042 647154093 645377040 643608332 641392529 639158249 637666404 636980474
1456.2 636980474 637628615 640291393 644038200 648244560 654134870 663893759 677889705 693904221
1472.6 693904221 706965327 716189325 723265529 728481114 732351661 735364914 737066150 736843288
1488.9 736843288 735633373 734689236 733091414 729952753 726650774 724080443 721691608 718176365
1505.2 718176365 712616444 707795680 704071820 700692177 697939873 695561111 693362892 691053748
1521.5 691053748 689025164 687093198 684861958 683381081 682164490 680037975 678487897 678044081
1537.8 678044081 676608443 674485743 673827231 674272537 674958467 675604820 676821411 678780138 680790007
1556.2F80790007R19879J14500Q21650O00875M7564m70936j488507j689136j937032
1574.5F77708864l413617l646136l109336l230035l518403m072308m482925m491329
1590.9F47744775m630566n102038n136848m791915m833698m988730m693330m479706
1607.2F09087944m802346m774630m054964m397094n542696m063427k828658l604769
1623.5E75019360l822864l300845k611876j350224p90119j263559n22971P91431J481831
1641.8E63630164J997411K107143K276540K894819K790570K246380K860904L578603
1658.2E84382534L954768M063249M178583M420639M556953M472256M347801M445374
1674.5F18822157M597068M603088M678786M800498M882276M804194M846335N189419
$$ plain form
1556.2 680790007 681709886 681824386 682646036 683246911 683294475 682823539 681335032 679645896 677708864
1574.5 677708864 674295247 670649111 667539775 664309740 660791337 656719029 652236104 647744775
1590.9 647744775 643114209 638012171 632875323 628083408 623249710 618260980 613567650 609087944
1607.2 609087944 604285598 599510968 595456004 591058910 585516214 581452787 578624129 575019360
1623.5 575019360 571196496 567895651 565283775 563933551 563143432 561879873 561356902 562148333 563630164
1641.8 563630164 565627575 567734718 570011258 572906077 575696647 577943027 580803931 584382534
1658.2 584382534 588337302 592400551 596579134 600999773 605556726 610028982 614376783 618822157
1674.5 618822157 623419225 628022313 632701099 637501597 642383873 647188067 652034402 657223821
1690.8F57223821N251586N302787N592763O024301O603420O099940N529105N333960
1707.1G02961683M890561M674256M784644M840314M569710M169404L956080L692984
1723.4G38539636L280163L055990L221571L229857K912819K954781L264070L271937
1739.7G63730824L164172L410399L822982L970385L943324L992319L753841L175736
1756.1G92963982K714932K535879K250314J867890J808405J918257J704037J118242
1772.4H08881938J069606J387119J255334J015484J135528J192689J003742J030505
1788.7H17971945J140415R25601O66857Q10086R99451P95424N12183O80089Q98063
1807H25400114O50823L66569N75840P38144M12464K95639O51241O89506L16084L57151
$$ plain form
1690.8 657223821 662475407 667778194 673370957 679395258 685998678 692098618 697627723 702961683
1707.1 702961683 707852244 712526500 717311144 722151458 726721168 730890572 734846652 738539636
1723.4 738539636 741819799 744875789 748097360 751327217 754240036 757194817 760458887 763730824
1739.7 763730824 766894996 770305395 774128377 778098762 782042086 786034405 789788246 792963982
1756.1 792963982 795678914 798214793 800465107 802332997 804141402 806059659 807763696 808881938
1772.4 808881938 809951544 811338663 812593997 813609481 814745009 815937698 816941440 817971945
1788.7 817971945 819112360 820037961 820704818 821514904 822514355 823309779 823821962 824502051 825400114
1807 825400114 826050937 826417506 826993346 827731490 828143954 828439593 829090834 829780340 830096424 830453575
1827.4H30453575N92112M08232K08795L57569N55277M30226K48134L00527L71694J89722
1847.8H34115863J44899M24981L99887O8367J55747M87983L43561O9022K37823L13938
1868.2H36762071n3704q6427L38256M15743o318j18017K31981K45809n7280n602K75194
1890.7H37941706J63734j30653K7776K43544k7060j79828K07901L52621j04069k47360
1911.1H38248312J54138J87814j65879k9803K89321k0087l04877L1829J98483j91867
1931.5H38397384l01063J06513J40250k88248l28779J0311p0751l86714j63854J54019
1951.9H37269068j62006m43518j29580K1279l11971l15428O7651k3365m39703l07799
1972.3H35224628Q5593j02341m17948j13428J34826k39074m13120k4796L3260m04299
$$ plain form
1827.4 830453575 831045687 831453919 831662714 832020283 832575560 833005786 833253920 833554447 833926141 834115863
1847.8 834115863 834260762 834685743 835085630 835153997 835309744 835797727 836141288 836210310 836448133 836762071
1868.2 836762071 836708367 836621940 836960196 837375939 837369621 837251604 837483585 837729394 837672114 837666512 837941706
1890.7 837941706 838105440 837974787 838002563 838246107 838219047 838039219 838247120 838599741 838495672 838248312
1911.1 838248312 838402450 838590264 838424385 838394582 838683903 838663816 838358939 838390768 838589251 838397384
1931.5 838397384 838096321 838202834 838343084 838054836 837726057 837736368 837665617 837278903 837115049 837269068
1951.9 837269068 837107062 836663544 836533964 836555243 836243272 835927844 835995495 835972130 835532427 835224628
1972.3 835224628 835310221 835207880 834789932 834676504 834811330 834572256 834159136 834134340 834167600 833763301
1992.6H33763301l70383O2525l5643m24743k77698L7789k24888m95732j39892R3281
2013H31987917l21388n28693j32561p2896m61579l55661Q3864p2479m52817k26438
2033.4H29447269M1128k70725m22716k4199O7174l36647l27349Q8692p510l84212j85906
2055.9H27684999J85966n1618l96311j42217J26660j34885k59936R8169J40130k78472
2076.3H26972485k52247J59383O1452k70069m1842K53916m6492k95520L4452J99377
2096.7H26774895j39713j76609K13802J93477j81556r8109K18689L5107k28464O7174
2117.1H26678693L01540k4020j62840J88112K39432r8348k3365L38316J97291j53184
2137.5H27481627J8180K87294M4883j40012J90318L51250J6391r7870K01821K23756
$$ plain form
1992.6 833763301 833392918 833455443 833419800 832995057 832717359 832755148 832530260 832034528 831894636 831987917
2013 831987917 831666529 831137836 831005275 830932379 830470800 830115139 830199003 830126524 829673707 829447269
2033.4 829447269 829488397 829217672 828794956 828770757 828837931 828501284 828173935 828262627 828255117 827870905 827684999
2055.9 827684999 827870965 827819347 827423036 827280819 827407479 827272594 827012658 827110827 827250957 826972485
2076.3 826972485 826720238 826879621 826941073 826671004 826629162 826883078 826836586 826541066 826575518 826774895
2096.7 826774895 826635182 826458573 826672375 826865852 826684296 826586187 826804876 826839983 826611519 826678693
2117.1 826678693 826980233 826956213 826793373 826981485 827220917 827122569 827099204 827437520 827634811 827481627
2137.5 827481627 827499807 827787101 827831984 827691972 827882290 828233540 828249931 828152061 828353882 828577638
2157.9H28577638m8638P9215M10020K22743j15991Q9467L66151J26421o2942K10464
2178.2H29854548K98440j6808n7697K21669J78159p0155Q4519L47138J25646j45673
2198.6H30819786O6101K35737n1737j53542J75119K19345r4295p5638K15649J12594
2219H31469119j61589J4484K43783J5736j69277O6757J63257j01328j25289J25349
2239.4H31541002M0054k33829j28865J11639j4484k10762l4153J37150o3240k08557
2259.8H30935955o795P7129j29581r1791J78516J04189j50502m2439J44721k5571j53363
2282.3H30840468Q7262J95682q6069k24710J967P2420j53661j31428J02877Q762k23994
2304.7H30489576j25051N8353o9499j83701L4272J09196k37167m49002j99973l3021
$$ plain form
2157.9 828577638 828529000 828608215 829018235 829240978 829124987 829214454 829580605 829707026 829644084 829854548
2178.2 829854548 830152988 830136180 830078483 830300152 830478311 830408156 830492675 830839813 830965459 830819786
2198.6 830819786 830885887 831121624 831069887 830916345 831091464 831310809 831216514 831140876 831356525 831469119
2219 831469119 831307530 831322014 831565797 831581533 831412256 831479013 831642270 831540942 831415653 831541002
2239.4 831541002 831581056 831347227 831218362 831330001 831315517 831104755 831070602 831207752 831144512 830935955
2259.8 830935955 830929160 831006289 830876708 830784917 830963433 831067622 830917120 830874681 831019402 830993831 830840468
2282.3 830840468 830927730 831123412 831037343 830812633 830814600 830887020 830733359 830601931 830704808 830713570 830489576
2304.7 830489576 830364525 830422878 830353379 830169678 830203950 830313146 830075979 829626977 829427004 829393983
2325.1H29393983k01404j56582J44959R2864j91093j23322L4035r0599m1128L78132
2345.5H29239845O41048L76165j44780m60863n32567n34892k01106J78456J79887J13785
2365.9H28854978K77460M48465L80755L87966O05643O25431M10915L37899M05907K68281
2386.3H33003700N960J2040J51754M1187j49310r4712J6272o9916j29223K5630P7903
2408.7H32891285j01566j50442n782l7014k33948j82867K6941m3810k40683j64271
2429.1H31757843l6835j63257k32220n1141j0788k46585l21746j11877l8028j80066
2449.5H30365300j59323n662r5129k82586j95444n8233j79351k59876q3447m0352k71380
2471.9H28734517l08752q8394p5936k49684k14696m6193j11223k96235k30491r6977
$$ plain form
2325.1 829393983 829192579 829035997 829180956 829273820 829082727 828959405 828993440 828902841 828861713 829239845
2345.5 829239845 829880893 830257058 830112278 829651415 829118848 828583956 828382850 828561306 828741193 828854978
2365.9 828854978 829132438 829580903 829961658 830349624 830955267 831580698 831991613 832329512 832735419 833003700
2386.3 833003700 833009660 833021700 833173454 833214641 833065331 832970619 832986891 832916975 832787752 832813382 832891285
2408.7 832891285 832789719 832639277 832633495 832596481 832362533 832179666 832206607 832162797 831922114 831757843
2429.1 831757843 831721008 831557751 831325531 831274390 831263602 831017017 830695271 830583394 830545366 830365300
2449.5 830365300 830205977 830200315 830105186 829822600 829627156 829568923 829389572 829129696 829046249 829005897 828734517
2471.9 828734517 828425765 828337371 828261435 828011751 827797055 827750862 827639639 827343404 827112913 827015936
2492.3H27015936k08497k79307r0659j1801k15173l30448k10226j52171k00092j14799
2512.7H25202763j3471j75416l88503k81513j00314k03193l04520j36018m9531k27094
2533.1H23323190k65240j01388j29819k83778j94847k7657j49786l29733k00927n2572
2553.5H21587443k21252l38495j54436j05738l20852l64244k08855k35378l95000l21687
2573.9H18921506j42216k63810m71652l69847k35379l58939m31001k72274k50995m99964
2594.3H15625429n58376l32713l25024n19276m39406k27391l61681o10709n03481l32117
2614.7H11415255m52280n22017l46184l13699n20051n33760l37660l81589n46694m00424
2635.1H07060897k15590m06086o19173m46022k80022m58837n30362l25978l11672n37873
$$ plain form
2492.3 827015936 826807439 826528132 826437473 826425672 826210499 825880051 825669825 825517654 825317562 825202763
2512.7 825202763 825189292 825013876 824625373 824343860 824243546 824040353 823735833 823599815 823550284 823323190
2533.1 823323190 823057950 822956562 822826743 822542965 822348118 822320461 822170675 821840942 821640015 821587443
2553.5 821587443 821366191 821027696 820873260 820767522 820446670 820082426 819873571 819638193 819243193 818921506
2573.9 818921506 818779290 818515480 818043828 817673981 817438602 817079663 816648662 816376388 816125393 815625429
2594.3 815625429 815067053 814734340 814409316 813890040 813450634 813223243 812861562 812250853 811747372 811415255
2614.7 811415255 810962975 810440958 810094774 809781075 809261024 808727264 808389604 808008015 807461321 807060897
2635.1 807060897 806845307 806439221 805820048 805374026 805094004 804635167 804104805 803778827 803467155 802929282
2655.5H02929282n53846l48985l54946n15759m40896k88724l93689n03183l14772j61528
2675.9G99052954l41952m52936k69592k45392m67896m60864k39133k65003m30822l52502
2696.3G95526862k62141m53651n94735m51863l96013n95570o68347n15640n41031p50542
2716.7G90297329o92904m73499n47111o91831n38647l90172m96090m86374j95860q4401
2737.1G85700440l23474m07577k14517k57373n06520m93645l74854m93348o06894m62473
2757.5G81559765l90350o06657p29978n97655n74172p39515p34329n85437p11977r86159
2777.9G74903536r77636q44717r24408j017272q79288q50558j124382j240433j038432
2796.2G66006410j025975j307845j370072j247287j415431j678050j656830j633048
$$ plain form
2655.5 802929282 802375436 802026451 801671505 801155746 800714850 800426126 800032437 799529254 799214482 799052954
2675.9 799052954 798711002 798258066 797988474 797743082 797275186 796814322 796575189 796310186 795879364 795526862
2696.3 795526862 795264721 794811070 794216335 793764472 793368459 792772889 792104542 791588902 791047871 790297329
2716.7 790297329 789604425 789130926 788583815 787891984 787353337 786963165 786467075 785980701 785784841 785700440
2737.1 785700440 785376966 784969389 784754872 784497499 783990979 783497334 783122480 782629132 782022238 781559765
2757.5 781559765 781169415 780562758 779832780 779235125 778660953 777921438 777187109 776601672 775889695 774903536
2777.9 774903536 773925900 773081183 772156775 771139503 770260215 769409657 768285275 767044842 766006410
2796.2 766006410 764980435 763672590 762302518 761055231 759639800 757961750 756304920 754671872
2812.5G54671872j867295k075612k100766k288699k750576l135979l466785m127502
2828.9G32858658n091071o124258p506371r617507j2228668j4854908j7481268k0235657
2845.2F39718950k2273481k1918237j7729879r620309J75953Q061767J1701584J1305570
2861.5E99421918Q503020M847706J634419K88784J539528M015685N425274M959106
2877.8F30635440L116072N39779k094626m194260n660474o751895p441700p612824
2894.1F00535512p619500p824779q094787q360148q981407j0173380j1829257j3960242
2910.4E23692012j6602755j9216150k0697474k0117194j7037183j1367440l813297
2924.7D14840519L958524J0275125J4518023J7141938J8489659J8430322J6986042
$$ plain form
2812.5 754671872 752804577 750728965 748628199 746339500 743588924 740452945 736986160 732858658
2828.9 732858658 727767587 721643329 714136958 704519451 692290783 677435875 659954607 639718950
2845.2 639718950 617445469 595527232 577797353 568177044 568352997 576414764 588116348 599421918
2861.5 599421918 607924938 612772644 614407063 614695847 616235375 620251060 625676334 630635440
2877.8 630635440 633751512 634291291 632196665 628002405 622341931 615590036 608148336 600535512
2894.1 600535512 592916012 585091233 576996446 568636298 559654891 549481511 537652254 523692012
2910.4 523692012 507089257 487873107 467175633 447058439 430021256 418653816 414840519
2924.7 414840519 418799043 429074168 443592191 460734129 479223788 497654110 514640152
2939E14640152J4288486J0404348N744576J212120k215504l813267l200769n13792
2955.3E36546350L247976O812274R778619J2279928J4090717J4847934J4591515J3602197
2971.6F25797510J2043297J0149658Q462250P171154N915642M733980L945351L377497
2987.9F81596339K748430K092599J532793J087666O13391K16008R5784j6987j90794
3006.3F89775229o4970K79189L31878Q5712q405L8743r7692k93314l26335l65913m58598
3028.7F88895524m71831m54366o27577r15766q83639o94454q06749j024842j023054
3047.1F81993246r25660r90093j129925j095891j002729j022696r72629p92861p28786
3065.5F73331976q48889r05633p84398p10904o65307n12302n89907r16124j002788
$$ plain form
2939 514640152 528928638 539332986 545077562 546289682 544074178 540260911 537060142 536546350
2955.3 536546350 539794326 546606600 556385219 568665147 582755864 597603798 612195313 625797510
2971.6 625797510 637840807 647990465 656452715 663623869 669539511 674273491 678218842 681596339
2987.9 681596339 684344769 686437368 687970161 689057827 689671218 689887226 689983010 689966023 689775229
3006.3 689775229 689710259 689989448 690321326 690407038 690398633 690437376 690339684 690046370 689720035 689354122 688895524
3028.7 688895524 688423693 687969327 687341750 686425984 685542345 684847891 684041142 683016300 681993246
3047.1 681993246 681067586 680077493 678947568 677851677 676848948 675826252 674853623 674060762 673331976
3065.5 673331976 672483087 671577454 670793056 670082152 669416845 668904543 668314636 667398512 666395724
3083.8F66395724q54075p96437r09031j016617r86397r48727r69887r97603j058995
3102.2F57857955j156807j132012r91344j077652j248300j113832r74119j180828j531124
3120.5F47451937j637220j473427j405716j483500j472533j447558j513839j481771
3136.8F35536373j375079j521707j770079j716256j535297j521170j578271j630068
3153.2F22888446j744330j875639j890123j771688j720250j804173j822233j740873
3169.5F08519137j744986j831293j847923j823604j821875j807630j748264j714468
3185.8E94179094j801729j881600j808882j749575j841008j880586j770616j736403
3202.1E79708695j827597j795590j673997j683473j740277j698494j645625j703441
$$ plain form
3083.8 666395724 665541649 664745212 663836181 662819564 661833167 660884440 659914553 658916950 657857955
3102.2 657857955 656701148 655569136 654577792 653500140 652251840 651138008 650163889 648983061 647451937
3120.5 647451937 645814717 644341290 642935574 641452074 639979541 638531983 637018144 635536373
3136.8 635536373 634161294 632639587 630869508 629153252 627617955 626096785 624518514 622888446
3153.2 622888446 621144116 619268477 617378354 615606666 613886416 612082243 610260010 608519137
3169.5 608519137 606774151 604942858 603094935 601271331 599449456 597641826 595893562 594179094
3185.8 594179094 592377365 590495765 588686883 586937308 585096300 583215714 581445098 579708695
3202.1 579708695 577881098 576085508 574411511 572728038 570987761 569289267 567643642 565940201
3218.4E65940201j749038j683236j673698j768827j728833j531124j497686j662791
3234.7E52644968j705050j594782j550138j543880j454770j392246j475274j481474
3251.1E40447354j323640j303375j455366j457692j295149j284242j386225j298129
3267.4E29643536j112163j191676j422346j433909j353860j365900j336574j266062
3283.7E19161046j305283j335799j198352j137852j305163j455069j475453j448095
3300E08499980j368463j226366j225590j505435j799822j837939j698673j654148j719415
3318.4D94464129j692235j624853j700759j856237j859755j803577j863539j837432
3334.7D80225742j702815j792252k044678k091408k020061k025962j978069j968772
$$ plain form
3218.4 565940201 564191163 562507927 560834229 559065402 557336569 555805445 554307759 552644968
3234.7 552644968 550939918 549345136 547794998 546251118 544796348 543404102 541928828 540447354
3251.1 540447354 539123714 537820339 536364973 534907281 533612132 532327890 530941665 529643536
3267.4 529643536 528531373 527339697 525917351 524483442 523129582 521763682 520427108 519161046
3283.7 519161046 517855763 516519964 515321612 514183760 512878597 511423528 509948075 508499980
3300 508499980 507131517 505905151 504679561 503174126 501374304 499536365 497837692 496183544 494464129
3318.4 494464129 492771894 491147041 489446282 487590045 485730290 483926713 482063174 480225742
3334.7 480225742 478522927 476730675 474685997 472594589 470574528 468548566 466570497 464601725
3351D64601725k150356k304316k251238k081990k017379k065301j988887j883597k024233
3369.3D45834428k266884k224922j939684j774073j737922j683325j601606j475335
3385.7D31130677j197248q74162r13233j238048j228660p98672n68301q57234j133174
3404D22321945r03487n91904n13464m31478m05878m57257l39627j85847j48446j3590
3424.4D18330967K48135M55379M86970N15610O76274O68764M39793M31925P62195J032680
3444.8D24048692J055926J079440J244337J333385J359284J521111J678645J575023
3461.1D34895843J526445J851261K044350J758367J405954J432717J672238J902014
3477.4D48489189J988322J797676J718074J869827J871616J847565J994789K104133
$$ plain form
3351 464601725 462451369 460147053 457895815 455813825 453796446 451731145 449742258 447858661 445834428
3369.3 445834428 443567544 441342622 439402938 437628865 435890943 434207618 432606012 431130677
3385.7 431130677 429933429 429059267 428146034 426907986 425679326 424880654 424312353 423455119 422321945
3404 422321945 421418458 420826554 420313090 419881612 419475734 419018477 418678850 418493003 418344557 418330967
3424.4 418330967 418579102 419034481 419521451 420037061 420713335 421382099 421821892 422253817 423016012 424048692
3444.8 424048692 425104618 426184058 427428395 428761780 430121064 431642175 433320820 434895843
3461.1 434895843 436422288 438273549 440317899 442076266 443482220 444914937 446587175 448489189
3477.4 448489189 450477511 452275187 453993261 455863088 457734704 459582269 461577058 463681191
3493.8D63681191K139896K128303K114803K104402J985609J893908J958758K138376
3510.1D80145246K363831K374321K212524K270848K476692K566159K443045K247185
3526.4D99099851K218783K402782K660275K800405K701222K575458K808809L096700
3542.7E20364285K899706K488434K561748K817095K818286K898931L088475L142118
3559E43079078L151179L201305L028512K885879L277719L604948L505826L460288L591299
3577.4E72786033L791154M081487M276634L932118L335059L624320M157185M095018
3593.7F04079008M045069M249931M281997M282177M454136M340470M114091M275739
3610F38122618M453838M509687M508019M205704M183590M548192M711986M322946L527880
$$ plain form
3493.8 463681191 465821087 467949390 470064193 472168595 474154204 476048112 478006870 480145246
3510.1 480145246 482509077 484883398 487095922 489366770 491843462 494409621 496852666 499099851
3526.4 499099851 501318634 503721416 506381691 509182096 511883318 514458776 517267585 520364285
3542.7 520364285 523263991 525752425 528314173 531131268 533949554 536848485 539936960 543079078
3559 543079078 546230257 549431562 552460074 555345953 558623672 562228620 565734446 569194734 572786033
3577.4 572786033 576577187 580658674 584935308 588867426 592202485 595826805 599983990 604079008
3593.7 604079008 608124077 612374008 616656005 620938182 625392318 629732788 633846879 638122618
3610 638122618 642576456 647086143 651594162 655799866 659983456 664531648 669243634 673566580 677094460
3628.4F77094460L792583M424453M288793M064202L976941L965617M056930M114449
3644.7G09778428L750086L068507L067672L517568L281832L011346L231883L093123
3661G35800445K729058K816320K816319K165616K107680K366781J604021J483082K036929
3679.4G55926251K105654K248823K331853J858056J169920J176894J521110J577437
3695.7G69915998J439929J141548Q04067R69589J313209J163781N79178J91093P15911
3714G78234303J113117Q49545N28514M02689K98977L11375P48932R52959N96285J47343
3734.4G84184039N9783O20306J085281L74019n35548L64125P24971k85625j84298O57738
3754.8G87064791O35147J73390K03371M79519M28438K67566k4319p8619L15071M76777
$$ plain form
3628.4 677094460 680887043 685311496 689600289 693664491 697641432 701607049 705663979 709778428
3644.7 709778428 713528514 716597021 719664693 723182261 726464093 729475439 732707322 735800445
3661 735800445 738529503 741345823 744162142 746327758 748435438 750802219 752406240 753889322 755926251
3679.4 755926251 758031905 760280728 762612581 764470637 765640557 766817451 768338561 769915998
3695.7 769915998 771355927 772497475 773301542 774271131 775584340 776748121 777327299 777518392 778234303
3714 778234303 779347420 780196965 780725479 781128168 781427145 781738520 782487452 783440411 784036696 784184039
3734.4 784184039 784243822 784864128 785949409 786323428 785787880 786152005 786876976 786591351 786407053 787064791
3754.8 787064791 787699938 787873328 788076699 788556218 788984656 789252222 789227903 789149284 789464355 789941132
3775.2G89941132K77698J1742M9412J48476M1067R2387K54691K96295K23040J48058
3795.6G91483998L04520N3406m42803Q7560J77800l02851J34170O62088L07858k72929
3816G92192817J14083L2485m88162J6987K96950J87516J16945J73449L86417J3173
3836.4G93042660o17862l51906P0214J06693K90513O24597L58879j054644j277566
3854.8G91191578L87072P78795K56538j76012j02818J70409j97470m00007q9228K4378
3875.2G91843235J90914J2696j21236P8976j20342j3232J22905k81274j57595K94387
3895.5G91849434J12594k75612l18945l00586j75416R1135J46747J02341L6359j54436
3915.9G91113615k20001n5909k5034j66654r3580R8825J6808j15275k6584J1742K8491
$$ plain form
3775.2 789941132 790218830 790230572 790279984 790428460 790469527 790561914 790816605 791112900 791335940 791483998
3795.6 791483998 791788518 791841924 791399121 791486681 791664481 791361630 791495800 792157888 792465746 792192817
3816 792192817 792306900 792339385 791851223 791868210 792165160 792352676 792469621 792643070 793029487 793042660
3836.4 793042660 792424798 792072892 792143106 792249799 792540312 793164909 793523788 792469144 791191578
3854.8 791191578 791578650 792357445 792613983 792437971 792335153 792505562 792308092 791908085 791818857 791843235
3875.2 791843235 792034149 792046845 791925609 792004585 791884243 791871011 791993916 791712642 791555047 791849434
3895.5 791849434 791962028 791686416 791367471 791066885 790891469 790982604 791129351 791231692 791268051 791113615
3915.9 791113615 790893614 790837705 790812671 790646017 790552437 790651262 790668070 790552795 790526211 790537953 790566444
3938.4G90566444R3103l6299j37806o3956l6836l4988j0967M77n901o0856r7037J3173
3962.9G90188551Q3566l3439p4148N4062Q2731o259l57L4988K6047J1206m5359j12236
3987.3G90209353j01507M5717K15888J69158j1325
3997.5G90527284
$$ plain form
3938.4 790566444 790659547 790623248 790485442 790421486 790384650 790349662 790338695 790339172 790333271 790272415 790175378 790188551
3962.9 790188551 790272117 790238678 790164530 790218592 790301323 790295064 790294707 790329695 790355742 790366948 790321589 790209353
3987.3 790209353 790107846 790153563 790369451 790538609 790527284
3997.5 790527284
##END=$$ End of the data block
