##TITLE=$$ Begin of the data block
##JCAMP-DX=5.00 $$ ACD/SpecManager v 10.08
##SPECTROMETER/DATA SYSTEM=Alpha
##DATE=14 Apr 2014 11:23:48
##DATA TYPE=INFRARED SPECTRUM
##DATA CLASS=XYDATA
##ORIGIN=
##OWNER=
##NPOINTS=1765
##FIRSTX=399.75695801
##LASTX=3997.56933594
##MAXX=3997.56933594
##MINX=399.75695801
##MAXY=0.83896375
##MINY=0.41521081
##XFACTOR=1.0000000000
##YFACTOR=1.000000000000000e-9
##FIRSTY=0.65524358
##DELTAX=2.03957629
##XUNITS=1/CM
##YUNITS=ARBITRARY UNITS
##XYDATA=(X++(Y..Y))
399.8F55243576k698601j638591O06418o23703k022207j49548Q62837p87855j251697
418.1F47540629J06931o13392j924634o81221O86705j66059o74665L4869k70188j157343
438.5F42881632l82900Q99970J90199q89779N9426Q27015m93944j074672Q2851j21594
458.9F41978204j364410o85572N53786k98857j265228j75297K84731j034439j098155
477.3F36894763K98440K79903r45091o49929M35054j03652j058698l82840J70767r26554
497.7F34012163j285613N841K75612q88109p81119L12507l95775j632869o44266K93731
518.1F29272103j033842j567304j46389o4791j548826j082421M69387l26634j594722
536.4F22376561k73824Q34167n95748j272798K40624L15726j350760r85682N49674
$$ plain form
399.8 655243576 652544975 650906384 651512802 650889099 648866892 648717344 649580181 648792326 647540629
418.1 647540629 647647560 647034168 645109534 644428313 645115018 644948959 644274294 644309163 644038975 642881632
438.5 642881632 642498732 643398702 643588901 642699122 642758548 643585563 643091619 642016947 642099798 641978204
458.9 641978204 640613794 639928222 640482008 640183151 638917923 638742626 639027357 637992918 636894763
477.3 636894763 637193203 637473106 636528015 635878086 636313140 636209488 635150790 634767950 634938717 634012163
497.7 634012163 632726550 632732391 633008003 632119894 631338775 631651282 631255507 629622638 628978372 629272103
518.1 629272103 628238261 626670957 626524568 626459777 624910951 623828530 624297917 623971283 622376561
536.4 622376561 622102737 622936904 622341156 621068358 621308982 621624708 620273948 619288266 619837940
554.8F19837940l31879j933157q71480L67582j160383k243758q00490m49359j986027
573.1F10428989j665831R4354n30540k027274o78956P33733q22127j540005O12616
591.5F04604959J181424q56101q12590J063227L73244j354873j20520J424014n9962
609.8F05442822j081586P31170J385331j3947R19878L346801K800942J036048K157628
628.2F16725087L605068K010226P71642K404511K731979L55541r7155J844704J849830
646.5F32201433L71099J037001J802147j72377q34167K409577M110516K006113Q93653
664.9F43824995K203106K563060J144111K078593L348052J796603K79367J969576K827108
683.3F62034571O73175J76787K128244J590848p13349k9861J608014K27093j049637
$$ plain form
554.8 619837940 619506061 617572904 616701424 617069006 615908623 613664865 612864375 612415016 610428989
573.1 610428989 608763158 608857512 608326972 606299698 605620742 606354475 605532348 603992343 604604959
591.5 604604959 605786383 604930282 604117692 605180919 605554163 604199290 604078770 605502784 605442822
609.8 605442822 604361236 605092406 606477737 606463790 607383668 610730469 613531411 614567459 616725087
628.2 616725087 620330155 622340381 623112023 625516534 628248513 628604054 628506899 630351603 632201433
646.5 632201433 632572532 633609533 635411680 635239303 634405136 636814713 640925229 642931342 643824995
664.9 643824995 646028101 648591161 649735272 651813865 655161917 656958520 657237887 659207463 662034571
683.3 662034571 662707746 662884533 665012777 666603625 665890276 665860415 667468429 667695522 666645885
701.6F66645885R42289K221346L65675j41144K016962J943707n07474l66628J639306
720F74759924J316488N12004K338290L505349J481772M18127K101123K073586k20537
738.3F88286126q1599J984179J442671j66714J125872K657473J165390J49607J977146
756.7F98540151K468944K77102l3737J875937J526356m13000J87516J460492j48713
775G05741048j711011m21226J39117j798391k007306M09186J064241k9624J295329
793.4G02681363L889143L734648K713681M139244N160749L209174J991451L304958
809.7G30824411L115535P50124M16637J589059J31846k399027k207578j663267l755331
828.1G26802409n140305l513336k559543l766954l589034j734197j777768k947629
$$ plain form
701.6 666645885 667588174 669809520 670175195 670034051 672051013 673994720 673487246 673120618 674759924
720 674759924 676076412 676588416 678926706 682432055 683913827 684331954 686433077 688506663 688286126
738.3 688286126 688204527 690188706 691631377 691464663 692590535 695248008 696413398 696563005 698540151
756.7 698540151 701009095 701286197 701252460 703128397 704654753 704241753 704429269 705889761 705741048
775 705741048 704030037 703608811 703747928 701949537 699942231 700351417 701415658 701386034 702681363
793.4 702681363 706570506 710305154 713018835 717158079 722318828 725528002 727519453 730824411
809.7 730824411 733939946 734690070 735106707 736695766 736827612 734428585 732221007 730557740 726802409
828.1 726802409 721662104 718148768 715589225 711822271 708233237 706499040 704721272 701773643
844.4G01773643j627981P89463J212538J651823M415751O547033N964041N827844P393241
862.7G33947396P306397N173862M562915N218446L757655J570642J874388K383232
879.1G65794933L42607j404524p97867r34661k777099k820134r25363o00218j270414
897.4G54607260R4295J848042J146853J20282R31323R71376j180410k457261j987577
915.8G54094183k675652m281282l729582j871825j559257j559258J66119J470685N48541
934.1G40602672j08182Q47399Q56757n81145p26819K06649n40852k161563k213955
952.5G36180961k126098l866195n532384n635440o250501q203268r189785q716702
968.8F86660588q742690r051800p770598n748272n057096m858256l670335k715766
$$ plain form
844.4 701773643 700145662 700935125 702147663 703799486 708215237 714762270 720726311 726554155 733947396
862.7 733947396 741253793 746427655 750990570 756209016 759966671 761537313 763411701 765794933
879.1 765794933 766137540 764733016 763935149 763000488 760223389 757403255 756477892 755877674 754607260
897.4 754607260 754701555 756549597 757696450 757816732 758748055 759719431 758539021 756081760 754094183
915.8 754094183 751418531 747137249 743407667 741535842 739976585 738417327 738583446 740054131 740602672
934.1 740602672 740494490 741341889 742198646 741617501 740890682 741097331 740556479 738394916 736180961
952.5 736180961 734054863 730188668 724656284 719020844 712770343 704567075 695377290 686660588
968.8 686660588 677917898 668866098 661095500 655347228 650290132 645431876 641761541 639045775
985.1F39045775l038883l070236k008438j525640j957536j589179n84364o51359j364410
1003.5F23255730j294732j223445k269686l189087k891361k678037l275454l247917
1019.8F03186011k294957j991630k395391k065301j284898j360416j674414j078486
1036.1E89040518m77374q05795j020432n04434l89158r88484j054883l97920j24216
1054.5E83277822o0142P43211J588225J385570P91728O20604J32262j034438j617015
1072.8E85827827j156568q49545r51231n40137M3035k32578q90910q97408o63638q24630
1093.2E78864217o49572K42412Q14856O54459P33077J210988J113414N98789O15239
1111.6E84197879P39217R1612q22306j276970j531005j502335o06715O47306J155019
$$ plain form
985.1 639045775 636006892 632936656 630928218 629402578 627445042 625855863 625271499 624620140 623255730
1003.5 623255730 621960998 620737553 618467867 615278780 612387419 609709382 606433928 603186011
1019.8 603186011 600891054 598899424 596504033 594438732 593153834 591793418 590119004 589040518
1036.1 589040518 588563144 587757349 586736917 586232483 585843325 584854841 583799958 583402038 583277822
1054.5 583277822 583217680 583960891 585549116 586934686 587726414 588347018 588479280 587444842 585827827
1072.8 585827827 584671259 583821714 582870483 582330346 582373381 582140803 581249893 580352485 579688847 578864217
1093.2 578864217 578214645 578457057 579271913 579926372 580659449 581870437 582983851 583582640 584197879
1111.6 584197879 584937096 585028708 584206402 582929432 581398427 579896092 579289377 579936683 581091702
1129.9E81091702P95662N01454P75159J012742J052320J373172J562238J086831O91116
1148.3E89942396R19997J066566Q97169J175463J943350K427936K715289L511727M477799
1166.6F09077692M863501N063831N578995N765259N236626M806042M728317M095376
1182.9F49215639K755582J561224N58019q02576k017081k303899k128422k076387j717329
1201.3F43044770r44257n75900q11577r27031q64863j220644j681566j510382j144767
1219.7F33363783j259267j319230q11517l38614l16620j58310L71159N87582M03345
1238F30522311N22554Q30650O42955K30849K35677K66492j85013m80175j69754N7817
1258.4F32474363l6359K95937J064181J416266J404882J802265K391756K460003K404571
$$ plain form
1129.9 581091702 581887364 582388818 583163977 584176719 585229039 586602211 588164449 589251280 589942396
1148.3 589942396 590862393 591928959 592826128 594001591 595944941 598372877 601088166 604599893 609077692
1166.6 609077692 613941193 619005024 624584019 630349278 635585904 640391946 645120263 649215639
1182.9 649215639 651971221 653532445 654090464 653287888 651270807 648966908 646838486 644762099 643044770
1201.3 643044770 642100513 641524613 640713036 639786005 638921142 637700498 636018932 634508550 633363783
1219.7 633363783 632104516 630785286 629973769 629635155 629318535 629160225 629531384 630118966 630522311
1238 630522311 631044865 631875515 632518470 632749319 632984996 633251488 633066475 632586300 632416546 632474363
1258.4 632474363 632438004 632733941 633798122 635214388 636619270 638421535 640813291 643273294 645677865
1276.8F45677865K824604L154934K951681K955079L441692L520786L022492K822459
1293.1F70371592K903223K508998J966536K025783K211094J865566J590609J897455
1309.4F87340856J994073J480341J264572J558960J451611J033723J153112J441538
1325.7F98718786J067162N04613M79579M18842j59562m96745q3804L15010K15769K74122
1346.1G01253772N84662L68654j23083l1471R6976o31928j747549k542555k716243
1364.5F94511235k337516j938045k070784l488243n057931l729820l63827J507640
1380.8F77032709J490653J788318K349496J639724O40273J79469n44429j440704j808583
1399.1F81326926j526058j597106k215505j962483j358986j539230j592994q68022
$$ plain form
1276.8 645677865 648502469 651657403 654609084 657564163 661005855 664526641 667549133 670371592
1293.1 670371592 673274815 675783813 677750349 679776132 681987226 683852792 685443401 687340856
1309.4 687340856 689334929 690815270 692079842 693638802 695090413 696124136 697277248 698718786
1325.7 698718786 699785948 700290561 700770140 701188982 701029420 700532675 700448871 700763881 700979650 701253772
1346.1 701253772 701838434 702207088 702084005 702052534 702149510 701517582 699770033 697227478 694511235
1364.5 694511235 692173719 690235674 688164890 684676647 679618716 675888896 675525069 677032709
1380.8 677032709 678523362 680311680 682661176 684300900 684941173 685120642 684576213 683135509 681326926
1399.1 681326926 679800868 678203762 675988257 674025774 672666788 671127558 669534564 668666542
1415.5F68666542p08461j541853j269460m55141o31154j299619j811266j709700j619398
1433.8F57620490k488912k672910j558960j576006k029598j778126j784801k228081
1450.1F41503096k232552j491904o96957O41048K681076L764987M210115N904615R777963
1468.5F64061487J3980448J5971243J3047219R247899P108032N232811L854096K963662
1484.8G35466897J649201k38537j189173r24527j597226l147900l292322k547860k402485
1503.2G21776068l584385n580842m734218l659010l376961k774298k393246k233744
1519.5F93439364k359390k042532j931190k211631j441359j195014k111852j537144
1535.8F78609252m63247j470864k117634o23047M72486O94275O40869J186549J920641
$$ plain form
1415.5 668666542 667958081 666416228 665146768 664691627 664060473 662760854 660949588 659239888 657620490
1433.8 657620490 655131578 652458668 650899708 649323702 647294104 645515978 643731177 641503096
1450.1 641503096 639270544 637778640 637081683 637722731 640403807 644168794 648378909 654283524 664061487
1468.5 664061487 678041935 694013178 707060397 716308296 723416328 728649139 732503235 735466897
1484.8 735466897 737116098 736877561 735688388 734763861 733166635 730018735 726726413 724178553 721776068
1503.2 721776068 718191683 712610841 707876623 704217613 700840652 698066354 695673108 693439364
1519.5 693439364 691079974 689037442 687106252 684894621 683453262 682258248 680146396 678609252
1535.8 678609252 678146005 676675141 674557507 673934460 674406946 675101221 675742090 676928639 678849280
1554.1F78849280K006113R68576J89185Q35955N73814K2650m88460j458705j608729
1572.5F79889679j888275l404975l634036l116846l262818l541588m072130m464328
1588.8F52504683m490734m655778n101919n119026m795372m850388m987836m669905
1605.1F13833725m466056m800678m774987m064203m401743n525827m053653k858221
1621.4E78888357l636957l813624l264189k564728j339972q62837j374423n25415Q64267
1639.8E62370479J523316J986921K045035K222657K900780K804935K263307K894044
1656.1E81011474L595650L965021M085421M182875M373014M481435M432857M350722
1672.4F14478469M452824M616321M636526M672110M703462M774094M818320M926264
$$ plain form
1554.1 678849280 680855393 681823969 682013154 682849109 683422923 683445573 682957113 681498408 679889679
1572.5 679889679 678001404 674596429 670962393 667845547 664582729 661041141 656969011 652504683
1588.8 652504683 648013949 643358171 638256252 633137226 628341854 623491466 618503630 613833725
1605.1 613833725 609367669 604566991 599792004 595727801 591326058 585800231 581746578 578888357
1621.4 578888357 575251400 571437776 568173587 565608859 564268887 563406050 562031627 561506212 562370479
1639.8 562370479 563893795 565880716 567925751 570148408 573049188 575854123 578117430 581011474
1656.1 581011474 584607124 588572145 592657566 596840441 601213455 605694890 610127747 614478469
1672.4 614478469 618931293 623547614 628184140 632856250 637559712 642333806 647152126 652078390
1688.8F52078390N252421N242586N226195N535483O044865O658435O111979N524278
1705.1F97674632N367220M917025M665494M765391M806340M540026M226148M069150
1721.4G35031426L776431L319979L071487L210663L175498K856433K979517L317535
1737.7G60738969L293693L163397L417015L831566L955483L939033M018485L759682
1754G90117323L166616K693355K484024K220452J884818J823246J913727J684785J102864
1772.4H09091210J082003J415372J277149J018942J141846J218080J017809J009226
1788.7H18271637J096070R04381O80029Q08776R81033P97569N33760O94871R05097
1807H25673223O46710L48508N72443P57337M41253L15607O30080O41287L01063L74019
$$ plain form
1688.8 652078390 657330811 662573397 667799592 673335075 679379940 686038375 692150354 697674632
1705.1 697674632 703041852 707958877 712624371 717389762 722196102 726736128 730962276 735031426
1721.4 735031426 738807857 742127836 745199323 748409986 751585484 754441917 757421434 760738969
1737.7 760738969 764032662 767196059 770613074 774444640 778400123 782339156 786357641 790117323
1754 790117323 793283939 795977294 798461318 800681770 802566588 804389834 806303561 807988346 809091210
1772.4 809091210 810173213 811588585 812865734 813884676 815026522 816244602 817262411 818271637
1788.7 818271637 819367707 820272088 820952117 821760893 822741926 823539495 824073255 824768126 825673223
1807 825673223 826319933 826668441 827240884 827998221 828439474 828755081 829385161 830026448 830327511 830701530
1827.4H30701530N85616L83854K06887L84927N94795M58658K45213K60770L43562J97947
1847.8H34363759J58429M41432M18842P2300J36435M62770L28660O4731K24948K89500
1868.2H36961806m5061n3168L46542M08232J79j08957K42352K72572l5822k623K80023
1890.7H38266075J69694j59085j4245K39372q523j71543J90437L27289r7572k11537
1911.1H38530362J81079J89662j87219n0425L00288m77k94328N5492K19942k02954
1931.5H38741422l32415P9333J41740k72095l31521J7941m1246l70324j54495J69038
1951.9H37647378j64568m70519j48952J5736l19422l14593O1572n5731m60326k82526
1972.3H35508049J18970j11043m33743q9228J73747k39789m44114m0293J7524m18902
$$ plain form
1827.4 830701530 831287146 831671000 831877887 832262814 832857609 833316267 833561480 833822250 834165812 834363759
1847.8 834363759 834522188 834963620 835382462 835454762 835591197 836053967 836382627 836447358 836672306 836961806
1868.2 836961806 836916745 836863577 837210119 837618351 837618530 837509573 837751925 838024497 837988675 837986052 838266075
1890.7 838266075 838435769 838276684 838262439 838501811 838493288 838321745 838512182 838839471 838741899 838530362
1911.1 838530362 838711441 838901103 838713884 838663459 838963747 838963270 838668942 838724434 838944376 838741422
1931.5 838741422 838409007 838488340 838630080 838357985 838026464 838044405 838003159 837632835 837478340 837647378
1951.9 837647378 837482810 837012291 836863339 836879075 836559653 836245060 836306632 836250901 835790575 835508049
1972.3 835508049 835627019 835515976 835082233 834993005 835166752 834926963 834482849 834442556 834460080 834041178
1992.6H34041178l40223J33455N543m58002l27587J7881k30133m82858j20759Q1599
2013H32320094l43680n23091j12950o4016m58181l61025N4240r9897m64320k42591
2033.4H29704583M9829k14577l77416j1623Q3446l27348l46005N7459l0041m03702
2053.8H28184605k13623J61409n9485l83735j19865J39654j47283k80023R5308J53959
2074.2H27530921k36750k13742J49786L9756k74956m2796K54273n4061l02911M7446
2094.6H26896966K14934j41323j81019K30968J96159k14338j06395K30551M4048k08080
2115H26962471O9797K81692j4365j13487K20358K30074j21117n8472K85626J64389
2135.4H27906966j38342N0545L03506N3704j30951J97708L56019J4245q2373K48849
$$ plain form
1992.6 834041178 833700955 833834410 833839953 833381951 833054364 833072245 832842112 832359254 832238495 832320094
2013 832320094 831976414 831453323 831340373 831276357 830818176 830457151 830511391 830411494 829947174 829704583
2033.4 829704583 829754412 829539835 829162419 829150796 829234242 828906894 828560889 828618348 828588307 828184605
2053.8 828184605 827970982 828132391 828072906 827689171 827569306 827708960 827561677 827281654 827376962 827530921
2074.2 827530921 827294171 827080429 827230215 827269971 826995015 826952219 827206492 827152431 826849520 826896966
2094.6 826896966 827111900 826970577 826789558 827020526 827216685 827002347 826895952 827126503 827170551 826962471
2115 826962471 827032268 827313960 827299595 827186108 827406466 827636540 827515423 827456951 827742577 827906966
2135.4 827906966 827768624 827819169 828122675 828176379 828045428 828243136 828599155 828613400 828531027 828779876
2155.8H28779876K66731l9160M8458L41297J56283j15335J37448L62993O7889q4698
2176.2H29921782K37465L19123k146j0311K92539J99736j10150L4630L00169R8885
2196.6H31281722j31905Q2850K24769m3988j11818J99079K22743p9513n6922K09808
2217H31796825Q7976j85549J073K59936N2571j53005N7817J37746j40309j50264J32442
2239.4H31897259P8201j86503q8632J19984o3062k52783k0146J40250j02938k19702
2259.8H31301928L0040R8586j43170j00493J89423J02282j75953n4002J56760j7047
2280.2H31388354j32739J10864J85430r8764k09570J2219N8054j63555j33991R6738
2300.6H31113040J3948k01941r6082P3135p6116k07424L279J12056j77145l71992j56761
$$ plain form
2155.8 828779876 829046607 829007447 829055905 829397202 829553485 829438150 829575598 829938591 830006480 829921782
2176.2 829921782 830159247 830478370 830476224 830465913 830758452 830958188 830848038 830882668 831182837 831281722
2196.6 831281722 831149817 831232667 831457436 831413448 831301630 831500709 831723452 831643939 831587017 831796825
2217 831796825 831884801 831699252 831700325 831960261 832012832 831859827 831917644 832055390 831915081 831764817 831897259
2239.4 831897259 831975460 831788957 831700325 831820309 831757247 831504464 831484318 831624568 831521630 831301928
2259.8 831301928 831331968 831430554 831287384 831186891 831376314 831478596 831302643 831248641 831405401 831388354
2280.2 831388354 831255615 831366479 831551909 831453145 831243575 831255794 831313848 831150293 831016302 831113040
2300.6 831113040 831126988 830925047 830828965 830902100 830825984 830618560 830621839 830733895 830556750 830184758 830027997
2323.1H30027997k5212j75774j31548P6711J550k15888j07229J36793K0862q0765L17574
2345.5H29845071O40690L56913j57416m16517m65453m92334k19584J06573J26064Q9824
2365.9H29413831K40684M03464L86417M29332O03199N78284L75927L23951L84033K42590
2386.3H33381712j2874n484J37270K9564j52231p9989K9147o7950j05798P3433R8884
2408.7H33325684j40488j95861m470l338j80245j39296L0697o2645k57492j79469m1128
2431.2H32151949j42395k29716q3506j1802j99557k86579j01208l7253j91450j74880
2451.5H30693603k9803j13070k72333j97232q9288j93715k40743n1618j9789k69830
2471.9H29216182l33547j25349q5413k43426k09987m8637j35422l15666k20299p1108
$$ plain form
2323.1 830027997 830002785 829827011 829695463 829772174 829773724 829557836 829450607 829587400 829608262 829527497 829845071
2345.5 829845071 830485761 830842674 830685258 830268741 829803288 829310954 829091370 829197943 829324007 829413831
2365.9 829413831 829654515 830057979 830444396 830873728 831476927 832055211 832431138 832755089 833139122 833381712
2386.3 833381712 833368838 833363354 833500624 833530188 833377957 833297968 833327115 833259165 833153367 833226800 833325684
2408.7 833325684 833185196 832989335 832984865 832981527 832801282 832661986 832692683 832630038 832372546 832193077 832151949
2431.2 832151949 832009554 831779838 831696332 831684530 831484973 831198394 831097186 831059933 830868483 830693603
2451.5 830693603 830663800 830550730 830278397 830081165 829991877 829798162 829557419 829505801 829486012 829216182
2471.9 829216182 828882635 828757286 828671873 828428447 828218460 828169823 828034401 827718735 827498436 827427328
2492.3H27427328j71483k33173o5267l8803k79427l50117j58847j18196k23755j56880
2512.7H25631380l6180j64270l45171k34663r3222k15530k96951j49071j02043k45452
2533.1H23748827k32875q0526j49608l19362k09093k8789j54853l37541k23756p1942
2553.5H21940482j97471l06546j58012r9242k96712l71396k27511k26498l64661k96116
2573.9H19396317j39058k73466m80473l77714k40922l51370m04238k51174k48790m96686
2594.3H16132426n61595l54111l31163m91500m34518k97308m30942n89013m57167l27051
2614.7H11858058m46141n11050l48985l23177n27978n43892l59476l78906n10693l83258
2635.1H07524502k41339m44591o39439m61161k73108m01974m69923k89440l15368n96404
$$ plain form
2492.3 827427328 827255845 827022672 826957405 826918602 826639175 826289058 826130211 826012015 825788260 825631380
2512.7 825631380 825595200 825430930 825085759 824851096 824757874 824542344 824245393 824096322 823994279 823748827
2533.1 823748827 823515952 823435426 823285818 822966456 822757363 822728574 822573721 822236180 822012424 821940482
2553.5 821940482 821743011 821436465 821278453 821179211 820882499 820511103 820283592 820057094 819692433 819396317
2573.9 819396317 819257259 818983793 818503320 818125606 817884684 817533314 817129076 816877902 816629112 816132426
2594.3 816132426 815570831 815216720 814885557 814394057 813959539 813662231 813231289 812642276 812185109 811858058
2614.7 811858058 811411917 810900867 810551882 810228705 809700727 809156835 808797359 808418453 807907760 807524502
2635.1 807524502 807283163 806838572 806199133 805737972 805464864 805062890 804592967 804303527 803988159 803391755
2655.5H03391755o08087l59058l37601m97580m29272k67208l63052m90308l51071k20776
2675.9G99467742l62694m29869k53260k56121m65214m35054k27690k83420m53830l47257
2696.3G95953333k34127m46617o20127m52578l63231n77390o57856n13494n64993p68065
2716.7G90754855o89447m63903n40674o90997n32329l82602m88460m79519k13862j43349
2737.1G86129713l73423l89934j78635k49326m97878m76718l75688n17964o13511m61220
2757.5G81995416m23909o42001p24793n57542n34951p20918p14004n53608p15912j047194
2777.9G75360584j017689q21829q98421j028419r10222q68082j112342j224160j053691
2796.2G66425729j050890j300215j349688j243174j408100j641512j613140j641453
$$ plain form
2655.5 803391755 802783668 802424610 802087009 801589429 801160157 800892949 800529897 800039589 799688518 799467742
2675.9 799467742 799105048 798675179 798421919 798165798 797700584 797265530 797037840 796754420 796300590 795953333
2696.3 795953333 795719206 795272589 794652462 794199884 793836653 793259263 792601407 792087913 791522920 790754855
2716.7 790754855 790065408 789601505 789060831 788369834 787837505 787454903 786966443 786486924 786273062 786129713
2737.1 786129713 785756290 785366356 785187721 784938395 784440517 783963799 783588111 783070147 782456636 781995416
2757.5 781995416 781571507 780929506 780204713 779647171 779112220 778391302 777677298 777123690 776407778 775360584
2777.9 775360584 774342895 773521066 772622645 771594226 770684004 769815922 768703580 767479420 766425729
2796.2 766425729 765374839 764074624 762724936 761481762 760073662 758432150 756819010 755177557
2812.5G55177557j914143k086580k099216k333283k796352l133118l433943m094243
2828.9G33286679n093575o171643p554353r629309j2197256j4820576j7480492k0237923
2845.2F40101552k2274792k1935761j7735839r613991J60456Q044243J1728525J1356056
2861.5E99830449Q506894M788518J589060K89857J527846L996312N440712M965246
2877.8F30934894L083646N35548k048671m167915n667924o745458p431865p613480
2894.1F00878775p611155p806838q081496q373856r007991j0187327j1825920j3945043
2910.4E24039149j6611099j9249141k0711541k0098567j7006666j1345237l806085
2924.7D15210813L965378J0310084J4548331J7101765J8427610J8427939J7010331
$$ plain form
2812.5 755177557 753263414 751176834 749077618 746744335 743947983 740814865 737380922 733286679
2828.9 733286679 728193104 722021461 714467108 704837799 692640543 677819967 660339475 640101552
2845.2 640101552 617826760 595890999 578155160 568541169 568701625 576745868 588474393 599830449
2861.5 599830449 608337343 613125861 614714921 615004778 616532624 620528936 625969648 630934894
2877.8 630934894 634018540 634554088 632505417 628337502 622669578 615924120 608492255 600878775
2894.1 600878775 593267620 585460782 577379286 569005430 559997439 549810112 537984192 524039149
2910.4 524039149 507428050 488178909 467467368 447368801 430362135 419016898 415210813
2924.7 415210813 419176191 429486275 444034606 461136371 479563981 497991920 515002251
2939E15002251J4294982J0383427N700886J203239k187252l799141l204584n32925
2955.3E36860883L253937O866753R799123J2241006J4079094J4882803J4604211J3594269
2971.6F26182079J2056113J0171413Q479655P187724N928397M741550L961265L389895
2987.9F82098091K728104K064944J533687J098871O13809J94549M9830l4988j66417
3006.3F90180480m0173L02911L52263Q8692k086M9591j17421l17514l11196l46899
3026.7F89838648m75645n00620m65512o17027q92401q73089o88433q00968j059711
3045.1F83465242j093566r87113j009106j081824j018048r73105j028657r67562p95424
3063.4F74510837p59900q83520r05454p76112p26581o63459m87864n66363q75294r72212
$$ plain form
2939 515002251 529297233 539680660 545381546 546584785 544397533 540598392 537393808 536860883
2955.3 536860883 540114820 546981573 556780696 569021702 583100796 597983599 612587810 626182079
2971.6 626182079 638238192 648409605 656889260 664076984 670005381 674746931 678708196 682098091
2987.9 682098091 684826195 686891139 688424826 689523697 690137506 690332055 690381885 690346897 690180480
3006.3 690180480 690140307 690443218 690795481 690884173 690882087 690931678 690814257 690496743 690185547 689838648
3026.7 689838648 689363003 688862383 688396871 687779844 686887443 686014354 685325921 684524953 683465242
3045.1 683465242 682371676 681384563 680375457 679293633 678275585 677302480 676273823 675306261 674510837
3063.4 674510837 673750937 672867417 671961963 671185851 670459270 669795811 669307947 668741584 667866290 666894078
3083.8F66894078q86321q43823q80837r23276r37343r96113j034617j016319j066804
3102.2F58308625j171827j131952r68337j051545j269221j166761r77517j125574j482486
3120.5F47963405j650155j532733j423657j429797j444816j475275j514971j455367
3136.8F36036634j367569j533985j791477j746535j551330j484454j520276j628816
3153.2F23412192j773060j865983j890003j792312j705110j788974j830280j719594
3169.5F09046876j718700j861155j873910j782060j791596j869857j841188j733482
3185.8E94574928j732528j801312j792610j795530j909614j922726j768351j711845
3202.1E80140412j784086j758993j678765j715541j767814j688778j615525j720607
$$ plain form
3083.8 666894078 666007757 665163934 664283097 663359821 662422478 661426365 660391748 659375429 658308625
3102.2 658308625 657136798 656004846 655036509 653984964 652715743 651548982 650571465 649445891 647963405
3120.5 647963405 646313250 644780517 643356860 641927063 640482247 639006972 637492001 636036634
3136.8 636036634 634669065 633135080 631343603 629597068 628045738 626561284 625041008 623412192
3153.2 623412192 621639132 619773149 617883146 616090834 614385724 612596750 610766470 609046876
3169.5 609046876 607328176 605467021 603593111 601811051 600019455 598149598 596308410 594574928
3185.8 594574928 592842400 591041088 589248478 587452948 585543334 583620608 581852257 580140412
3202.1 580140412 578356326 576597333 574918568 573203027 571435213 569746435 568130910 566410303
3218.4E66410303j794457j681865j637518j740217j731813j553595j470447j607477
3234.7E53192914j692117j615286j610338j604975j426696j322151j460194j528263
3251.1E40932894j388133j320958j417577j427412j313448j308680j344442j226068
3267.4E30186176j116037j263797j465798j419067j323581j353860j333833j253068
3283.7E19657135j278937j327515j240134j170635j291692j444340j458228j403749
3300E09041905j353144j241684j224399j517713j813948j811624j691758j672417j712114
3318.4D95003104j662969j575172j644016j848906j923531j851708j847833j829118
3334.7D80819851j721054j800835k052307k090365k002806k012103j959414j944303
$$ plain form
3218.4 566410303 564615846 562933981 561296463 559556246 557824433 556270838 554800391 553192914
3234.7 553192914 551500797 549885511 548275173 546670198 545243502 543921351 542461157 540932894
3251.1 540932894 539544761 538223803 536806226 535378814 534065366 532756686 531412244 530186176
3267.4 530186176 529070139 527806342 526340544 524921477 523597896 522244036 520910203 519657135
3283.7 519657135 518378198 517050683 515810549 514639914 513348222 511903882 510445654 509041905
3300 509041905 507688761 506447077 505222678 503704965 501891017 500079393 498387635 496715218 495003104
3318.4 495003104 493340135 491764963 490120947 488272041 486348510 484496802 482648969 480819851
3334.7 480819851 479098797 477297962 475245655 473155290 471152484 469140381 467180967 465236664
3351D65236664k120793k256572k192825k036035k008468k095819k017230j864254j995236
3369.3D46649432k273083k227395j917094j773060j760393j664013j531332j412333
3385.7D32090729j195430r28372r59665j249373j268566q62807n54949p92592j117439
3404D23161536r28908n65410m27753m03791m37945m48704l15756k01970j51396J460
3424.4D19281363K33412M60714N20498N22017O82921O70433M19825M38869P71910J022220
3444.8D25024182J068979J104742J238734J317829J356602J494526J617879J550049
3461.1D35773522J563966J861244K024740J753062J375825J408904J699359J932084
3477.4D49392706J956880J743317J705170J882284J913757J880794J947940K052545
$$ plain form
3351 465236664 463115871 460859299 458666474 456630439 454621971 452526152 450508922 448644668 446649432
3369.3 446649432 444376349 442148954 440231860 438458800 436698407 435034394 433503062 432090729
3385.7 432090729 430895299 429966927 429007262 427757889 426489323 425626516 425071567 424278975 423161536
3404 423161536 422232628 421667218 421239465 420835674 420397729 419949025 419633269 419431299 419279903 419281363
3424.4 419281363 419514775 419975489 420495987 421018004 421700925 422371358 422791183 423230052 424001962 425024182
3444.8 425024182 426093161 427197903 428436637 429754466 431111068 432605594 434223473 435773522
3461.1 435773522 437337488 439198732 441223472 442976534 444352359 445761263 447460622 449392706
3477.4 449392706 451349586 453092903 454798073 456680357 458594114 460474908 462422848 464475393
3493.8D64475393K152354K124369K080321K110511K013356J901477J959205K135128
3510.1D80952114K361685K397984K224535K241075K452642K570063K460688K270281
3526.4D99931067K237529K399504K668977K843022K708256K552033K805710L080368
3542.7E21226466K880931K510488K581834K812028K824247K883673L025591L111899
3559E43857157L173530L213287L019571K864063L249585L600598L540158L508151L609240
3577.4E73635340L775537M076361M266382L877818L301204L652632M196763M137516
3593.7F04919553M087865M268229M269183M250884M434943M330456M083813M238784
3610F38883710M440904M546761M562736M199564M125357M504323M730999M409850L581285
$$ plain form
3493.8 464475393 466627747 468752116 470832437 472942948 474956304 476857781 478816986 480952114
3510.1 480952114 483313799 485711783 487936318 490177393 492630035 495200098 497660786 499931067
3526.4 499931067 502168596 504568100 507237077 510080099 512788355 515340388 518146098 521226466
3542.7 521226466 524107397 526617885 529199719 532011747 534835994 537719667 540745258 543857157
3559 543857157 547030687 550243974 553263545 556127608 559377193 562977791 566517949 570026100 573635340
3577.4 573635340 577410877 581487238 585753620 589631438 592932642 596585274 600782037 604919553
3593.7 604919553 609007418 613275647 617544830 621795714 626230657 630561113 634644926 638883710
3610 638883710 643324614 647871375 652434111 656633675 660759032 665263355 669994354 674404204 677985489
3628.4F77985489L734887M355609M247427M027427L961146L986001M072248M085601
3644.7G10455835L750801L108561L024161L442883L270686L040314L245055L121198
3661G36459494K806067K849937K737104K060056K083779K392947J639068J531482K071917
3679.4G56631851K133310K267778K298653J807809J198232J233578J536608J590788
3695.7G70698607J455724J151979Q25346R69290J253963J095891N59747J85192O83367
3714G78879106J075029Q59321N86330M55201L53754L72290P67947R01758N16534R1255
3734.4G84858525K7060O29306J152158M57644m95553L80159P11858l73065k57016O87421
3754.8G87778497P28667K16245J55688M47571M32431K56002l7133j01269L04401N40614
$$ plain form
3628.4 677985489 681720376 686075985 690323412 694350839 698311985 702297986 706370234 710455835
3644.7 710455835 714206636 717315197 720339358 723782241 727052927 730093241 733338296 736459494
3661 736459494 739265561 742115498 744852602 746912658 748996437 751389384 753028452 754559934 756631851
3679.4 756631851 758765161 761032939 763331592 765139401 766337633 767571211 769107819 770698607
3695.7 770698607 772154331 773306310 774131656 775100946 776354909 777450800 778010547 778195739 778879106
3714 778879106 779954135 780813456 781399786 781854987 782208741 782581031 783348978 784250736 784767270 784858525
3734.4 784858525 784885585 785514891 786667049 787124693 786629140 787009299 787721157 787348092 787091076 787778497
3754.8 787778497 788507164 788723409 788879097 789326668 789759099 790015101 789977968 789876699 790181100 790721714
3775.2G90721714L48211K5570L7968J05858r417R6798K94149L57627L01779J29401
3795.6G92409658J82689j6570m37856O3538J22846k44022K75254O87182K68579k32041
3816G93079257J34051p3433n77152N9486L78429K37942R2328N5373L05891O0379m89831
3838.4G93262720k77877L2723N9664K52605O09159L69728j138151j379072M26530Q78096
3858.8G93096125L61860j03235j06514J06335k37942l29792J7285K7180J15931j6094
3879.2G92931139n8889J14143k26617j27733J14143k55882j09435L35873J12295k66791
3899.6G92562246l10659l35038k44319M2021J38104R8526N7877r0063j73450k4080
3920G91721165L4690j19984j20401L6001J19q3566m947p75J252N0008r6738j50144
$$ plain form
3775.2 790721714 791069925 791095495 791133463 791239321 791229904 791326702 791620851 791978478 792280257 792409658
3795.6 792409658 792592347 792575777 792137921 792201459 792324305 792080283 792355537 793042719 793311298 793079257
3816 793079257 793213308 793139875 792562723 792622209 793000638 793238580 793330908 793386281 793692172 793752551 793262720
3838.4 793262720 792984843 793017566 793077230 793329835 793938994 794308722 793170571 791791499 792218029 793096125
3858.8 793096125 793457985 793354750 793248236 793354571 793116629 792786837 792804122 792831302 792947233 792931139
3879.2 792931139 792872250 792986393 792759776 792632043 792746186 792490304 792380869 792716742 792829037 792562246
3899.6 792562246 792251587 791916549 791672230 791714251 791852355 791950881 792008758 791918695 791745245 791721165
3920 791721165 791755855 791635871 791515470 791551471 791551590 791468024 791463077 791462302 791463554 791513562 791416824 791266680
3944.5G91266680j2219Q762n2512n2571J6629M709j09434j07646N1737J24097L3080
3966.9G91171312m768L6538J4126j4484J0371J3590M888Q106k9981r3043q1420K8312
3991.4G91063547J15812O9737l3259
3997.5G91215837
$$ plain form
3944.5 791266680 791254461 791263223 791210711 791158140 791174769 791179478 791070044 790962398 791014135 791138232 791171312
3966.9 791171312 791166544 791203082 791217208 791202724 791213095 791226685 791231573 791239679 791209698 791116655 791035235 791063547
3991.4 791063547 791179359 791249096 791215837
3997.5 791215837
##END=$$ End of the data block
