##TITLE=$$ Begin of the data block
##JCAMP-DX=5.00 $$ ACD/SpecManager v 10.08
##SPECTROMETER/DATA SYSTEM=Alpha
##DATE=14 Apr 2014 11:23:48
##DATA TYPE=INFRARED SPECTRUM
##DATA CLASS=XYDATA
##ORIGIN=
##OWNER=
##NPOINTS=1765
##FIRSTX=399.75695801
##LASTX=3997.56933594
##MAXX=3997.56933594
##MINX=399.75695801
##MAXY=0.83925772
##MINY=0.41548559
##XFACTOR=1.0000000000
##YFACTOR=1.000000000000000e-9
##FIRSTY=0.65673423
##DELTAX=2.03957629
##XUNITS=1/CM
##YUNITS=ARBITRARY UNITS
##XYDATA=(X++(Y..Y))
399.8F56734228k790809j444757O05464r60052k589285n35309Q63790o00695j085043
$$ 656734228 653943419 652498662 653104126 652144074 649554789 649019480 649883270 649282575 648197532
418.1F48197532J70469m80294j722694o31272N09977n74410r75907K93255J32739j131355
$$ 648197532 648368001 647887707 646165013 645533741 646043718 645469308 644493401 644786656 644919395 643788040
438.5F43788040o33240N76138L6240q37684O1036P10487m83036q05974M41074J32680
$$ 643788040 643154800 643730938 643767178 642929494 642990530 643701017 643217981 642412007 642853081 642985761
458.9F42985761j211703n83768N00501m88162j451314m49777j18076j262427r98914
$$ 642985761 641774058 641190290 641690791 641202629 639751315 639301538 639183462 637921035 636922121
477.3F36922121M55797K69890r28164l80397P02143k52366j421809m00842M24266q26060
$$ 636922121 637377918 637647808 636719644 636339247 637041390 636789024 635367215 634966373 635390639 634564579
497.7F34564579j268983M0531J12533j115858q15571L12806m20690j518249n25535
$$ 634564579 633295596 633336127 633448660 632332802 631517231 631830037 631409347 629891098 629365563
516F29365563L02375j002074j586973k45571k4259j368702j005292M20153k98619j568735
$$ 629365563 629667938 628665864 627078891 626833320 626809061 625440359 624435067 624855220 624556601 622987866
536.4F22987866m75347N62728o78063j187980K68281L02016j203954q51571M58717
$$ 622987866 622512519 623075247 622397184 621209204 621477485 621779501 620575547 619723976 620182693
554.8F20182693m39107j823426p38024L08752j267434k232193p05839l73423k001166
$$ 620182693 619743586 617920160 617182136 617490888 616223454 613991261 613285422 612911999 610910833
573.1F10910833j813173m2081l97086j686573n22733O37233q83043j547098M57347
$$ 610910833 609097660 609055579 608658493 606971920 606449187 607086420 606203377 604656279 605113626
591.5F05113626R86278p77126n62787J148403K90453j388550o7770J431108j76073
$$ 605113626 606099904 605322778 604759991 605908394 606198847 604810297 604742527 606173635 605997562
609.8F05997562j303196N38826J404286J67012R86636L263533K748430J122594K320051
$$ 605997562 604694366 605233192 606637478 606804490 607791126 611054659 613803089 614925683 617245734
628.2F17245734L621697J912415P46966K385318K671659L60310L517J954853J845658
$$ 617245734 620867431 622779846 623526812 625912130 628583789 628944099 628947616 630902469 632748127
646.5F32748127L02196J077234J848519k69770r16124K453089M196465K093315R64820
$$ 632748127 633050323 634127557 635976076 635706306 634790182 637243271 641439736 643533051 644497871
664.9F44497871K126754K246678R88364K157450L404855J736939L07620K097010K905488
$$ 644497871 646624625 648871303 649859667 652017117 655421972 657158911 657466531 659563541 662469029
683.3F62469029P39098K20716K127051J577795p97927j38700J613020K98083r98616
$$ 662469029 663208127 663428843 665555894 667133689 666335762 666197062 667810082 668108165 667109549
701.6F67109549R54747K169371L01003j62840K025128J960993n27859m41790J593411
$$ 667109549 668064296 670233667 670534670 670371830 672396958 674357951 673830092 673388302 674981713
720F74981713J381636O27637K378404L466547J415133L34084K073228K128363j68264
$$ 674981713 676363349 676990986 679369390 682835937 684251070 684585154 686658382 688786745 688618481
738.3F88618481j03474J879454J369536j25229J229584K761722J225829J52886J899063
$$ 688618481 688515007 690394461 691763997 691638768 692868352 695630074 696855903 697008789 698907852
756.7F98907852K319634J91391N0783K009272J544297m66704J47640J442194k19583
$$ 698907852 701227486 701418877 701469660 703478932 705023229 704556525 704704165 706146359 705926776
775G05926776j830161m34458K19047j723945j948118M09663J019239k205J388728L911197
$$ 705926776 704096615 703662157 703881204 702157259 700209141 700618804 701638043 701635838 703024566 706935763
795.4G06935763L639758K590179M092813N208611L282845K031267L283739L044486
$$ 706935763 710575521 713165700 717258513 722467124 725749969 727781236 731064975 734109461
811.7G34109461O93679M25577J659394J79767k436399k279341j714766l756226n103588
$$ 734109461 734803140 735228717 736888111 737067878 734631479 732352138 730637372 726881146 721777558
830.1G21777558l471255k524197l762066l594637j705051j730800k937376j659036
$$ 721777558 718306303 715782106 712020040 708425403 706720352 704989552 702052176 700393140
846.4G00393140P72298J244187J690567M391849O514370N978644N814373P368505P291913
$$ 700393140 701165438 702409625 704100192 708492041 715006411 720985055 726799428 734167933 741459846
864.8G41459846N133033M557312N232930L774762J646102J942753K371848K86639j446247
$$ 741459846 746592879 751150191 756383121 760157883 761803985 763746738 766118586 766405225 764958978
883.1G64958978q29101r60052k768278k814114r47118n95689j226425R6023J791954
$$ 764958978 764129877 763169825 760401547 757587433 756640315 756044626 754818201 754914224 756706178
901.5G56706178J106024J10209R34541R51350j231551k450586j911282k644241m306555
$$ 756706178 757812202 757922411 758856952 759808302 758576751 756126165 754214883 751570642 747264087
919.8G47264087l748953j901984j579047j506984K61426J522660N29409j43826Q37684
$$ 747264087 743515134 741613150 740034103 738527119 738788545 740311205 740840614 740696788 741534472
938.2G41534472Q50737o13690p54595K19286m91381k119124k235055k187431l917694
$$ 741534472 742385209 741771519 741016924 741236210 740744829 738625705 736390650 734203219 730285525
956.6G30285525n561649n655051o277919q212864r167552q705199q763432r052992
$$ 730285525 724723876 719068825 712790906 704578042 695410490 686705291 677941859 668888867
972.9F68888867p729352n711317n061924m899144l686488k702773l043055l070712
$$ 668888867 661159515 655448198 650386274 645487130 641800642 639097869 636054814 632984102
989.2F32984102j975596j482666j948237j621723o27697o58929j323581j244247j186788
$$ 632984102 631008506 629525840 627577603 625955880 625328183 624669254 623345673 622101426 620914638
1007.5F20914638k247989l191352k925634k749026l339112l243625k271772j998424
$$ 620914638 618666649 615475297 612549663 609800637 606461525 603217900 600946128 598947704
1023.9E98947704k389968k036452j272380j359821j646459j054048m73976p87914r98736
$$ 598947704 596557736 594521284 593248904 591889083 590242624 589188576 588714600 587926686 586927950
1042.2E86927950m99785m13239j013636j044214l98695j56403p3314P63953J606166
$$ 586927950 586428165 586014926 585001290 583957076 583558381 583401978 583328664 584092617 585698783
1060.6E85698783J388550Q27074O63817J08183j079679j619041j152933q52406r45985
$$ 585698783 587087333 587914407 588578224 588686407 587606728 585987687 584834754 583982348 583036363
1078.9E83036363n69045K920k30014q43525q27551o33597q34346o46413K33531P78258
$$ 583036363 582467318 582470238 582240224 581396699 580569148 579935551 579101205 578454792 578688323 579466581
1099.3E79466581O43671P39336J204789J131057O22392N94378P06076Q7202q08597
$$ 579466581 580110252 580849588 582054377 583185434 583807826 584402204 585108280 585195482 584386885
1117.7E84386885j259684j511991j476288o00755N99980J091599P77841N45144Q14974
$$ 584386885 583127201 581615210 580138922 579538167 580138147 581229746 582007587 582552731 583367705
1136E83367705J000882J034081J359641J526654J062393P00712R31978J078725Q96812
$$ 583367705 584368587 585402668 586762309 588288963 589351356 590052068 590984046 592062771 592959583
1154.4E92959583J153350J944303K460540K747893L524899M480005M858493N037368
$$ 592959583 594112933 596057236 598517776 601265669 604790568 609270573 614129066 619166434
1170.7F19166434N545974N743503N221486M782021M701734M095256K776742J589358
$$ 619166434 624712408 630455911 635677397 640459418 645161152 649256408 652033150 653622508
1187F53622508N75483q23319k050877k301573k086938k034306j705766r61840o07968
$$ 653622508 654197991 653374672 651323795 649022222 646935284 644900978 643195212 642233372 641625404
1205.4F41625404q32498r29951q70407j217127j659751j518309j177907j251280j276314
$$ 641625404 640792906 639862955 638992548 637775421 636115670 634597361 633419454 632168174 630891860
1223.7F30891860p70927l28004l51191j81377L80397N85973L83735N04971Q40604O74605
$$ 630891860 630120933 629792929 629441738 629260361 629640758 630226731 630610466 631115437 631956041 632630646
1244.1F32630646K69830K72036K68042k18928n13792j71900Q6010m411L06666J040578
$$ 632630646 632900476 633172512 633440554 633221626 632707834 632535934 632621944 632617533 632924199 633964777
1264.5F33964777J387298J424313J851976K406120K435923K388954K833187L144324
$$ 633964777 635352075 636776388 638628364 641034484 643470407 645859361 648692548 651836872
1280.8F51836872K920866K945066L436029L501117L016591K852917K922594K472699
$$ 651836872 654757738 657702804 661138833 664639950 667656541 670509458 673432052 675904751
1297.2F75904751J930356K041101K243042J877189J600265J901985J977205J476943
$$ 675904751 677835107 679876208 682119250 683996439 685596704 687498689 689475894 690952837
1313.5F90952837J287103J572192J441240J005113J140774J484334J114905M92156
$$ 690952837 692239940 693812132 695253372 696258485 697399259 698883593 699998498 700490654
1329.8G00490654M42743M04775j62423n03361p3552L35038K12609K70009N94020L72768
$$ 700490654 700933397 701338172 701175749 700672388 700598836 700933874 701146483 701416492 702010512 702383280
1350.2G02383280j23143m3989M6134o89983j749754k503574k694011k335310j925885
$$ 702383280 702260137 702216148 702262282 701572299 699822545 697318971 694624960 692289650 690363765
1368.5F90363765k061188l492952n042374l709614l72827J491189J475513J758396
$$ 690363765 688302577 684809625 679767251 676057637 675684810 677175999 678651512 680409908
1384.9F80409908K322913J652419O83904J98006n74946j467705j796245j498402j594483
$$ 680409908 682732821 684385240 685069144 685267150 684692204 683224499 681428254 679929852 678335369
1403.2F78335369k229333j957894j345157j532972j586080q68737p27475j546919j247287
$$ 678335369 676106036 674148142 672802985 671270013 669683933 668815196 668087721 666540802 665293515
1421.6F65293515m25101o05344j302362j849949j743078j625181k477705k657354j577437
$$ 665293515 664868414 664263070 662960708 661110759 659367681 657742500 655264795 652607441 651030004
1439.9F51030004j613140k046287j769483j764775k212107k231300j529038p59124
$$ 651030004 649416864 647370577 645601094 643836319 641624212 639392912 637863874 637104750
1456.2F37104750O60717K768994L813087M224360N919874R744346J3879299J5879632
$$ 637104750 637765467 640534461 644347548 648571908 654491782 664236128 678115427 693995059
1472.6F93995059J3043820R307981P166564N268336L888607K987921J632810k87414
$$ 693995059 707038879 716346860 723513424 728781760 732670367 735658288 737291098 737003684
1488.9G37003684j210332r12428j602649l161431l281951k532363k417445l645301
$$ 737003684 735793352 734880924 733278275 730116844 726834893 724302530 721885085 718239784
1505.2G18239784n624056m707634l634870l387034k813578k429008k236009k318442
$$ 718239784 712615728 707908094 704273224 700886190 698072612 695643604 693407595 691089153
1521.5F91089153j972556j865983k165258j436293j231432k157390j556039m57763
$$ 691089153 689116597 687250614 685085356 683649063 682417631 680260241 678704202 678246439
1537.8F78246439j445354k078056n89669M92931O93142O45817J218557J932442J946986
$$ 678246439 676801085 674723029 674133360 674626291 675319433 675965250 677183807 679116249 681063235
1556.2F81063235Q89122K35737R26971O12617L4749m83632j475692j654446j941264
$$ 681063235 681952357 682188094 683115065 683727682 683762431 683278799 681803107 680148661 678207397
1574.5F78207397l420531l587783l051698l229201l555953m101515m477203m478156
$$ 678207397 674786866 671199083 668147385 664918184 661362231 657260716 652783513 648305357
1590.9F48305357m641593n115151n144716m802346m833639m972577m679858m485131
$$ 648305357 643663764 638548613 633403897 628601551 623767912 618795335 614115477 609630346
1607.2F09630346m797280m750967m042208m385888n508900m046321k870679l666520
$$ 609630346 604833066 600082099 596039891 591654003 586145103 582098782 579228103 575561583
1623.5E75561583l847301l295124k577602j329661q53300j355052n09322Q63016J519561
$$ 575561583 571714282 568419158 565841556 564511895 563658595 562303543 561794221 562657237 564176798
1641.8E64176798J966715K010762K191842K864242K770841K282738K924681L590942
$$ 564176798 566143513 568154275 570346117 573210359 575981200 578263938 581188619 584779561
1658.2E84779561L950774M091025M205882M376173M448474M416465M392386M481316
$$ 584779561 588730335 592821360 597027242 601403415 605851889 610268354 614660740 619142056
1674.5F19142056M567265M559875M636049M711389M809797M845500M923105N242825
$$ 619142056 623709321 628269196 632905245 637616634 642426431 647271931 652195036 657437861
1690.8F57437861N234778N208433N509078O008387O635129O135702N559027N396963
$$ 657437861 662672639 667881072 673390150 679398537 686033666 692169368 697728395 703125358
1707.1G03125358M954338M686773M751026M797042M593968M295289M086316L773749
$$ 703125358 708079696 712766469 717517495 722314537 726908505 731203794 735290110 739063859
1723.4G39063859L326297L075719L205955L165424K871334L026128L329754L282308
$$ 739063859 742390156 745465875 748671830 751837254 754708588 757734716 761064470 764346778
1739.7G64346778L167510L416777L818274L932953L896653M000545L776848L167987
$$ 764346778 767514288 770931065 774749339 778682292 782578945 786579490 790356338 793524325
1756.1G93524325K692997K496422K235531J897574J799822J857221J668215J154244
$$ 793524325 796217322 798713744 800949275 802846849 804646671 806503892 808172107 809326351
1772.4H09326351J123845J406133J254738J011908J146316J221121J009166R85265
$$ 809326351 810450196 811856329 813111067 814122975 815269291 816490412 817499578 818484843
1788.7H18484843J079082R04024O78062Q23319J007021P95424N26547P03514R02533
$$ 818484843 819563925 820467949 821146011 821969330 822976351 823771775 824298322 825001836 825904369
1807H25904369O40869L76106O10530P51972M11153L12746O39736O19293K63691L57866
$$ 825904369 826545238 826921344 827531874 828283846 828694999 829007745 829647481 830266774 830530465 830888331
1827.4H30888331O06179M34995K43008L83556N63383M26352K45094K94388L84509K14398
$$ 830888331 831494510 831929505 832172513 832556069 833119452 833545804 833790898 834085286 834469795 834684193
1847.8H34684193J46568M15802M04060Q8096J80423M90129L09229K5451K04384L10898
$$ 834684193 834830761 835246563 835650623 835738719 835919142 836409271 836718500 836743951 836948335 837259233
1868.2H37259233k563k0385L62098L98756k3008j26481K22445K39729o3598L100L09169
$$ 837259233 837256670 837236285 837598383 837997139 837974131 837847650 838070095 838309824 838246226 838249326 838558495
1890.7H38558495J64568j95801k6643K57134K2233j18196K39611L08811j51574k34902
$$ 838558495 838723063 838527262 838500619 838757753 838779986 838661790 838901401 839210212 839058638 838823736
1911.1H38823736J71780J78397j79768l3080K96652j5616l10302K7716K00749j77145
$$ 838823736 838995516 839173913 838994145 838961065 839257717 839242101 838931799 838959515 839160264 838983119
1931.5H38983119k76924J20581J55746k85863l62635j609l9935l53933j26362J91808
$$ 838983119 838706195 838826776 838982522 838696659 838334024 838332415 838292480 837938547 837812185 838003993
1951.9H38003993j64747m92037j62839K0504l15190l18050N8591m3690m43280k95996
$$ 838003993 837839246 837347209 837184370 837204874 836889684 836571634 836630225 836586535 836143255 835847259
1972.3H35847259Q9526j02878m05490r6619J55329k16305m06444l4809J2576m11689
$$ 835847259 835936785 835833907 835428417 835331798 835487127 835270822 834864378 834829569 834842145 834430456
1992.6H34430456l47912Q9705l4392m47571k93672L8445k08676m70937j39832N0545
$$ 834430456 834082544 834172249 834137857 833690286 833396614 833435059 833226383 832755446 832615614 832666159
2013H32666159l59357n26666j26660o6459m30406l37600N0008j18315m71175k27809
$$ 832666159 832306802 831780136 831653476 831587017 831156611 830819011 830869019 830750704 830279529 830051720
2033.4H30051720O2645k28525m09245l5048Q1957l26872l55601O9260P15l80039j77800
$$ 830051720 830114365 829885840 829476595 829441547 829523504 829196632 828841031 828910291 828911006 828530967 828353167
2055.9H28353167J92225p4625m06743j28805J20759j54138k53916J19985J37627k71857
$$ 828353167 828545392 828470767 828064024 827935219 828055978 827901840 827647924 827767909 827905536 827633679
2076.3H27633679k09391J81734M4942k88784m4108K57254n6922k96414O5386K05159
$$ 827633679 827424288 827606022 827650964 827362180 827318072 827575326 827518404 827221990 827287376 827492535
2096.7H27492535j75774j82927K48790K05398k07484j11699K12490J6809k21908P9989
$$ 827492535 827316761 827133834 827382624 827588022 827380538 827268839 827481329 827498138 827276230 827356219
2117.1H27356219K81692k7538j22487K16901K32876j10805l9518L10361J83225j29164
$$ 827356219 827637911 827610373 827487886 827704787 827937663 827826858 827787340 828097701 828280926 828151762
2137.5H28151762N3049K76863J013j46150K25663L74973J9491q4401K25485K34365
$$ 828151762 828204811 828481674 828482687 828336537 828562200 828937173 828956664 828872263 829097748 829332113
2157.9H29332113m8458O3777L66449J82927r7692J40547L69311R7632n2154K39015
$$ 829332113 829283655 829347432 829713881 829896808 829799116 829939663 830308974 830406606 830354452 830593467
2178.2H30593467K87354m1008m3035K70188K10285p7903O3241L20672R9481j30177
$$ 830593467 830880821 830839813 830796778 831066966 831277251 831199348 831262589 831583261 831682742 831552565
2198.6H31552565J07825K41399m8816j28150J67548J83046j03116n0366K13504P2777
$$ 831552565 831660390 831901789 831852973 831724823 831892371 832075417 831972301 831921935 832135439 832208216
2219H32208216j72734L8803K60889J6511j79708N5193J52410j22726j30177J65105
$$ 832208216 832035482 832074285 832335174 832351685 832171977 832227170 832379580 832256854 832126677 832291782
2239.4H32291782Q5473k16603j14441J09970n9366k30372J6630J65343j04189k20477
$$ 832291782 832377255 832160652 832046211 832156181 832096815 831866443 831883073 832048416 831944227 831723750
2259.8H31723750L2723Q6546j61171j07289J95980J07229j63674l1829J57356l1888
$$ 831723750 831756473 831843019 831681848 831574559 831770539 831877768 831714094 831682265 831839621 831807733
2280.2H31807733j40667J00970J69456j14799k30252O854Q8394j39415j23859J33693
$$ 831807733 831667066 831768036 831937492 831822693 831592441 831599295 831687689 831548274 831424415 831558108
2300.6H31558108N0724k04623j00791R3043o8844k22742j4246R3877j56581k95937
$$ 831558108 831608832 831404209 831303418 831396461 831327617 831104875 831090629 831184506 831027925 830731988
2321H30731988j39594q8573k38895j77145R0003O6936j23322m4823R1434k2352l8922
$$ 830731988 830592394 830503821 830264926 830087781 830177784 830244720 830121398 830076575 830168009 830145657 830106735
2343.5H30106735L34978O10173L56674j22726l93212m36782m11094j60098O5267Q643
$$ 830106735 830441713 831051886 831408560 831285834 830892622 830455840 830044746 829884648 829949915 829958558
2363.8H29958558K802K60949M51684L66509L63171N73218N88297L67046K92003L53396
$$ 829958558 829961360 830222309 830673993 831040502 831403673 831976891 832565188 832932234 833224237 833577633
2384.2H33577633K19226j0610J4186J45793N1975j21951q2075K4259o0916j31488K4736
$$ 833577633 833796859 833786249 833800435 833946228 833998203 833876252 833794177 833818436 833757520 833626032 833650768
2406.7H33650768R1910r9778j73450l1054m1544j95205j34647M1485m2975k47598j98305
$$ 833650768 833742678 833642900 833469450 833438396 833396852 833201647 833067000 833108485 833065510 832817912 832619607
2429.1H32619607p8380j63793j93358l2663k0325k27988k75791r9480o1571j89960
$$ 832619607 832541227 832377434 832184076 832151413 832131088 831903100 831627309 831527829 831466258 831276298
2449.5H31276298j60277j6749r8109k86222k18391q5235j84953k42055p1883k8193
$$ 831276298 831116021 831099272 831001163 830714941 830496550 830411315 830226362 829984307 829912424 829884231
2469.9H29884231k43843l16739j32978j00076k56300k16722l9101j24037l16262k08915
$$ 829884231 829640388 829323649 829190671 829090595 828834295 828617573 828578472 828454435 828138173 827929258
2490.3H27929258p1406k16603k74062m7744J252k83301l84569j77682j14262j99616
$$ 827929258 827857852 827641249 827367187 827319443 827320695 827037394 826652825 826475143 826360881 826161265
2510.7H26161265j26958l2424j77086l45230k22683q5711k17379k88128j19925q1599
$$ 826161265 826034307 826001883 825824797 825479567 825256884 825171173 824953794 824665666 824545741 824464142
2531.1H24464142k73347k93612r8407r3699k47896j80721l4749j80245l71754k20478
$$ 824464142 824190795 823897183 823798776 823705077 823457181 823276460 823241711 823061466 822689712 822469234
2551.5H22469234m7922k11894l29077j52469j00434l10481l57449j82092k04086m04358
$$ 822469234 822421312 822209418 821880341 821727872 821627438 821316957 820959508 820777416 820573330 820168972
2571.9H20168972l49164j54376k73764m76897l50892k12849l76403m55201k56180k29061
$$ 820168972 819819808 819665432 819391668 818914771 818563879 818351030 817974627 817519426 817263246 817034185
2592.3H17034185m88997n60998l61145l41833m98712m35829k75671l87133n68449m73321
$$ 817034185 816545188 815984190 815623045 815281212 814782500 814346671 814071000 813683867 813115418 812642097
2612.7H12642097l60190m89831n32389l33428k90215m99666n44727l70860l67046m91797
$$ 812642097 812281907 811792076 811259687 810926259 810636044 810136378 809591651 809220791 808853745 808361948
2633.1H08361948l91841k46346m26472o45458m95613l15428m16636m40717k75552l26753
$$ 808361948 807970107 807723761 807297289 806651831 806156218 805840790 805424154 804983437 804707885 804381132
2653.5H04381132n93722o02722l74317l51787m82201m06802k78890m08709n17309l24309
$$ 804381132 803787410 803184688 802810371 802458584 801976383 801569581 801290691 800881982 800364673 800040364
2673.9H00040364j78814l32355m20809k78473k64704m33028m01139k24710l07262m60505
$$ 800040364 799861550 799529195 799108386 798829913 798565209 798132181 797731042 797506332 797199070 796738565
2694.3G96738565l38793k46405m63188o24716m79579m02928n82456o40333m93467n36382
$$ 796738565 796399772 796153367 795690179 795065463 794585884 794182956 793600500 792960167 792466700 791930318
2714.6G91930318p48813o97673m82201n27263o53803n53310m55558n12243m48882j98067
$$ 791930318 791181505 790483832 790001631 789474368 788820565 788267255 787811697 787299454 786850572 786652505
2735G86652505j31547l32892l60429j84775k78055n29051m86136l64661n04434o09100
$$ 786652505 786520958 786188066 785827637 785642862 785364807 784835756 784349620 783984959 783480525 782871425
2755.4G82871425m57048m10795o30081p25866n71489n58019p45832p25747n40912o87241
$$ 782871425 782414377 782003582 781373501 780647635 780076146 779518127 778772295 778046548 777505636 776818395
2775.8G76818395j024783j010239q21650q97765j024366r14335q93652j137138j202941
$$ 776818395 775793612 774783373 773961723 773063958 772039592 771125257 770231605 769094467 767891526
2794.2G67891526r99152j036406j339674j391351j248896j391471j674354j688301
$$ 767891526 766892374 765855968 764516294 763124943 761876047 760484576 758810222 757121921
2810.5G57121921j653135j849056k047598k110064k319395k777279l156006l468037
$$ 757121921 755468786 753619730 751572132 749462068 747142673 744365394 741209388 737741351
2826.8G37741351m118740n097747o155551p537365r634435j2243092j4864147j7478406
$$ 737741351 733622611 728524864 722369313 714831948 705197513 692954421 678090274 660611868
2843.1F60611868k0222187k2266567k1924615j7731011r624958J46747Q020818J1685133
$$ 660611868 640389681 618123114 596198499 578467488 568842530 568989277 577010095 588695228
2859.5E88695228J1329055Q539200M866659J626015K76089J551747M057229N471885
$$ 588695228 600024283 608563483 613430142 615056157 615332246 616883993 620941222 626413107
2875.8F26413107M951656L063619N07653k101124m193544n657971o744623p441402
$$ 626413107 631364763 634428382 634936035 632834911 628641367 622983396 616238773 608797371
2892.1F08797371p621646p621705p832110q090317q331359q981108j0210932j1856973
$$ 608797371 601175725 593554020 585721910 577631593 569300234 560319126 550108194 538251221
2908.4E38251221j3961494j6630232j9297779k0746588k0078928j6958266j1297405
$$ 538251221 524289727 507659495 488361716 467615128 447536200 430577934 419280529
2922.7D19280529l794938L907412J0224938J4529169J7172843J8518925J8450648J6960859
$$ 419280529 415485591 419393003 429617941 444147110 461319953 479838878 498289526 515250385
2939E15250385J4251649J0404766N776882J253903k205193l833115l202558n07414
$$ 515250385 529502034 539906800 545683682 546937585 544732392 540899277 537696719 537189305
2955.3E37189305L247738O820142R774685J2267351J4110863J4880598J4608681J3628006
$$ 537189305 540437043 547257185 557031870 569299221 583410084 598290682 612899363 626527369
2971.6F26527369J2059987J0172426Q528233P199228N874991M716158L977180L401339
$$ 626527369 638587356 648759782 657288015 664487243 670362234 675078392 679055572 682456911
2987.9F82456911K743899K080977J540423J113593O22154K05636O7532n0962j82271
$$ 682456911 685200810 687281787 688822210 689935803 690557957 690763593 690831125 690780163 690597892
3006.3F90597892k7836K96772L27229Q6666Q463M0949j09434k63572k73645l77774
$$ 690597892 690570056 690866828 691194057 691280723 691289186 691330135 691220701 690957129 690683484 690305710
3026.7F90305710n34296n15938m24623n87881r17494r07660p07507q04842j043677
$$ 690305710 689771414 689255476 688830853 688242972 687325478 686417818 685710311 684905469 683861792
3045.1F83861792j079976r77755r98080j086116j012563r62079j072347j016021p75814
$$ 683861792 682781816 681804061 680805981 679719865 678707302 677745223 676672876 675656855 674881041
3063.4F74881041p13408q62002r14574p86066p16567o64890n10335n71251q58187r56715
$$ 674881041 674167633 673305631 672391057 671604991 670888424 670223534 669713199 669141948 668283761 667327046
3083.8F67327046q71896q37982r02951r57548r43721r83476j035512r99153j023233
$$ 667327046 666455150 665617168 664714217 663756669 662812948 661829472 660793960 659794807 658771574
3102.2F58771574j155912j153827j005471j056671j218498j136064j001716j151264
$$ 658771574 657615662 656461835 655456364 654399693 653181195 652045131 651043415 649892151
3118.5F49892151j501441j672029j541197j432062j456976j457810j467049j509905
$$ 649892151 648390710 646718681 645177484 643745422 642288446 640830636 639363587 637853682
3134.8F37853682j435041j339019j521170j787722j742780j547456j492858j541734
$$ 637853682 636418641 635079622 633558452 631770730 630027950 628480494 626987636 625445902
3151.1F25445902j645386j793086j888454j870931j759827j694679j768172j820922
$$ 625445902 623800516 622007430 620118976 618248045 616488218 614793539 613025367 611204445
3167.4F11204445j741409j736343j878977j909375j790881j749814j817882j814603
$$ 611204445 609463036 607726693 605847716 603938341 602147460 600397646 598579764 596765161
3183.7E96765161j749814j782954j853883j820207j789391j878857j872599j714826
$$ 596765161 595015347 593232393 591378510 589558303 587768912 585890055 584017456 582302630
3200.1E82302630j688719j795649j780272j697957j734138j784444j716912j644969
$$ 582302630 580613911 578818262 577037990 575340033 573605895 571821451 570104539 568459570
3216.4E68459570j711607j757264j650512j633763j760960j726568j522123j496554
$$ 568459570 566747963 564990699 563340187 561706424 559945464 558218896 556696773 555200219
3232.7E55200219j678228j714170j608253j593113j564026j410424j343489j498222
$$ 555200219 553521991 551807821 550199568 548606455 547042429 545632005 544288516 542790294
3249E42790294j566172j399934j304329j387775j410722j316011j310587j355291j234948
$$ 542790294 541224122 539824188 538519859 537132084 535721362 534405351 533094764 531739473 530504525
3267.4E30504525j076877j216352j456201j409770j296281j323164j305818j239896
$$ 530504525 529427648 528211296 526755095 525345325 524049044 522725880 521420062 520180166
3283.7E20180166j290858j333833j207173j146197j315951j476288j486659j422465
$$ 520180166 518889308 517555475 516348302 515202105 513886154 512409866 510923207 509500742
3300E09500742j324892j224876j272320j548708j806497j815737j674533j620471j661688
$$ 509500742 508175850 506950974 505678654 504129946 502323449 500507712 498833179 497212708 495551020
3318.4D95551020j632869j592756j683294j849086j893639j836866j852423j816988
$$ 495551020 493918151 492325395 490642101 488793015 486899376 485062510 483210087 481393099
3334.7D81393099j708865j787544j998484k073377k046198k023786j947075j941443
$$ 481393099 479684234 477896690 475898206 473824829 471778631 469754845 467807770 465866327
3351D65866327k117961k267897k185673j995146k014458k133281j998901j832694j974612
$$ 465866327 463748366 461480469 459294796 457299650 455285192 453151911 451153010 449320316 447345704
3369.3D47345704k201736k162606j948028j834244j759559j650512j553685j416564
$$ 447345704 445143968 442981362 441033334 439199090 437439531 435789019 434235334 432818770
3385.7D32818770j164496q86172r55998j286239j234442p61092m96149p77721j107872
$$ 432818770 431654274 430768102 429812104 428525865 427291423 426530331 426034182 425256461 424148589
3404D24148589r48310o14404m64857m08172m13835m37826l49015k11388r8020N1975
$$ 424148589 423200279 422585875 422121018 421712846 421299011 420861185 420512170 420300782 420202762 420254737
3424.4D20254737K61068M51386M55380M68284O82086O93351M30822M24445P83801J081198
$$ 420254737 420515805 420967191 421422571 421890855 422572941 423266292 423697114 424121559 424905360 425986558
3444.8D25986558J103461J076519J183838J293153J345277J483470J676559J616568
$$ 425986558 427090019 428166538 429350376 430643529 431988806 433472276 435148835 436765403
3461.1D36765403J535594J824975K015859J695663J320630J411170J723051J950681
$$ 436765403 438300997 440125972 442141831 443837494 445158124 446569294 448292345 450243026
3477.4D50243026J957238J709789J655936J877457J929492J877516J972765K077132
$$ 450243026 452200264 453910053 455565989 457443446 459372938 461250454 463223219 465300351
3493.8D65300351K123475K104521K087504K079606J981735J919091J972854K135605
$$ 465300351 467423826 469528347 471615851 473695457 475677192 477596283 479569137 481704742
3510.1D81704742K384752K433240K232552K202898K431333K596229K467901K227873
$$ 481704742 484089494 486522734 488755286 490958184 493389517 495985746 498453647 500681520
3526.4E00681520K177000K380728K688825K859831K742350K580285K775610L045559
$$ 500681520 502858520 505239248 507928073 510787904 513530254 516110539 518886149 521931708
3542.7E21931708K884745K512515K577841K806604K803564K885640L062367L107071
$$ 521931708 524816453 527328968 529906809 532713413 535516977 538402617 541464984 544572055
3559E44572055L115774L179550L009736K874673L311276L660977L557384L481746L566563
$$ 544572055 547687829 550867379 553877115 556751788 560063064 563724041 567281425 570763171 574329734
3577.4E74329734L763199M062652M246891L905177L345728L680050M200220M106641
$$ 574329734 578092933 582155585 586402476 590307653 593653381 597333431 601533651 605640292
3593.7F05640292M086137M312336M281283M226982M418672M319191M092216M278660
$$ 605640292 609726429 614038765 618320048 622547030 626965702 631284893 635377109 639655769
3610F39655769M454255M494369M482150M152715M125834M507363M713237M358888L548026
$$ 639655769 644110024 648604393 653086543 657239258 661365092 665872455 670585692 674944580 678492606
3628.4F78492606L807306M411697M246772M079997M003048L928840M032374M119396
$$ 678492606 682299912 686711609 690958381 695038378 699041426 702970266 707002640 711122036
3644.7G11122036L737509L045261L072202L523708L250062L003836L282785L145874
$$ 711122036 714859545 717904806 720977008 724500716 727750778 730754614 734037399 737183273
3661G37183273K752483K747774K640903K040982K145052K429962J622498J533568K125383
$$ 737183273 739935756 742683530 745324433 747365415 749510467 751940429 753562927 755096495 757221878
3679.4G57221878K186715K286375K322018J833558J141608J164138J529157J583696
$$ 757221878 759408593 761694968 764016986 765850544 766992152 768156290 769685447 771269143
3695.7G71269143J435995J123011Q02696J006066J311779J094103M96805J27077O88851
$$ 771269143 772705138 773828149 774630845 775636911 776948690 778042793 778539598 778666675 779355526
3714G79355526J124024R00448O19411M94063L60608L26991P29859R07660N07652N6982
$$ 779355526 780479550 781379998 781999409 782493472 782854080 783181071 783910930 784818590 785326242 785383224
3734.4G85383224M7386O75082J135350L81052n72026L19064O84083l14475j35421P71820
$$ 785383224 785430610 786105692 787241042 787622094 787050068 787369132 788053215 787738740 787603319 788375139
3754.8G88375139P46787K35915J83046M04060L60608K23398m9770k8252M27186N31375
$$ 788375139 789121926 789357841 789540887 789944947 790305555 790528953 790479183 790450931 790878117 791409492
3775.2G91409492K45929k0623P6234J62423J2159J13190K94447K75492J97411J12593
$$ 791409492 791655421 791634798 791711032 791873455 791885614 791998804 792293251 792568743 792766154 792878747
3795.6G92878747J96934l8028m26292J44898K03133k54214K08855O56485K55943k66195
$$ 792878747 793075681 793037653 792611361 792756259 792959392 792705178 792914033 793570518 793826461 793560266
3816G93560266J27495j8060n30124M9353L61859K54512J27316J16765L66748L1352
$$ 793560266 793687761 793669701 793139577 793188930 793550789 793805301 793932617 794049382 794416130 794447482
3836.4G94447482n99206l13222Q3625R9242K73108N65589K91407j077354j252830M30286
$$ 794447482 793848276 793535054 793618679 793717921 793991029 794556618 794848025 793770671 792517841 792948127
3856.8G92948127Q63492L46482k17378k21729J27852k05696l91901k7775P2837J88171
$$ 792948127 793811619 794158101 793940723 793718994 793846846 793641150 793249249 793221474 793294311 793482482
3877.2G93482482L2068m6134J01506j86920m6611J36972k79903j41562L07918J01030
$$ 793482482 793514550 793468416 793569922 793383002 793336391 793473363 793193460 793051898 793359816 793460846
3897.6G93460846l01004l88085l34204p7784K05338J73509P3910k205j89662k31564
$$ 793460846 793159842 792771757 792437553 792359769 792565107 792738616 792812526 792810321 792620659 792389095
3918G92389095j0610K5451j63018q4937Q4519m8399j44302m411N5730N8413K3365j69456
$$ 792389095 792378485 792403936 792240918 792155981 792240500 792192101 792047799 792043388 792099118 792157531 792180896 792011440
3942.5G92011440j77205L219O1333L3140l7610r1613q5115o2227M17J00732Q5115k98
$$ 792011440 791834235 791837454 791898787 791931927 791894317 791802704 791717589 791655362 791655779 791756511 791841626 791841328
3966.9G91841328M3214R3102j0908r0003j6212L4094J9669J3471k4200q1718r2864
$$ 791841328 791884542 791977644 791966736 791876733 791860521 791894615 791914284 791927755 791903555 791821837 791728973
3989.4G91728973l57J49071J83582L0518
$$ 791728973 791728616 791877687 792061269 792091787
3997.5G92091787
$$ 792091787
##END=$$ End of the data block
