##TITLE=$$ Begin of the data block
##JCAMP-DX=5.00 $$ ACD/SpecManager v 10.08
##SPECTROMETER/DATA SYSTEM=Alpha
##DATE=14 Apr 2014 11:23:48
##DATA TYPE=INFRARED SPECTRUM
##DATA CLASS=XYDATA
##ORIGIN=
##OWNER=
##NPOINTS=1765
##FIRSTX=399.75695801
##LASTX=3997.56933594
##MAXX=3997.56933594
##MINX=399.75695801
##MAXY=0.83956784
##MINY=0.41577104
##XFACTOR=1.0000000000
##YFACTOR=1.000000000000000e-9
##FIRSTY=0.65604687
##DELTAX=2.03957629
##XUNITS=1/CM
##YUNITS=ARBITRARY UNITS
##XYDATA=(X++(Y..Y))
399.8F56046867k843678k291262K17200l73900j925469m29869M66407q76963q00312
418.1F47189021N01692m64797j732528o25729O19709k64048p25568J91987l17991j684189
438.5F42687559q31187Q21293K70784p41005J52468Q54910k68936q29339J43885m5061
458.9F42215371j312315q08537L08752l10004r43720q4341q2672j470625j257300M34160
479.3F36688769M58121p21514l05772N58257l65019j252293j81556L88444r30310j257837
499.7F33079290M7982k7656j325190p58768O10233k83778j647294o84738K73526r56833
520.1F28326774j585782k28286J11044j328945j122237L19243l50058j471103k74419
538.4F22396231N69760p86483j150071L63528K31147j467347j084685M59551j98483
$$ plain form
399.8 656046867 653203189 650911927 651129127 650755227 648829758 648399889 648866296 647989333 647189021
418.1 647189021 647690713 647225916 645493388 644867659 645487368 645223320 644497752 644689739 644371748 642687559
438.5 642687559 641856372 642677665 642948449 642207444 642359912 643214822 642945886 642116547 642260432 642215371
458.9 642215371 640903056 640094519 640403271 640093267 639149547 639065206 638982534 637511909 636254609 636688769
479.3 636688769 637146890 636425376 636119604 636677861 636312842 635060549 634878993 635267437 634337127 633079290
499.7 633079290 633127272 633099616 631774426 631015658 631625891 631342113 629694819 629010081 629283607 628326774
520.1 628326774 626740992 626512706 626623750 625294805 624172568 624491811 624141753 622670650 622396231
538.4 622396231 622965991 622179508 621029437 621392965 621624112 620156765 619072080 619531631 619333148
556.8F19333148j621008p99417J39176j353561k113462m35710l11792k169192j774966
575.2F08893216J27971m94778j893223o25491N61416q51035j372397O03199R91524
593.5F05940402r02892o73711J160920L78251j335442p6592J489579O5744r99868O30796
613.9F05677187J188279j29700R18269L435493K965509J149953K209842L635645J930296
632.3F22980773O78063K369761K669216L18765m7326J900792J823843L27527J058996
650.6F34080410J761615k89976p93934K632439M248261J902461P21395K081872K471685
669F48816228J223504K249837L344715J624584K91109K124369K843440O72638K60115
687.3F63450539K172172J595617p60019j63853J540422L09229r20892R93073K147913
$$ plain form
556.8 619333148 617712140 616912723 617051899 615698338 613584876 613149166 612837374 610668182 608893216
575.2 608893216 609021187 608526409 606633186 606007695 606569111 605718076 604345679 604948878 605940402
593.5 605940402 605037510 604363799 605524719 605902970 604567528 604490936 605980515 606046259 605046391 605677187
613.9 605677187 606865466 606735766 607654035 611089528 614055037 615204990 617414832 621050477 622980773
632.3 622980773 623658836 626028597 628697813 629016578 628969252 630870044 632693887 633021414 634080410
650.6 634080410 635842025 635552049 634758115 637390554 641638815 643541276 644262671 646344543 648816228
669 648816228 650039732 652289569 655634284 657258868 657549977 659674346 662517786 663190424 663450539
687.3 663450539 665622711 667218328 666458309 666294456 667834878 668144107 667223215 668216288 670364201
705.7F70364201L13461j03653J989961J860559m60505k56956J600683J197397M71473
724F76976621K370954L540337J445710L36767K108514K172410j35838n8055J888871
742.4F90646291J311779j60396J221358K706826J167536J55330J942515K359688J96100
760.8G01547027Q821J963198J536429m69148J39177J417994k23934j757741m18306
779.1G03743517J40131j753807j907706M35173J005590n4777J281858L825009L658116
797.5G10373104K669751M120410N178570L289223K080977L303766L056169P68304M70042
815.8G35310316J570284Q1480k422094k255082j756013l785312n082369l479004k577484
834.2G15604722l719270l462851j646876j751125k948284j639009P64132J173079J665771
$$ plain form
705.7 670364201 670677662 670574009 672563970 674424529 673964024 673707068 675307751 676505148 676976621
724 676976621 679347575 682887912 684333622 684670389 686778903 688951313 688815475 688757420 690646291
742.4 690646291 691958070 691797674 693019032 695725858 696893394 697048724 698991239 701350927 701547027
760.8 701547027 701555848 703519046 705055475 704586327 704725504 706143498 705919564 704161823 703743517
779.1 703743517 703883648 702129841 700222135 700657308 701662898 701608121 702889979 706714988 710373104
797.5 710373104 713042855 717163265 722341835 725631058 727712035 731015801 734071970 734840274 735310316
815.8 735310316 736880600 736962080 734539986 732284904 730528891 726743579 721661210 718182206 715604722
834.2 715604722 711885452 708422601 706775725 705024600 702076316 700437307 701201439 702374518 704040289
852.5G04040289M462838O557703N971491N809367P347763P274091N142450M556775
868.9G51162767N208195L752231J631379J919151K328455K49565j421809p66576r30607
887.2G63132751k756834k781093r54092o96182j306713J40727J881957J145542J24633
905.6G57930696R56774R60707j226067k471149j969278k658367m274070l730417j893222
923.9G41625607j577735j534402J88708J432359N14269p9393Q63313Q27253n94139
942.3G41665840p19964J87337n45979k113759k192438k161860l881574n525052n690337
960.6G19022214o342828q228183r145260q684754q759320r051859p724106n708874
977F55377030n055070m883527l670931k694071l040432l067971k003014j550555j981080
$$ plain form
852.5 704040289 708503127 715060830 721032321 726841688 734189451 741463542 746605992 751162767
868.9 751162767 756370962 760123193 761754572 763673723 766002178 766251743 764829934 764063358 763132751
887.2 763132751 760375917 757594824 756640732 755944550 754637837 754778564 756660521 757806063 757930696
905.6 757930696 758887470 759848177 758622110 756150961 754181683 751523316 747249246 743518829 741625607
923.9 741625607 740047872 738513470 738702178 740134537 740648806 740569413 741432726 742259979 741665840
942.3 741665840 740945876 741133213 740587234 738473475 736281037 734119177 730237603 724712551 719022214
960.6 719022214 712679386 704451203 695305943 686621189 677861869 668810010 661085904 655377030
977 655377030 650321960 645438433 641767502 639073431 636032999 632965028 630962014 629411459 627430379
995.3F27430379j586079n69582o30021j364708j345515j269639k245724l125489k863586
1013.7F12430036k700925l290772l228247k286792k010823k395868k037823j260877
1030E93217909j337945j642168j054167m87030q35955j019657m81069l91245r94444
1048.3E84974229j034438l81470j31547p3195P47502J591742J364529P84457O52671
1066.7E88494480J19984j109719j623154j102209q35479r51945n33223K9385k42412
1085E82245708q38638q21888o44446q41260o36339K69771Q01027O22630P10904J183033
1105.4E82050502J111389O51359O59943P22527M5955q53181j276016j528561j532733
1123.8E80051184o22034O62684J153171Q05915N55574Q05259R69410J012445J387834
$$ plain form
995.3 627430379 625844300 625274718 624644697 623279989 621934474 620664835 618419111 615293622 612430036
1013.7 612430036 609729111 606438339 603210092 600923300 598912477 596516609 594478786 593217909
1030 593217909 591879964 590237796 589183629 588696599 587860644 586840987 586359918 585968673 584974229
1048.3 584974229 583939791 583558321 583426774 583353579 584101081 585692823 587057352 587841809 588494480
1066.7 588494480 588614464 587504745 585881591 584779382 583943903 582991958 582458735 582488120 582245708
1085 582245708 581407070 580585182 579940736 579099476 578463137 578732908 579533935 580156565 580867469 582050502
1105.4 582050502 583161891 583813250 584473193 585195720 585241675 584388494 583112478 581583917 580051184
1123.8 580051184 579429150 580091834 581245005 582050920 582606494 583411753 584381163 585393608 586781442
1142.2E86781442J553297J024187O39856R17315J094282R19640J210749J999199K438963
1160.5E98578930K686620L522455M521847M863739N016208N530238N719423N191148
1176.8F35630608M771411M712701M088044K759159J593828N77807q30352k048135k291024
1195.2F48964047k078056k059519j760066r76920n81682q13782r23335q72851j235008
1213.5F37662828j674295j500189j137316j229465j286864p93636l34382l23415j46091
1231.9F29237175L89040N69462M01080N95033Q98004O29186K12968K71976K78055k28107
1252.3F33253872n09321j60337P1109l9161K96116J075626J418709J396954J797438
1270.6F38601005K374113K437472K421618K861559L138602K888262K916336L434241
$$ plain form
1142.2 586781442 588334739 589358926 589998782 590916097 592010379 592930019 594140768 596139967 598578930
1160.5 598578930 601265550 604788005 609309852 614173591 619189799 624720037 630439460 635630608
1176.8 635630608 640402019 645114720 649202764 651961923 653555751 654133558 653303206 651255071 648964047
1195.2 648964047 646885991 644826472 643066406 642089486 641507804 640694022 639770687 638897836 637662828
1213.5 637662828 635988533 634488344 633351028 632121563 630834699 630041063 629706681 629383266 629237175
1231.9 629237175 629626215 630195677 630596757 631191790 632089794 632718980 632931948 633203924 633481979 633253872
1252.3 633253872 632744551 632584214 632655323 632616162 632912278 633987904 635406613 636803567 638601005
1270.6 638601005 640975118 643412590 645834208 648695767 651834369 654722631 657638967 661073208
1287F61073208L511309L019989K844155K910197K467155J929998K044082K257049J907587
1305.3F83964729J623988J903236J954854J435578J274109J606226J483619J038253
1321.6F96284592J162529J482725J092851M75228M32015L94821j55807m72903m5538
1340G00650513L31760J92165K54571N97775L80159j31905m6730N9664o93858j788735
1360.4F99805379k533674k685488k317547j918555k062738l503739n055905l702521
1376.7F76025212l38853J514197J467049J751006K337873J658737O42538J45674n82218
1395.1F84621215j443803j765311j468897j580775k211273j930177j342714j550734
1411.4F71327531j595914q79824p56681j545131j202286m13000o24478j314402j850188
$$ plain form
1287 661073208 664584517 667604506 670448661 673358858 675826013 677756011 679800093 682057142 683964729
1305.3 683964729 685588717 687491953 689446807 690882385 692156494 693762720 695246339 696284592
1321.6 696284592 697447121 698929846 700022697 700497925 700929940 701324761 701168954 700696051 700650513
1340 700650513 700982273 701174438 701429009 702026784 702406943 702275038 702228308 702287972 701594114 699805379
1360.4 699805379 697271705 694586217 692268670 690350115 688287377 684783638 679727733 676025212
1376.7 676025212 675686359 677200556 678667605 680418611 682756484 684415221 685057759 685203433 684621215
1395.1 684621215 683177412 681412101 679943204 678362429 676151156 674220979 672878265 671327531
1411.4 671327531 669731617 668851793 668095112 666549981 665347695 664934695 664310217 662995815 661145627
1429.7F61145627j741766j628936k486586k658844j558304j589775k035439j789034
1446F45656943j805901k235174k242923j545906p65920O85394K811670L825903M188240
1464.4F48572326N894899R753227J3868034J5841246J3037681R338081P181168N270183
1480.7G28756845L919780L012002J595914l16918j168132q85486j635790l186941l269255
1499.1G26822019k532304k439141l687024n657613m674197l575146l346503k797663
1515.4F98112428k424657k234340k318919j981616j889526k168298j409650j218736
1531.7F82466686k138734j531899n12719j560152k080381m94241N78761P35819O46591
1550.1F76109731J191318J889169J911104Q82089K83838R77635O34372M5002m95553
$$ plain form
1429.7 661145627 659403861 657774925 655288339 652629495 651071191 649481416 647445977 645656943
1446 645656943 643851042 641615868 639372945 637827039 637061119 637746513 640558183 644384086 648572326
1464.4 648572326 654467225 664220452 678088486 693929732 706967413 716305494 723486662 728756845
1480.7 728756845 732676625 735688627 737284541 736967623 735799491 734914005 733278215 730091274 726822019
1499.1 726822019 724289715 721850574 718163550 712505937 707831740 704256594 700910091 698112428
1515.4 698112428 695687771 693453431 691134512 689152896 687263370 685095072 683685422 682466686
1531.7 682466686 680327952 678796053 678283334 676723182 674642801 674148560 674727321 675463140 676109731
1550.1 676109731 677301049 679190218 681101322 681983411 682267249 683244884 683879256 683924258 683428705
1568.4F83428705j492679j637757j923382l429771l605366l059029l216625l536343
1584.7F61527753m091501m471600m488230m671693n120575n101562m764140m839182
1601.1F23979270m990577m671633m460514m777730m735529m037559m383028n480229
1617.4E86442471m008949k852381l671228l846527l270328k567529j357615r06289
1633.7E63961625j407683n16832Q57354J487612J921356J956224K193213K897978K751291
1652E76102138K251863K938092L620744L987193M105746M211307M389286M443645M393995
1670.4F10444009M332006M399658M574835M618704M611135M609346M745126M841447
1686.7F47176266M918754N265951N269706N182147N446911N994558O679774O176531
$$ plain form
1568.4 683428705 681936026 680298269 678374887 674945116 671339750 668280721 665064096 661527753
1584.7 661527753 657436252 652964652 648476422 643804729 638684154 633582592 628818452 623979270
1601.1 623979270 618988693 614317060 609856546 605078816 600343287 596305728 591922700 586442471
1617.4 586442471 582433522 579581141 575909913 572063386 568793058 566225529 564867914 563961625
1633.7 563961625 562553942 562037110 562894464 564382076 566303432 568259656 570452869 573350847 576102138
1652 576102138 578354001 581292093 584912837 588900030 593005776 597217083 601606369 606050014 610444009
1670.4 610444009 614776015 619175673 623750508 628369212 632980347 637589693 642334819 647176266
1686.7 647176266 652095020 657360971 662630677 667812824 673259735 679254293 685934067 692110598
1703F92110598N561411N398155M965722M694164M749835M763245M575432M390001M211187
1721.4G35419750L843308L367543L110766L210545L138661K833069L025055L370225
1737.7G61318922L317416L183424L418625L788948L891885L903270M020571L746391
1754G90589452L110945K654910K487421K237439J911164J808464J828790J618624J150786
1772.4H09397995J177729J447498J257480R99093J144230J235247J031816R92536J047492
1790.7H19731116Q75712P11679Q71122J022697P97867N41628P17342Q75294N79536
1809.1H26723993L45647O34015P89106M32610L10242O22154O08563K77638L93808O39797
1829.5H31777573M45246K25902L58641N50032M14371K32816K98679L99351K22087J56045
$$ plain form
1703 692110598 697672009 703070164 708035886 712730050 717479885 722243130 726818562 731208563 735419750
1721.4 735419750 739263058 742630601 745741367 748951912 752090573 754923642 757948697 761318922
1737.7 761318922 764636338 767819762 771238387 775027335 778919220 782822490 786843061 790589452
1754 790589452 793700397 796355307 798842728 801080167 802991331 804799795 806628585 808247209 809397995
1772.4 809397995 810575724 812023222 813280702 814279795 815424025 816659272 817691088 818683624 819731116
1790.7 819731116 820606828 821318507 822189629 823212326 824010193 824551821 825269163 826144457 826723993
1809.1 826723993 827069640 827703655 828492761 828925371 829235613 829857767 830466330 830743968 831137776 831777573
1829.5 831777573 832222819 832448721 832807362 833357394 833771765 834004581 834303260 834702611 834924698 835080743
1849.9H35080743M24087L96728P6473J62959M71831L30567Q7142K40564K61486q2314
1870.3H37450266m1783L88026M26650j4424j10745K53439K43902p7606o437K83897
1890.7H38795185J55151j42753L0458K54512q464j44065K15352K81930j63913k16305
1911.1H39057088J95861J95026j55508j1742K87115l9935l06785N6624K14339j88232
1931.5H39303851k80857J27912J52349k92540l60012q94m3451l52025j41085J42992
1951.9H38256240j92046m49181j08302K8670l27527l24488M6551n6803m26173k56121
1972.3H36190820J09315j25289m33088q8274J59025k43425m29690m2498j073m15743
1992.6H34680080l10957J33455k3842m48823k94507Q226k54274m70638r9301P8261
$$ plain form
1849.9 835080743 835504830 835901558 835978031 836140990 836612821 836943388 837030530 837271094 837532580 837450266
1870.3 837450266 837408483 837796509 838223159 838208735 838097990 838351429 838595331 838517725 838511288 838795185
1890.7 838795185 838950336 838807583 838838041 839092553 839084089 838940024 839155376 839437306 839273393 839057088
1911.1 839057088 839252949 839447975 839292467 839280725 839567840 839527905 839221120 839277744 839492083 839303851
1931.5 839303851 839022994 839150906 839303255 839010715 838650703 838649809 838606358 838254333 838113248 838256240
1951.9 838256240 838064194 837615013 837506711 837535381 837207854 836883366 836929917 836873114 836446941 836190820
1972.3 836190820 836300135 836174846 835741758 835653484 835812509 835569084 835139394 835096896 835095823 834680080
1992.6 834680080 834369123 834502578 834478736 834029913 833735406 833743632 833489358 833018720 832919419 832997680
2013H32997680l55363n14984j09196r5010m80175l31819R5368q3983m48525k20418
2033.4H30453575M3988k43366l98993m0174M4584l44932l33786Q9228q165l87550j72078
2055.9H28702331J80363j00732m16278j03772J37806j80721k69175J36435J39773k88308
2076.3H27937722j96993K26974O7711l01838o6101K31623o8903k90036N0783J87338
2096.7H27778280j59860j65820K38299J82569k15172j02759K31922L9101k18153Q8930
2117.1H27697337L18885j0074j38402K02537K15650j21952j9908L31820J84893j40726
2137.5H28520060K6166K54154J79j34766K41399L71396L100p9870K33769K43783k1815
2159.9H29657555P7247L56674J65225j22011J24514L66568R5428n9188K54512L30090
$$ plain form
2013 832997680 832642317 832127333 832018137 831923127 831442952 831111133 831206501 831122518 830673993 830453575
2033.4 830453575 830497563 830254197 829855204 829815030 829859614 829514682 829180896 829270124 829261959 828874409 828702331
2055.9 828702331 828882694 828781962 828365684 828261912 828399718 828218997 827949822 828086257 828226030 827937722
2076.3 827937722 827740729 827967703 828035414 827733576 827667475 827899098 827830195 827540159 827590942 827778280
2096.7 827778280 827618420 827452600 827690899 827873468 827658296 827555537 827787459 827826560 827608407 827697337
2117.1 827697337 828016222 828006148 827867746 828070283 828285933 828163981 828144073 828475893 828660786 828520060
2137.5 828520060 828546226 828800380 828800559 828665793 828907192 829278588 829281688 829201818 829435587 829679370 829657555
2159.9 829657555 829734802 830091476 830256701 830134690 830259204 830625772 830721200 830662012 830916524 831246614
2180.3H31246614k6106m5419K74122J87933j06692N6505L17752R6560j26600J14321
2200.7H31988990K36333o9082j28090J99019K01405j13249n3942K35140Q6725j84834
2221.1H32398415L4988K77817M2736j46866N9903J18673j41025j26898J43707O1214
2241.5H32722664j99616p7903J32203o1214k45035j2875J36257r3401j95205L8743
2261.9H32144618Q8930j46568q9049K04563J00255j86443m9591J57773k8670j42932
2282.3H32052886J12117J88708j13428k19941K6524N8175j75179j02996J45554K6167
2302.7H31998587k15292r3103P3970j00911k03908N1856J35065k09332l96311j57654
2323.1H30882967k8015j83642j32918J10686L8564j71304o6876J00911j3888m3810
$$ plain form
2180.3 831246614 831220508 831175089 831449211 831637144 831530452 831586957 831904709 832001269 831874669 831988990
2200.7 831988990 832225323 832156241 832028151 832227170 832428575 832315326 832261384 832496524 832583249 832398415
2221.1 832398415 832433403 832711220 832753956 832607090 832666993 832785666 832644641 832517743 832661450 832722664
2241.5 832722664 832523048 832445145 832577348 832516134 832271099 832258224 832394481 832301080 832105875 832144618
2261.9 832144618 832233548 832086980 831997931 832202494 832302749 832116306 832066715 832224488 832195818 832052886
2282.3 832052886 832165003 832353711 832240283 832020342 832046866 832105041 831929862 831826866 831972420 831998587
2302.7 831998587 831783295 831690192 831764162 831663251 831459343 831511199 831646264 831436932 831040621 830882967
2323.1 830882967 830854952 830671310 830538392 830649078 830687642 830516338 830449462 830550373 830536485 830492675
2343.5H30492675L06487N89967L74794q4162l51846m06682m48823k80142M4405J58430
2363.8H30395103J01566K19226L78549L16262L54648O02245O00457L52860K94685L88026
2384.2H34003627K66016J4007R239J48773N8055j32144r3639O676q1003j25050M4048
2406.7H34118605O8247j53720j91689r000k2114k00748j57177J7941m5836k20359j57893
2429.1H33046257n4299j78635k34306n5135j7106k17259k44677o5923o7830k10941
2449.5H31700146j53780k861r7930k86162k11299p9691j96993k74957r1672j3172k20537
2471.9H30071092l03507j40608j37269k82168j95981j9252j29461k99990j84000o1631
2492.3H28317225k00689k66790p4685k7716k71320l55602j62065r8765j86264j36674
$$ plain form
2343.5 830492675 830799162 831389129 831763923 831679761 831327915 830921233 830472410 830192268 830236673 830395103
2363.8 830395103 830496669 830715895 831094444 831410706 831765354 832367599 832968056 833320916 833615601 834003627
2384.2 834003627 834269643 834283650 834292889 834441662 834499717 834367573 834273934 834280610 834199607 834074557 834118605
2406.7 834118605 834186852 834033132 833841443 833832443 833810329 833609581 833452404 833470345 833424509 833204150 833046257
2429.1 833046257 832991958 832813323 832579017 832523882 832506776 832289517 832044840 831978917 831911087 831700146
2449.5 831700146 831546366 831543505 831445575 831159413 830948114 830868423 830671430 830396473 830304801 830291629 830071092
2471.9 830071092 829767585 829626977 829489708 829207540 829011559 828992307 828862846 828562856 828378856 828317225
2492.3 828317225 828116536 827849746 827775061 827747345 827476025 827120423 826958358 826859593 826673329 826536655
2512.7H26536655n4597j79410l36171k36034r7811k12848k98202j32025p2121k51115
2533.1H24666321k78771j14977j32740k63869j61350k2233j80721l63529k19941p2539
2553.5H22855651k40206l28601j33097r1255l10242l70800k17319k18808l56377k73525
2573.9H20315421j29879l16620n09500l40641k15232l95835m49419k21252j99556m88937
2594.3H17048550n62668l48687l49641n30958m47452k75732m03106n74648m45426l22878
2614.7H12787354m84884n50389l46899k97666m98533n28157l64423m03642n25475l73244
2635.1H08414042k36392m42624o21498m42683k85328m35293m83214l02077l36826n80608
2655.5H04247499n66900l38018l52144n22674m37080k87414m12047m97281k94447j80960
$$ plain form
2512.7 826536655 826482058 826302648 825966477 825730443 825632632 825419784 825121582 824989557 824917436 824666321
2533.1 824666321 824387550 824272573 824139833 823875964 823714614 823692381 823511660 823148131 822928190 822855651
2553.5 822855651 822615445 822286844 822153747 822062492 821752250 821381450 821164131 820945323 820588946 820315421
2573.9 820315421 820185542 819868922 819359422 819018781 818803549 818407714 817958295 817737043 817537487 817048550
2594.3 817048550 816485882 816137195 815787554 815256596 814809144 814533412 814130306 813555658 813110232 812787354
2614.7 812787354 812302470 811752081 811405182 811107516 810608983 810080826 809716403 809312761 808787286 808414042
2635.1 808414042 808177650 807735026 807113528 806670845 806385517 805950224 805467010 805164933 804828107 804247499
2655.5 804247499 803680599 803342581 802990437 802467763 802030683 801743269 801331222 800833941 800539494 800358534
2675.9H00358534l47614m13835k61963k95877n04732m34518k02895k75850m58777l61800
2696.3G96800673k62976m41372n66304m41074m09961o04689o43075m76777n43892p70271
2716.7G91640282o86527m71949n64635o85036n24581m24504n24998m52995j64330j32441
2737.1G87008286l75331l70800j73748k71499n28455n01037l72946m93765o00815m56631
2757.5G82863259m16994o39260p18474n65767n73755p42673o97971n51343p24673j030862
2777.9G76201487j005471q53658r52363j043916q77857q41141j109004j207530j021087
2796.2G67289460j049578j327515j351118j223028j412392j686275j663923j647591
2812.5G55928040j895249k088070k098859k316296k795756l156304l477633m133522
$$ plain form
2675.9 800358534 800010920 799597085 799335122 799039245 798534513 798099995 797897100 797621250 797162473 796800673
2696.3 796800673 796537697 796096325 795530021 795088947 794678986 794074297 793431222 792954445 792410553 791640282
2716.7 791640282 790953755 790481806 789917171 789232135 788707554 788283050 787758052 787305057 787140727 787008286
2737.1 787008286 786632955 786262155 786088407 785816908 785288453 784787416 784414470 783920705 783319890 782863259
2757.5 782863259 782446265 781807005 781088531 780522764 779949009 779206336 778508365 777957022 777232349 776201487
2777.9 776201487 775196016 774342358 773389995 772346079 771468222 770627081 769518077 768310547 767289460
2796.2 767289460 766239882 764912367 763561249 762338221 760925829 759239554 757575631 755928040
2812.5 755928040 754032791 751944721 749845862 747529566 744733810 741577506 738099873 733966351
2828.9G33966351n084753o138742p538856r640216j2234331j4867782j7531574k0274579
2845.2F40655518k2253931k1887481j7745257r663283J40070Q027137J1668324J1298120
2861.5F00239217Q526445M865288J642704L06428J534343L993690N435228M968286
2877.8F31511629L081560N24282k057194m167557n652547o736577p439434p606328
2894.1F01457834p600128p829190q114636q391678r036362j0219872j1849761j3969481
2910.4E24446726j6628027j9260913k0725996k0101636j6961783j1252404l744930
2924.7D15771037L938347J0236949J4517784J7139763J8481284J8464715J7030298
2939E15580177J4282763J0365546N733609J252294k191901l830970l184616m76480
$$ plain form
2828.9 733966351 728881598 722742856 715204000 705563784 693329453 678461671 660930097 640655518
2845.2 640655518 618401587 596514106 578768849 569105566 569245636 577272773 588941097 600239217
2861.5 600239217 608765662 613630950 615273654 615580082 617114425 621108115 626543343 631511629
2877.8 631511629 634593189 635117471 633060277 628892720 623240173 616503596 609064162 601457834
2894.1 601457834 593857706 586028516 577913880 569522202 560485840 550265968 538416207 524446726
2910.4 524446726 507818699 488557786 467831790 447730154 430768371 419515967 415771037
2924.7 415771037 419709384 429946333 444464117 461603880 480085164 498549879 515580177
2939 515580177 529862940 540228486 545962095 547214389 545022488 541191518 538006902 537530422
2955.3E37530422L241122O779134R743154J2261987J4119327J4887333J4617682J3658165
2971.6F26838326J2104631J0169864Q492112P230997N935907M711688L940880L383756
2987.9F82808161K753556K123892J570821J095950O05703K10046Q0586l7313j98364
3006.3F91013038m9293L01778L31819J09256N6565N3048j34588k84612k88009l79980
3026.7F90729022n20706n17726m58002o15895r09984q67426o50168p91073j093626
3045.1F84304416j107931r49740r74059j090587j038372r85623j046598r66191p63893
3063.4F75381422p15435q53061r18508p96556p32243o98149n22376n64515q78334r87053
3083.8F67715192q88705q27671q81850r56953r39965r85861j070499j060367j066446
$$ plain form
2955.3 537530422 540771544 547550678 557293832 569555819 583675146 598562479 613180161 626838326
2971.6 626838326 638942957 649112821 657604933 664835930 670771837 675483525 679424405 682808161
2987.9 682808161 685561717 687685609 689256430 690352380 690958083 691168129 691248715 691211402 691013038
3006.3 691013038 690963745 691265523 691597342 691706598 691763163 691816211 691681623 691397011 691109002 690729022
3026.7 690729022 690208316 689690590 689232588 688616693 687706709 686839283 686189115 685398042 684304416
3045.1 684304416 683196485 682246745 681272686 680182099 679143727 678158104 677111506 676145315 675381422
3063.4 675381422 674665987 673812926 672894418 672097862 671365619 670667470 670145094 669580579 668702245 667715192
3083.8 667715192 666826487 665998816 665116966 664160013 663220048 662234187 661163688 660103321 659036875
3102.2F59036875j119316j093149r97186j073897j223683j109064r70006j174748j534760
3120.5F48741066j639604j488567j409232j447797j457930j488983j557350j465440
3136.8F36786163j337052j546680j821697j740515j548410j508117j537919j617431
3153.2F24128342j765609j885235j881004j756429j703203j804650j823604j706004
3169.5F09802604j711548j843333j869023j818120j818478j846969j811147j740515
3185.8E95343471j762093j803338j767635j786292j900792j901090j756132j723826
3202.1E80942273j792490j727820j665234j742542j775026j696349j650571j726032
3218.4E67166209j756131j660943j659930j771212j722872j535118j506149j657725
$$ plain form
3102.2 659036875 657917559 656824410 655827224 654753327 653529644 652420580 651450574 650275826 648741066
3120.5 648741066 647101462 645612895 644203663 642755866 641297936 639808953 638251603 636786163
3136.8 636786163 635449111 633902431 632080734 630340219 628791809 627283692 625745773 624128342
3153.2 624128342 622362733 620477498 618596494 616840065 615136862 613332212 611508608 609802604
3169.5 609802604 608091056 606247723 604378700 602560580 600742102 598895133 597083986 595343471
3185.8 595343471 593581378 591778040 590010405 588224113 586323321 584422231 582666099 580942273
3202.1 580942273 579149783 577421963 575756729 574014187 572239161 570542812 568892241 567166209
3218.4 567166209 565410078 563749135 562089205 560317993 558595121 557060003 555553854 553896129
3234.7E53896129j708805j615286j600802j581013j397491j297653j448393j551210
3251.1E41695476j428426j331031j389206j409113j321852j311481j359165j238644
3267.4E30906558j093507j231730j429558j387417j293003j308859j309991j254558
3283.7E20597935j285076j331032j194358j108408j299321j482249j459360j391351
3300E10046780j352072j255989j252293j505733j783490j820743j675367j615376j677394
3318.4D96108323j667380j607835j673430j812608j830875j804591j864403j854509
3334.7D81992692j742661j779258j948625k012104k018362k019108j930952j918495
3351D66623127k090990k236545k181232k032250k027452k085030j937807j782387j965672
$$ plain form
3234.7 553896129 552187324 550572038 548971236 547390223 545992732 544695079 543246686 541695476
3251.1 541695476 540267050 538936019 537546813 536137700 534815848 533504367 532145202 530906558
3267.4 530906558 529813051 528581321 527151763 525764346 524471343 523162484 521852493 520597935
3283.7 520597935 519312859 517981827 516787469 515679061 514379740 512897491 511438131 510046780
3300 510046780 508694708 507438719 506186426 504680693 502897203 501076460 499401093 497785717 496108323
3318.4 496108323 494440943 492833108 491159678 489347070 487516195 485711604 483847201 481992692
3334.7 481992692 480250031 478470773 476522148 474510044 472491682 470472574 468541622 466623127
3351 466623127 464532137 462295592 460114360 458082110 456054658 453969628 452031821 450249434 448283762
3369.3D48283762k272845k232819j920462j754999j709789j624286j549870j448631
3385.7D33770061j172752q70824r65714j266569j165330p39157n49406q32916j129746
3404D25077647r33051n73009m33922m08679m19826m15087l19421j95473p6801P5877
3424.4D21378255K46555M08291M64380N43594P31230O87480M26769M37618P73847J019776
3444.8D27117795J029610J062334J255780J363427J354426J468599J608223J523077
3461.1D37783271J508951J841903K019733J700103J336903J404673J705646J937777
3477.4D51238960J927137J703412J693040J898378J942396J912177J975804K021194
3493.8D66312498K056867K072930K095312K104610J990408J913279J978368K135902
$$ plain form
3369.3 448283762 446010917 443778098 441857636 440102637 438392848 436768562 435218692 433770061
3385.7 433770061 432597309 431726485 430760771 429494202 428328872 427589715 427040309 426207393 425077647
3404 425077647 424144596 423571587 423137665 422728986 422309160 421894073 421574652 421379179 421302378 421378255
3424.4 421378255 421624810 422033101 422497481 423041075 423772305 424459785 424886554 425324172 426098019 427117795
3444.8 427117795 428147405 429209739 430465519 431828946 433183372 434651971 436260194 437783271
3461.1 437783271 439292222 441134125 443153858 444853961 446190864 447595537 449301183 451238960
3477.4 451238960 453166097 454869509 456562549 458460927 460403323 462315500 464291304 466312498
3493.8 466312498 468369365 470442295 472537607 474642217 476632625 478545904 480524272 482660174
3510.1D82660174K353341K381980K218217K236813K424002K536058K441913K281964
3526.4E01534462K283752K436578K637089K764642K673328K582848K851963L090739
3542.7E22855401K854943K506733K633095K855122K788067K836108L047586L152609
3559E45529664L162145L137708K920210K838314L317892L661931L554881L490865L587663
3577.4E75201273L788769M080534M216075L837526L312886L669798M194141M137039
3593.7F06438041M121244M316866M305959M275143M427314M285931M011751M163622
3610F40345871M416347M571736M597306M213929M094899M474163M721165M321694L447533
3628.4F79204643L792643M516065M310847M030585L948748L943563M046797M073143
$$ plain form
3510.1 482660174 485013515 487395495 489613712 491850525 494274527 496810585 499252498 501534462
3526.4 501534462 503818214 506254792 508891881 511656523 514329851 516912699 519764662 522855401
3542.7 522855401 525710344 528217077 530850172 533705294 536493361 539329469 542377055 545529664
3559 545529664 548691809 551829517 554749727 557588041 560905933 564567864 568122745 571613610 575201273
3577.4 575201273 578990042 583070576 587286651 591124177 594437063 598106861 602301002 606438041
3593.7 606438041 610559285 614876151 619182110 623457253 627884567 632170498 636182249 640345871
3610 640345871 644762218 649333954 653931260 658145189 662240088 666714251 671435416 675757110 679204643
3628.4 679204643 682997286 687513351 691824198 695854783 699803531 703747094 707793891 711867034
3644.7G11867034L637016K952039L059090L583073L323496L046691L293693L125847
3661G37887979K734899K778053K667666K022385K116085K419292J604498J492083K107263
3679.4G57830203K182543K276838K318978J829982J177728J264572J620233J625121
3695.7G72126198J445293J127601Q06153R62496J254975J097739N33521J50204O77943
3714G80182123J084924Q72672O02722M52757L06427K83063P20977R25303M83095M8519
3734.4G85962582J18672O99699J086951L39567n64813L48687O97493k99811j28984
3752.8G88260043P39514O95050J99676K30133N30839M62115K70546l2604o5208L57747
3773.2G91647851N07713K90274L3796O1512J09494L3796J60932K70725K65658K60233
$$ plain form
3644.7 711867034 715504050 718456089 721515179 725098252 728421748 731468439 734762132 737887979
3661 737887979 740622878 743400931 746068597 748090982 750207067 752626359 754230857 755722940 757830203
3679.4 757830203 760012746 762289584 764608562 766438544 767616272 768880844 770501077 772126198
3695.7 772126198 773571491 774699092 775505245 776467741 777722716 778820455 779353976 779504180 780182123
3714 780182123 781267047 782139719 782742441 783195198 783501625 783784688 784505665 785430968 785914063 785962582
3734.4 785962582 786081254 786780953 787867904 788207471 787642658 787991345 788688838 788389027 788260043
3752.8 788260043 788999557 789694607 789894283 790124416 790655255 791117370 791387916 791355312 791290104 791647851
3773.2 791647851 792155564 792445838 792479634 792541146 792650640 792684436 792845368 793116093 793381751 793641984
3793.6G93641984J75775J92284j01447m42982J76967J55925l06070K58267O88136K00212
3814G94639051l11613J16408p1645n42820J17541L99709K41994J12057P8619K82943
3834.4G95062244l4273n78046k34901J30653J23203L32355O25730K40743j236439j283884
3854.8G93147385N04553Q43645L02493j28507j03534J22845k21669l24428M8399R0897
3875.2G94282079J55866m7267j41441O0618j61410j2696J14441l24309j30117L74854
3895.5G94170618J31905l70264m41015l20732r6739J99259K15232J01566J7584j73033
3915.9G93434381k53021k9385P9274p6234r7931J1563k6881p9811k7001n2094l0160
3938.4G92852700P8618k0504j14202n2273m6492n4717j2815J8537r060k8789K980L4809
$$ plain form
3793.6 793641984 793817759 794010043 793908596 793465614 793642581 793798506 793492436 793750703 794438839 794639051
3814 794639051 794327438 794443846 794372201 793829381 793946922 794346631 794588625 794700682 794779301 795062244
3834.4 795062244 795027971 794449925 794215024 794345677 794468880 794801235 795426965 795667708 794431269 793147385
3854.8 793147385 793651938 794495583 794798076 794669569 794566035 794688880 794467211 794142783 794191182 794282079
3875.2 794282079 794437945 794390678 794249237 794309855 794148445 794135749 794250190 793925881 793795764 794170618
3895.5 794170618 794302523 793932259 793491244 793170512 793073773 793273032 793488264 793589830 793607414 793434381
3915.9 793434381 793181360 793151975 793231249 793155015 793057084 793068647 793041766 792961955 792934954 792882860 792852700
3938.4 792852700 792931318 792910814 792796612 792744339 792697847 792643130 792630315 792648852 792639792 792611003 792613983 792648792
3962.9G92648792M649n4538k0265P9214P5042L756K0325M2915k027l5583k4438l2723
3987.3G92705119p8738k0146J32858J66297L2425
3997.5G92937815
$$ plain form
3962.9 792648792 792653441 792598903 792578638 792657852 792732894 792736650 792756975 792799890 792797863 792762280 792737842 792705119
3987.3 792705119 792626381 792606235 792739093 792905390 792937815
3997.5 792937815
##END=$$ End of the data block
