##TITLE=$$ Begin of the data block
##JCAMP-DX=5.00 $$ ACD/SpecManager v 10.08
##SPECTROMETER/DATA SYSTEM=Alpha
##DATE=14 Apr 2014 11:23:48
##DATA TYPE=INFRARED SPECTRUM
##DATA CLASS=XYDATA
##ORIGIN=
##OWNER=
##NPOINTS=1765
##FIRSTX=399.75695801
##LASTX=3997.56933594
##MAXX=3997.56933594
##MINX=399.75695801
##MAXY=0.84010613
##MINY=0.41621730
##XFACTOR=1.0000000000
##YFACTOR=1.000000000000000e-9
##FIRSTY=0.65753108
##DELTAX=2.03957629
##XUNITS=1/CM
##YUNITS=ARBITRARY UNITS
##XYDATA=(X++(Y..Y))
399.8F57531083l141463j796365N32746r45508k461970n54860N27561q20279j004815
418.1F47866130L51071k42710j619995p26640O62387k53857j022100j59144k03729
436.5F44651413j011431n20408L78906o5148n44667M75526P01785p79390r05574N12004
456.9F42893016J58072j355708p06255N38647l80576j377046m25875N0247j056552
475.2F38337970j063347L10361L40760p72834m06921M83513l90470j271188k63035
493.6F35304809K46882r88483j164675J99139Q2612j297176q07583N26190l74973j558483
514F30168259m06146L13521j206100j684487k09511p748j393616j127243K54869k89500
534.4F24412298j343965k46048N97655p68065j208782L96371M16517j278400r66073
$$ plain form
399.8 657531083 654389620 652593255 653126001 652180493 649718523 649163663 649691224 648870945 647866130
418.1 647866130 648217201 647974491 646354496 645627856 646290243 646036386 645014286 644855142 644651413
436.5 644651413 643639982 643119574 643498480 643433332 642888665 643364191 644065976 643286586 642381012 642893016
456.9 642893016 643051088 641695380 640989125 641527772 641147196 639770150 639344275 639394522 638337970
475.2 638337970 637274623 637584984 637925744 637152910 636745989 637229502 636839032 635567844 635304809
493.6 635304809 635551691 634563208 633398533 633597672 633680284 632383108 631575525 632101715 631726742 630168259
514 630168259 629762113 630075634 628869534 627185047 626975536 626967788 625574172 624446929 624701798 624412298
534.4 624412298 623068333 622822285 623419940 622651875 621443093 621839464 622255981 620977581 620011508
552.7F20011508L87907n09500j768529n75602L07858j457811k311945n96344l42846
571.1F13144696k070070j716077J57237l42488j766324o40571M46796j014352j407206
589.4F04791641O89090J045107r33051p17640J232565M66108j336336o9618J489937
607.8F06657803o9201j176953O02126J314938K5690R43422L378212K928734J146495
626.1F15751266K213359L610850J945793P02262K369643K687931L31223m4585J829267
644.5F31397009J710117L28958J162350J883328k55406q43346K560556M139781J956701
662.9F44040048R84252K288103K413869J074850K145589L302991J639485L38257K243817
681.2F60471261K872228M97580R1612K097547J515687p78556m8220J687049L87192
$$ plain form
552.7 620011508 620399415 619889915 618121386 617545784 617853642 616395831 614083886 613487542 613144696
571.1 613144696 611074626 609358549 609515786 609173298 607406974 606766403 607213199 606198847 604791641
589.4 604791641 605480731 606525838 605592787 604875147 606107712 606573820 605237484 605167866 606657803
607.8 606657803 606588602 605411649 606013775 607328713 607354403 608297825 611676037 614604771 615751266
626.1 615751266 617964625 621575475 623521268 624223530 626593173 629281104 629612327 629567742 631397009
644.5 631397009 633107126 633436084 634598434 636481762 636226356 635383010 637943566 642083347 644040048
662.9 644040048 645024300 647312403 649726272 650801122 652946711 656249702 657889187 658227444 660471261
681.2 660471261 663343489 663841069 663932681 666030228 667545915 666767359 666719139 668406188 668793380
699.6F68793380r46879R24528K116739L40581p9274J977444J888334m39703k81572
717.9F74293578J628935J261055N00679K373517L513455J399935K81453K003431K063573
736.3F89319611j60873N960J979709J305997k26259J249313K743781J110434J27316
754.6F97454989J986265K372682J76013M232J917362J425743m96805K50757J539707
773G06630945j97828j835763m74632J38164j771212j888096M78446R46105j38343J375676
793.4G03263462L953695L618955K639533M211485N195618L174245K004981L304064
809.7G31366038L043652P53045M97222J611531Q7082k449751k243161j698494l744900
828.1G27222264n074680l486395k596676l773690l510057j684010j808942k951026
$$ plain form
699.6 668793380 667846501 668771029 670887768 671228349 671149075 673126519 675014853 674575150 674293578
717.9 674293578 675922513 677183568 677684247 680057764 683571219 684971154 685252607 687256038 689319611
736.3 689319611 689158738 689164698 691144407 692450404 692224145 693473458 696217239 697327673 697454989
754.6 697454989 699441254 701813936 701989949 701994181 703911543 705337286 704840481 705091238 706630945
773 706630945 706433117 704597354 704122722 704260886 702489674 700601578 701080024 702026129 701887786 703263462
793.4 703263462 707217157 710836112 713475645 717687130 722882748 726056993 728061974 731366038
809.7 731366038 734409690 735162735 735659957 737271488 737358570 734908819 732665658 730967164 727222264
828.1 727222264 722147584 718661189 716064513 712290823 708780766 707096756 705287814 702336788
844.4G02336788j608789P68006J177609J678348M509508O577373N903959N806387P433056
862.7G34582245P269919N064369M572391N292118L754377J582682J916945K356768
879.1G66391814K79128j401066p70152r69052k812148k805292r59098o96362j297175
897.4G54960597J23381J827896J091659J18971R62257R43124j187384k348244j878202
915.8G54614055k693534m346847l746212j893937j595796j530230K26856J434147M57227
934.1G40925729j02758Q78036P82311o50644o88196K45750n70178k184152k205372
952.5G36430526k145052l918708n549371n602717o260336q259713r172678q636713
968.8F86885238q723677r065985p730186n700886n063057m887045l665566k726555
$$ plain form
844.4 702336788 700727999 701496005 702673614 704351962 708861470 715438843 721342802 727149189 734582245
862.7 734582245 741852164 746916533 751488924 756781042 760535419 762118101 764035046 766391814
879.1 766391814 766670942 765269876 764499724 763530672 760718524 757913232 756954134 756257772 754960597
897.4 754960597 755083978 756911874 758003533 758122504 759084761 760027885 758840501 756492257 754614055
915.8 754614055 751920521 747573674 743827462 741933525 740337729 738807499 739034355 740468502 740925729
934.1 740925729 740822971 741701007 742483318 741832674 741144478 741390228 740820050 738635898 736430526
952.5 736430526 734285474 730366766 724817395 719214678 712954342 704694629 695521951 686885238
968.8 686885238 678161561 669095576 661365390 655664504 650601447 645714402 642048836 639322281
985.1F39322281l111780l083050j944184j513183k007068j652479o28590o41048j320899
1003.5F23420000j275718j247585k275288l125787k835214k698779l304362l235758
1019.8F03421509k290547j987636k333402j990557j293540j413167j674592j040638
1036.1E89397430m41372p74980j000702m99606m13597j004874j030267l81052j35899
1054.5E83715081o5565P67887J580238J322031P60019O21498Q9764j071691j547218
1072.8E86172044j064002q56877j015067n75781N6923j93179q25941q21889o43492
1091.2E80232739q50200o42419K61903Q05020O76453P69794J192093J095712O28233
1109.5E84169328O27160P07329O4313q34346j287520j531243j499951o27577N85019
$$ plain form
985.1 639322281 636210501 633127451 631183267 629670084 627663016 626010537 625381947 624740899 623420000
1003.5 623420000 622144282 620896697 618621409 615495622 612660408 609961629 606657267 603421509
1019.8 603421509 601130962 599143326 596809924 594819367 593525827 592112660 590438068 589397430
1036.1 589397430 588956058 588181078 587180376 586680770 586267173 585262299 584232032 583850980 583715081
1054.5 583715081 583649516 584417403 585997641 587319672 588079691 588701189 588790953 587719262 586172044
1072.8 586172044 585108042 584251165 583236098 582660317 582717240 582524061 581698120 580876231 580232739
1091.2 580232739 579382539 578740120 579002023 579807043 580483496 581253290 582445383 583541095 584169328
1109.5 584169328 584796488 585503817 585568130 584733784 583446264 581915021 580415070 579787493 580372512
1127.9E80372512J102388Q31187N98192Q23736R73106J015842J368820J506746J011789
1146.2E89604318O89626R57250J083553R16004J238704K018333K445161K700090L499091
1164.6F05152130M436970M801035N028724N552590N687774N141735M767060M737019
1180.9F45305037M087091K743006J603245N96703q25763k053142k315938k134979k097309
1199.3F44907951j733124r47297n83291q04960r03488q55207j211643j673341j538873
1217.6F34656727j166165j231849j279652p78437l16977k99096j28091L89100N74827
1236F30420387M02808N65588Q63076O33001K50638K98023K99334j66535m43757j52349
1256.4F32970214L0815q5830K73526J060009J391708J396954J815796K366126K421915
$$ plain form
1127.9 580372512 581474900 582306087 582904279 583728015 584701121 585716963 587085783 588592529 589604318
1146.2 589604318 590293944 591251194 592334747 593250751 594489455 596507788 598952949 601653039 605152130
1164.6 605152130 609589100 614390135 619418859 624971449 630659223 635800958 640568018 645305037
1180.9 645305037 649392128 652135134 653738379 654335082 653509319 651456177 649140239 647005260 644907951
1199.3 644907951 643174827 642227530 641644239 640839279 639935791 639080584 637868941 636195600 634656727
1217.6 634656727 633490562 632258713 630979061 630200624 629883647 629584551 629456460 629845560 630420387
1236 630420387 630823195 631388783 632251859 632884860 633135498 633433521 633732855 633566320 633122563 632970214
1256.4 632970214 633001029 632915199 633188725 634248734 635640442 637037396 638853192 641219318 643641233
1274.7F43641233K417446K851247L128112K906322K941132L416478L472925L018081
1291F67792976K881467K950490K489447J935959K025366K209425J863718J616776J925886
1309.4F87691510J972139J439988J277805J597642J472593J058340J207888J511455
1325.7F99229360J082956M49896M40240M19855j72317n13077n7399L51787K16484K69353
1346.1G01717138N92292L65913j24813l5941M3630p06434j760244k503872k705455
1364.5F94882214k357423j941622k069890l500223n043268l701866l65913J487970
1380.8F77389979J479268J776398K327561J650393O78003J76191n74171j439333j785875
1399.1F81678414j505732j593828k205968j910568j300692j519740j587689q80897
$$ plain form
1274.7 643641233 646058679 648909926 652038038 654944360 657885492 661301970 664774895 667792976
1291 667792976 670674443 673624933 676114380 678050339 680075705 682285130 684148848 685765624 687691510
1309.4 687691510 689663649 691103637 692381442 693979084 695451677 696510017 697717905 699229360
1325.7 699229360 700312316 700762212 701202452 701622307 701449990 700936913 700879514 701231301 701447785 701717138
1346.1 701717138 702309430 702675343 702550530 702514589 702558219 701851785 700091541 697587669 694882214
1364.5 694882214 692524791 690583169 688513279 685013056 679969788 676267922 675902009 677389979
1380.8 677389979 678869247 680645645 682973206 684623599 685301602 685477793 684903622 683464289 681678414
1399.1 681678414 680172682 678578854 676372886 674462318 673161626 671641886 670054197 669173300
1415.5F69173300p87377j596332j212895l90768o11424j300693j815617j709342j631200
1433.8F58117652k513826k678633j579523j627385k069593j810610j809120k201140
1450.1F41827822k213717j579761q23140O93917K841770L840507M219710N932570R742439
1468.5F64482117J3801694J5785515J3045788R368717P208884N288661L924012L017783
1484.8G35923171J603365l22640j172066q76009j632691l200352l272891k527356k444267
1503.2G22078264l665149n600691m681707l614485l346026k786577k435326k239466
1519.5F93708837k318680j987517j868725k119780j383960j226425k149939j531959
1535.8F79121852n10335j551747k042473m65512N49972O85334O41823J237094J926184
$$ plain form
1415.5 669173300 668385923 666789591 665576696 665185928 664574504 663273811 661458194 659748852 658117652
1433.8 658117652 655603826 652925193 651345670 649718285 647648692 645838082 644028962 641827822
1450.1 641827822 639614105 638034344 637211204 637905121 640746891 644587398 648807108 654739678 664482117
1468.5 664482117 678283811 694069326 707115114 716483831 723692715 728981376 732905388 735923171
1484.8 735923171 737526536 737203896 736031830 735155821 733523130 730322778 727049887 724522531 722078264
1503.2 722078264 718413115 712812424 708130717 704516232 701170206 698383629 695948303 693708837
1519.5 693708837 691390157 689402640 687533915 685414135 684030175 682803750 680653811 679121852
1535.8 679121852 678611517 677059770 675017297 674551785 675101757 675787091 676428914 677666008 679592192
1554.1F79592192J895011Q43644K95996J026929O69658K9802n38945j492023j606584
1572.5F80715680j931548l470421l603518l014088l195464l564417m109383m448414
1588.8F53378427m457474m663169n127132n097568m742622m813970m973352m663586
1605.1F14839554m458010m772962m705250l975451m364550n521238m000425k829969
1621.4E80211699l696740l878653l264188k551556j381397r53317j430690n19455Q47519
1639.8E63383222J475572J918614J959443K167642K856493K712965K211333K935886
1656.1E81621170L636420L980160M083156M200041M395247M462063M394830M318773
1672.4F15091860M410029M582464M589260M585028M611134M737199M828334M914104
$$ plain form
1554.1 679592192 681487203 682330847 682626843 683653772 684323430 684353232 683814287 682322264 680715680
1572.5 680715680 678784132 675313711 671710193 668696105 665500641 661936224 657826841 653378427
1588.8 653378427 648920953 644257784 639130652 634033084 629290462 624476492 619503140 614839554
1605.1 614839554 610381544 605608582 600903332 596927881 592563331 587042093 583041668 580211699
1621.4 580211699 576514959 572636306 569372118 566820562 565439165 564485848 563055158 562535703 563383222
1639.8 563383222 564858794 566777408 568736851 570904493 573760986 576473951 578685284 581621170
1656.1 581621170 585257590 589237750 593320906 597520947 601916194 606378257 610773087 615091860
1672.4 615091860 619501889 624084353 628673613 633258641 637869775 642606974 647435308 652349412
1688.8F52349412N231262N212724N167365N468488N968451O623507O171226N621791
1705.1F97814226N465269M980445M694104M770041M797160M619658M442990M261792
1721.4G35845685L893495L413438L140390L234208L151655K829254L034174L374160
1737.7G61916459L307521L192306L430187L777743L864467L870487L988624L718316
1754G91066110L099382K676249K516448K223134J864553J800298J874566J646042J120448
1772.4H09887230J142919J425148J238405J015008J183450J241445J022041J002312
1788.7H19157958J045942Q61585P15912Q72791J012623P91967N41687P19428Q85725
1807H26605618O02484L70145O42061P76231M18663L26812O59407O15656K45690L58820
$$ plain form
1688.8 652349412 657580674 662793398 667960763 673429251 679397702 686021209 692192435 697814226
1705.1 697814226 703279495 708259940 712954044 717724085 722521245 727140903 731583893 735845685
1721.4 735845685 739739180 743152618 746293008 749527216 752678871 755508125 758542299 761916459
1737.7 761916459 765223980 768416286 771846473 775624216 779488683 783359170 787347794 791066110
1754 791066110 794165492 796841741 799358189 801581323 803445876 805246174 807120740 808766782 809887230
1772.4 809887230 811030149 812455297 813693702 814708710 815892160 817133605 818155646 819157958
1788.7 819157958 820203900 821065485 821781397 822654188 823666811 824458778 825000465 825719893 826605618
1807 826605618 827208102 827578247 828220308 828996539 829415202 829742014 830401421 831017077 831262767 831621587
1827.4H31621587O02961M26769K61009M04775N57482L99530K25425K83420L52621J98603
1847.8H35334182K04980M78625L91722P1466J97649M76062K71619L6120K42830L06963
1868.2H38012218k5749j6689L84450M07040k3723q8930K65599K29716q9228K682L04580
1890.7H39361966J60813j49131L9339K56479l6120j55330K32696K94686j52052j83165
1911.1H39670181K21193J57833k26199l3856L16978o557k88069N0962J88231k10046
1931.5H39840651k79069J41799J36495l11435l25560L9756o1631l77059j12236J74046
1951.9H38865757k15292m90844j19210M2677l15725l13998O1453n4002m30167k55644
1972.3H36775005Q5413j55389m16338m6552J69993k66075m27485j2994P868m23133
$$ plain form
1827.4 831621587 832224548 832651317 832912326 833317101 833874583 834274113 834499538 834782958 835135579 835334182
1847.8 835334182 835539162 836017787 836409509 836480975 836678624 837154686 837426305 837462425 837705255 838012218
1868.2 838012218 837986469 837969780 838354230 838761270 838737547 838648617 838914216 839143932 839054704 839057386 839361966
1890.7 839361966 839522779 839373648 839412987 839669466 839633346 839478016 839710712 840005398 839853346 839670181
1911.1 839670181 839891374 840049207 839823008 839789152 840106130 840099573 839811504 839862466 840050697 839840651
1931.5 839840651 839561582 839703381 839839876 839528441 839202881 839242637 839181006 838803947 838691711 838865757
1951.9 838865757 838650465 838159621 838040411 838083088 837767363 837453365 837514818 837460816 837030649 836775005
1972.3 836775005 836860418 836705029 836288691 836242139 836412132 836146057 835718572 835705578 835713446 835290313
1992.6H35290313l25680R5844n8889m31836k44081L4452k61069m65095o8307P7010
2013H33642662l88563n25475r8645r0063m70877l01003R6023j49190n07355k17259
2033.4H30990255O9678k55049m16398r238N6982l62337l10123J08004k7716l93093
2053.8H29450965j60396J72317j16646m00067p3671J36196k05278k70247J51991J41800
2074.2H28826964k79248k01762J78457L2603k78532j6511K48850q2493k83718O7472
2094.6H28212082J79947j62482j50562K25485J48058k07842o1631K29657l934k24710
2115H28184068J06514K92301n3287j29819K41518K25723j42097l8266L24070J73807
2135.4H29184532j37508P2181L07858J5200j38939K44916L70383j0908q9526K42412
$$ plain form
1992.6 835290313 834964633 835060477 835001588 834569752 834325671 834360123 834099054 833633959 833565652 833642662
2013 833642662 833254099 832728624 832629979 832539916 832069039 831768036 831864059 831714869 831207514 830990255
2033.4 830990255 831059933 830804884 830388486 830379248 830436230 830073893 829763770 829871774 829844058 829450965
2053.8 829450965 829290569 829462886 829346240 828946173 828872502 829008698 828803420 828533173 828685164 828826964
2074.2 828826964 828547716 828345954 828524411 828557014 828278482 828261971 828510821 828428328 828144610 828212082
2094.6 828212082 828392029 828229547 828078985 828304470 828452528 828244686 828183055 828412712 828408778 828184068
2115 828184068 828290582 828582883 828529596 828399777 828641295 828867018 828724921 828686655 829010725 829184532
2135.4 829184532 829047024 829119205 829427063 829442263 829303324 829548240 829918623 829907715 829818189 830060601
2155.8H30060601K32816m6492R7394L75688J44244j19090J70052L96609Q8334p3731
2176.2H31326425K22564K85625k4378l576K95281J69098j17480Q7976L29197O4849
2196.6H32635581j29699J40846K49743o2704j17958J95146J91688r0122l2782K02954
2217H33182693M7504j92523L3260K69770K1399j67966P3075J37210j46508j10567J92702
2239.4H33340049P4327k39194j14202J28090l7372k14219P808J35303j21057k03848
2259.8H32755685O4194Q0109j81794q4043K23279J10209j63913l4749J38700o3062
2280.2H32844615j42694J47582K02357j35183k43723K3543P9453j59859j10269J44303
2300.6H32650125M2379j88828p3731P9811r7930j80960R4414J62124j78754l49879
$$ plain form
2155.8 830060601 830293417 830246925 830344319 830720007 830864251 830745161 830915213 831311822 831400156 831326425
2176.2 831326425 831548989 831834614 831810236 831806660 832101941 832271039 832153559 832241535 832570732 832635581
2196.6 832635581 832505882 832646728 832896471 832833767 832715809 832910955 833102643 833012521 832979739 833182693
2217 833182693 833230197 833037674 833070934 833340704 833362103 833194137 833267212 833404422 833257914 833147347 833340049
2239.4 833340049 833414376 833175182 833060980 833189070 833151698 832937479 832945287 833080590 832959533 832755685
2259.8 832755685 832819879 832899988 832718194 832634151 832857430 832967639 832803726 832768977 832907677 832844615
2280.2 832844615 832701921 832849503 833051860 832916677 832672954 832696497 832775950 832616091 832505822 832650125
2300.6 832650125 832692504 832503676 832429945 832509756 832411826 832230866 832325280 832487404 832308650 831958771
2321H31958771j35362l1770j85609j38402Q5474J0430k08258r5308J21176k5511j31726
2343.5H31223905K97546O66321M10378r3401l60548m33207m67002j24157K50996J22308
2363.8H31493139j2219J90854K91706K36690L87489O31214N69880L28183L00765L76343
2384.2H34794044K06233m4883J2458J67131L1889j54734p6592L2008n8234r5546N0246
2406.7H34864020M8459j52290j66297j132m3452k07424j13786O1751p1585k68221j64211
2429.1H33785832n0366j83284k24710m2558m0113k63751k59936l0577l2306k24113
2449.5H32434118j93656m1961j27674k76267j68383n4419j94311k56122o1213j8657
2469.9H31041455k44438k91109j15097j35303k88248j97827j2815j31309l30806k09987
$$ plain form
2321 831958771 831823409 831791639 831606030 831467628 831553102 831563532 831355274 831259966 831381142 831355631 831223905
2343.5 831223905 831521451 832187772 832598150 832504749 832144201 831710994 831243992 831119835 831370831 831493139
2363.8 831493139 831480920 831671774 831963480 832200170 832587659 833218873 833788753 834116936 834417701 834794044
2384.2 834794044 835000277 834955394 834967852 835134983 835166872 835012138 834935546 834967554 834909320 834813774 834864020
2406.7 834864020 834912479 834760189 834593892 834592760 834549308 834341884 834228098 834289849 834218264 833950043 833785832
2429.1 833785832 833735466 833552182 833327472 833284914 833244801 832981050 832721114 832690537 832658231 832434118
2449.5 832434118 832240462 832198501 832070827 831794560 831626177 831571758 831377447 831121325 831060112 831041455
2469.9 831041455 830797017 830505908 830390811 830255508 829967260 829769433 829756618 829625309 829294503 829084516
2490.3H29084516o7831k01582k63095p6056l7491k56062k96175j01030r2328k35796
2510.7H27457070j74105n8234j94251l47078k24411r0301j93894k65658j20998r2566
2531.1H25695574k69770k68817j19567j60516k74360j52886o616j53780l14951j98364
2551.5H23775947j19924k92182l18766r3758r9361l60966l82125j89245k03311l52264
2571.9H21364045k89678j53184k97130m61995l26574k45154m13954m49062k57134k62856
2592.3H18207324n08249n32031l30687l52204n09083m07815k57909m16398n93543m59433
2612.7H13839972l50475n03898n25236l06189l04103n30899n20646l31402l86000n30481
2633.1H09550643l78907k31445m45723o25491m40955k92302m46438m95077l20851l63887
$$ plain form
2490.3 829084516 829016685 828815103 828552008 828475952 828438461 828182399 827886224 827785194 827692866 827457070
2510.7 827457070 827282965 827224731 827030480 826683402 826458991 826368690 826174796 825909138 825788140 825695574
2531.1 825695574 825425804 825156987 825037420 824876904 824602544 824449658 824443042 824289262 823974311 823775947
2551.5 823775947 823656023 823363841 823045075 822951317 822851956 822490990 822108865 821919620 821716309 821364045
2571.9 821364045 821074367 820921183 820624053 820162058 819835484 819590330 819176376 818727314 818470180 818207324
2592.3 818207324 817699075 817167044 816836357 816484153 815975070 815567255 815309346 814892948 814299405 813839972
2612.7 813839972 813489497 812985599 812460363 812154174 811850071 811319172 810798526 810467124 810081124 809550643
2633.1 809550643 809171736 808940291 808494568 807869077 807428122 807135820 806689382 806194305 805873454 805509567
2653.5H05509567n88536n43356l27527l47257m91619m22716l01600m10974m98354l22819
2673.9H01254809j99080l57270m37319k76148k71082m32015l61681k07186l37660m79221
2694.3G97896147l32117k54274m71890n87105m39406m27663o17027o24061m70162n61654
2714.6G93110788p87974o88552m58837n47171o85930n33938m09186n08249m63247j92762
2735G87834942j48594l74794l69489j60992k55585n22673m88699l58343m93347o05524
2755.4G84056902m64439m31300o71744p55310n56171n34117p29203p08580n65768p50720
2775.8G77889550j027346r51171q13126r52244j055122q77618q44062j121521j217186
2794.2G69030154j059830j106024j327753j326978j229287j403451j661122j658380
$$ plain form
2653.5 805509567 804921031 804377675 804050148 803702891 803211272 802788556 802486956 802075982 801577628 801254809
2673.9 801254809 801055729 800698459 800261140 799984992 799713910 799281895 798920214 798713028 798375368 797896147
2694.3 797896147 797564030 797309756 796837866 796250761 795811355 795383692 794766665 794142604 793672442 793110788
2714.6 793110788 792322814 791634262 791175425 790628254 789942324 789408386 788999200 788490951 788027704 787834942
2735 787834942 787686348 787311554 786942065 786781073 786525488 786002815 785514116 785155773 784662426 784056902
2755.4 784056902 783592463 783161163 782489419 781734109 781177938 780643821 779914618 779206038 778640270 777889550
2775.8 777889550 776862204 775911033 775097907 774145663 773090541 772212923 771368861 770247340 769030154
2794.2 769030154 767970324 766864300 765536547 764209569 762980282 761576831 759915709 758257329
2810.5G58257329j654207j908958k099037k101720k311766k780378l136277l449321
2826.8G38815665m124224n128324o195247p579923r665370j2246609j4881372j7517805
2843.1F61476791k0247281k2280574k1950066j7766177r644509J26243P994533J1690080
2859.5E89399040J1349022Q546114M856110J617074K98619J578391M035532N437493
2875.8F27117395M973650L102780N20825k087355m177451n661964o765068p445633
2892.1F09577179p616460p652045p877111q114815q358180r013415j0235786j1862099
2908.4E38847268j3955534j6644180j9297749k0714432k0059168j6941041j1258214
2922.7D19976950l759653L945649J0278225J4549762J7133057J8451452J8433810J7022132
$$ plain form
2810.5 758257329 756603122 754694164 752595127 750493407 748181641 745401263 742264986 738815665
2826.8 738815665 734691441 729563117 723367870 715787947 706122577 693875968 678994596 661476791
2843.1 661476791 641229510 618948936 596998870 579232693 569588184 569714427 577708960 589399040
2859.5 589399040 600748062 609294176 614150286 615767360 616065979 617644370 621679902 627117395
2875.8 627117395 632091045 635193825 635714650 633627295 629449844 623787880 617022812 609577179
2892.1 609577179 601960719 594308674 586431563 578316748 569958568 560945153 550709367 538847268
2908.4 538847268 524891734 508247554 488949805 468235373 448176205 431235164 419976950
2922.7 419976950 416217297 420162946 430441171 444990933 462123990 480575442 499009252 516031384
2939E16031384J4304996J0393083N733669J220763k198995l777742l136098m81904
2955.3E38089156L226340O795943R778678J2283683J4122546J4920234J4669538J3648570
2971.6F27534688J2067914J0194718Q527458P202208N910397M742741L964126L367007
2987.9F83511257K726793K109647J577854J103819O00397K07067Q7559j1265j43468
3006.3F91769660O437L19123L18766P1346J371K1637j42872k93971k97904l85642n10037
3028.7F90877914m77731m11033n97537r27210q96334o73056q13246j099944j089752
3047.1F83892071r28938r64165j099110j058816j003147j061260r52542p34687p31885
3065.5F75357521q70526q94785p89821p62165p18653n37038n93126q67665r08315q09431
$$ plain form
2939 516031384 530336380 540729463 546463132 547683895 545484900 541707158 538571060 538089156
2955.3 538089156 541315496 548111439 557890117 570173800 584296346 599216580 613886118 627534688
2971.6 627534688 639602602 649797320 658324778 665526986 671437383 676180124 680144250 683511257
2987.9 683511257 686238050 688347697 689925551 691029370 691629767 691836834 691924393 691913128 691769660
3006.3 691769660 691776097 692095220 692413986 692485332 692486703 692508340 692365468 692071497 691773593 691387951 690877914
3028.7 690877914 690400183 689989150 689391613 688464403 687568069 686895013 686081767 684981823 683892071
3047.1 683892071 682963133 681998968 680899858 679841042 678837895 677776635 676824093 676089406 675357521
3065.5 675357521 674486995 673592210 672802389 672040224 671321571 670784533 670191407 669323742 668415427 667605996
3085.8F67605996q44538r61125j002490r51827r74417j039386r95636r90986j118601
3104.2F58726990j118839r83834j108706j318931j166523r68695j140654j495540j633465
3122.6F47791803j507938j414955j428783j441240j498699j577914j495063j348496
3138.9F36078715j498222j774251j744390j553059j502931j575351j664578j768768
3155.2F22997165j878381j869023j717091j674652j818955j848220j720965j737833
3171.5F08732045j868248j871467j829326j855910j857698j754224j679242j771211
3187.8E94244719j857460j793087j748859j834035j859784j768470j760125j810968
3204.1E79811931j725078j646221j740038j813710j743614j667738j728476j744687
$$ plain form
3085.8 667605996 666761458 665800333 664797843 663846016 662871599 661832213 660836577 659845591 658726990
3104.2 658726990 657608151 656624317 655515611 654196680 653030157 652061462 650920808 649425268 647791803
3122.6 647791803 646283865 644868910 643440127 641998887 640500188 638922274 637427211 636078715
3138.9 636078715 634580493 632806242 631061852 629508793 628005862 626430511 624765933 622997165
3155.2 622997165 621118784 619249761 617532670 615858018 614039063 612190843 610469878 608732045
3171.5 608732045 606863797 604992330 603163004 601307094 599449396 597695172 596015930 594244719
3187.8 594244719 592387259 590594172 588845313 587011278 585151494 583383024 581622899 579811931
3204.1 579811931 578086853 576440632 574700594 572886884 571143270 569475532 567747056 566002369
3220.5E66002369j594186j578271j746059j761436j583159j509547j632095j680374
3236.8E52917242j606762j630962j624346j425386j311004j458227j544595j418412
3253.1E40897548j350462j409173j401305j299680j266896j301170j254856j173974
3269.4E30440032j260638j392901j348555j302779j340389j310527j246810j282692
3285.7E19954741j303613j167178j121223j305521j444101j416147j367629j343011
3302E09486318j245320j229167j506627j802802j812339j653433j595050j648157j631469
3320.4D95361954j576722j649230j826913j874059j803845j840711j836330j691520
3336.7D81262624j724392j961887k043396j986355j979291j923472j914739k097786
$$ plain form
3220.5 566002369 564408183 562829912 561083853 559322417 557739258 556229711 554597616 552917242
3236.8 552917242 551310480 549679518 548055172 546629786 545318782 543860555 542315960 540897548
3253.1 540897548 539547086 538137913 536736608 535436928 534170032 532868862 531614006 530440032
3269.4 530440032 529179394 527786493 526437938 525135159 523794770 522484243 521237433 519954741
3285.7 519954741 518651128 517483950 516362727 515057206 513613105 512196958 510829329 509486318
3302 509486318 508240998 507011831 505505204 503702402 501890063 500236630 498641580 496993423 495361954
3320.4 495361954 493785232 492136002 490309089 488435030 486631185 484790474 482954144 481262624
3336.7 481262624 479538232 477576345 475532949 473546594 471567303 469643831 467729092 465631306
3353D65631306k242535k168447k003342j974940k056718j989394j836151j917541k169252
3371.4D47272986k164125j908034j782686j724481j587332j487434j419276j204073
3387.7D33995545q98510r29594j231701j192450p74622n43207p87407j047552q65042
3406.1D25725460n59568m31300l98159m18961m08351k80738j62721j08599L9011K86251
3426.5D23282325M80235M78983M84347O59943O47932M20094M51773Q00818J056910
3444.8D28763360J072824J111716J255959J309037J328737J469731J601219J512856
3461.1D39425439J495272J812249K008140J740694J366854J374692J633763J892239
3477.4D52749342J963675J748889J683474J852870J864582J820147J901627J999497
$$ plain form
3353 465631306 463388771 461220324 459216982 457242042 455185324 453195930 451359779 449442238 447272986
3371.4 447272986 445108861 443200827 441418141 439693660 438106328 436618894 435199618 433995545
3387.7 433995545 433097035 432167441 430935740 429743290 428968668 428425461 427638054 426590502 425725460
3406.1 425725460 425165892 424734592 424336433 423917472 423509121 423228383 423065662 422957063 422996074 423282325
3426.5 423282325 423762560 424241543 424725890 425385833 426033765 426453859 426905632 427706450 428763360
3444.8 428763360 429836184 430947900 432203859 433512896 434841633 436311364 437912583 439425439
3461.1 439425439 440920711 442732960 444741100 446481794 447848648 449223340 450857103 452749342
3477.4 452749342 454713017 456461906 458145380 459998250 461862832 463682979 465584606 467584103
3493.8D67584103K091408K129704K136648K079784J937032J893431J961023K117932
3510.1D83931065K363205K384334K199531K244145K455860K568662K453834K245188
3526.4E02845824K232194K422392K667606K837062K772987K646625K827227L039837
3542.7E24291754K856374K513647K599775K839148K810956K833008L000617L113926
3559E46859205L154576L151357K952873K848387L277481L643155L579378L500760L584087
3577.4E76551259L807008M090488M218101L854096L301501L661812M205465M095435
3593.7F07785165M045606M271865M287183M273176M433811M250944L989100M266918
3610F41603768M538357M552424M489601M163801M132092M499495M689336M308522L486872
$$ plain form
3493.8 467584103 469675511 471805215 473941863 476021647 477958679 479852110 481813133 483931065
3510.1 483931065 486294270 488678604 490878135 493122280 495578140 498146802 500600636 502845824
3526.4 502845824 505078018 507500410 510168016 513005078 515778065 518424690 521251917 524291754
3542.7 524291754 527148128 529661775 532261550 535100698 537911654 540744662 543745279 546859205
3559 546859205 550013781 553165138 556118011 558966398 562243879 565887034 569466412 572967172 576551259
3577.4 576551259 580358267 584448755 588666856 592520952 595822453 599484265 603689730 607785165
3593.7 607785165 611830771 616102636 620389819 624662995 629096806 633347750 637336850 641603768
3610 641603768 646142125 650694549 655184150 659347951 663480043 667979538 672668874 676977396 680464268
3628.4F80464268L780722M443527M274070M048645L982604L968298M050911M062652
3644.7G13075697L604770K910972L057360L571511L281533L002644L271997L152967
3661G38929451K780079K785564K642810J990795K102495K405643J597404J578451K192259
3679.4G59004951K179920K252996K299667J807332J173079J243353J559317J585185
3695.7G73105800J444280J124859P93159R75311J275957J089453N02408J30474P04170
3714G81145871J120209Q81136O00576M77910L70801L54945P28488Q86262M77254J3590
3734.4G87057042O5386P40767J175940L95894n65648L10838O46115l13581r8168P63952
3754.8G90178537P29502K29537J82390M27842M05610K81513J192m2558L67940N13374
$$ plain form
3628.4 680464268 684244990 688688517 692962587 697011232 700993836 704962134 709013045 713075697
3644.7 713075697 716680467 719591439 722648799 726220310 729501843 732504487 735776484 738929451
3661 738929451 741709530 744495094 747137904 749128699 751231194 753636837 755234241 756812692 759004951
3679.4 759004951 761184871 763437867 765737534 767544866 768717945 769961298 771520615 773105800
3695.7 773105800 774550080 775674939 776468098 777443409 778719366 779808819 780311227 780441701 781145871
3714 781145871 782266080 783147216 783747792 784225702 784596503 784951448 785679936 786566198 787043452 787057042
3734.4 787057042 787122428 787863195 789039135 789435029 788869381 789180219 789826334 789512753 789414585 790178537
3754.8 790178537 790908039 791137576 791319966 791747808 792153418 792434931 792436123 792393565 792761505 793274879
3775.2G93274879K54572k7299N1200J47581P9751J80185K55764K51651K57373J77204
3795.6G94902861K05755j10864m80950J84178J87695l12805K36392P01666K38657l17991
3816G95434594P4864m8280m83692J28329L88861K42233J24812Q2612K57015n7041n79119
3838.4G95565188k22564J85013J70410K82406M92991J42097j180887j159072N50568
3856.8G94826150Q14080K32399j33157q166J81139k72572m26233k1220Q2672J37150
3877.2G95412242p7784j11639J50978q0466j9669R0956k90811q3148L69787R8407l22759
3899.6G95136094l42727k99155j41204J39058J56224Q1122K5391j49846j97828j7464
3920G94389665P570j47224q7440N2810n7936j39296o258N1319N8353N5254r2208j11282
$$ plain form
3775.2 793274879 793529451 793502152 793553352 793700933 793780684 793960869 794216633 794468284 794725657 794902861
3795.6 794902861 795108616 794997752 794516802 794700980 794888675 794575870 794812262 795513928 795752585 795434594
3816 795434594 795509458 795461178 794977486 795105815 795494676 795736909 795861721 795944333 796201348 796144307 795565188
3838.4 795565188 795342624 795527637 795698047 795980453 796473444 796615541 795434654 794275582 794826150
3856.8 794826150 795640230 795872629 795739472 795731306 795912445 795639873 795213640 795192420 795275092 795412242
3877.2 795412242 795334458 795222819 795373797 795293331 795273662 795364618 795073807 794990659 795360446 795458853 795136094
3899.6 795136094 794793367 794494212 794353008 794492066 794648290 794729412 794754803 794604957 794407129 794389665
3920 794389665 794397235 794250011 794162571 794215381 794157445 794018149 794011891 794063210 794121563 794176817 794084609 793973327
3944.5G93973327L338M76l9517k2054O139m2975q7917k0265N1915O318l9756M5002
3969G93834031J30713O7055j9431P629K4557N603K5988N781r0718j20640j5259J01328
3993.4G93956637J21892N0545
3997.5G94129074
$$ plain form
3944.5 793973327 793976665 793977141 793937624 793915570 793921709 793878734 793790817 793770552 793822467 793828785 793789029 793834031
3969 793834031 793964744 794031799 794012368 794019997 794044554 794050157 794076145 794081926 793991208 793870568 793855309 793956637
3993.4 793956637 794078529 794129074
3997.5 794129074
##END=$$ End of the data block
