##TITLE=$$ Begin of the data block
##JCAMP-DX=5.00 $$ ACD/SpecManager v 10.08
##SPECTROMETER/DATA SYSTEM=Alpha
##DATE=14 Apr 2014 11:23:48
##DATA TYPE=INFRARED SPECTRUM
##DATA CLASS=XYDATA
##ORIGIN=
##OWNER=
##NPOINTS=1765
##FIRSTX=399.75695801
##LASTX=3997.56933594
##MAXX=3997.56933594
##MINX=399.75695801
##MAXY=0.86970150
##MINY=0.34688115
##XFACTOR=1.0000000000
##YFACTOR=1.000000000000000e-9
##FIRSTY=0.68841672
##DELTAX=2.03957629
##XUNITS=1/CM
##YUNITS=ARBITRARY UNITS
##XYDATA=(X++(Y..Y))
399.8F88416719j977205j933634o86288n77152j655340j175106K57552M34876m16875
418.1F80687547q17657n90861r22501j262784p02142k1875l76582j058877p22587j48058
438.5F74063623n86450p78318K73288N00679o58393p65920K85268J94967r66549r31144
458.9F70631051J13308j90436j124263p81119k99692j094878j478076l71337k801j186371
479.3F64215386j406193N4598K63870j023889q52108L36409k74003j693487j091838
497.7F58528745P0989o99222j699686q05318o020j093567j655757l45767j01208j746238
518.1F50446951k021193n56409o11604k164602j710475q344o18100j982272j085281
536.4F39688671j0372j052975j738072l26037L80158j090407j764059n26130l09587
$$ plain form
399.8 688416719 686439514 684505880 683819592 683242440 681587100 680411994 680669546 681104422 680687547
418.1 680687547 679869890 679279029 678356528 677093744 676391602 676369727 675993145 674934268 674211681 674063623
438.5 674063623 673477173 672698855 672972143 673472822 672814429 672048509 672333777 672528744 671562195 670631051
458.9 670631051 670744359 670553923 669429660 668648541 668348849 667253971 665775895 665404558 665401757 664215386
479.3 664215386 662809193 662863791 663127661 662103772 661251664 661588073 661314070 659620583 658528745
497.7 658528745 658599734 657900512 656200826 655395508 655389488 654295921 652640164 652294397 652193189 650446951
518.1 650446951 648425758 647869349 647257745 645093143 643382668 643374324 642756224 640773952 639688671
536.4 639688671 639678299 638625324 636887252 636561215 636941373 635850966 634086907 633560777 633251190
554.8F33251190j779973j979590p19785r73464k357602k197206j364886k117038k981007
573.1F16780639j978934r96173j772046k363324j444876j035094j970709k275765j418650
591.5F01525068j234591k019584j964509j117051j378179k356529j767158j42992J15752
609.8E89660227o67572m20272P69555J818121K757609L810942M391730L798723L150344
628.2F09069407L495038L707647K972424K417028K565563K133965O80387K84910K052844
646.5F29379213L324926K092242Q0109m43459J181185L886640N534292N378008L870725
664.9F54283881K532661L138304L722668K990543K299011K411962K917945K479375
681.2F76776350J650512J803517K277970J678944P97033J091242J649440R44852J48476
$$ plain form
554.8 633251190 631471217 629491627 628771842 627798378 625440776 623243570 621878684 619761646 616780639
573.1 616780639 614801705 613805532 612033486 609670162 608225286 607190192 605219483 602943718 601525068
591.5 601525068 600290477 598270893 596306384 595189333 593811154 591454625 589687467 589544475 589660227
609.8 589660227 588992655 588572383 589341938 591160059 593917668 597728610 602120340 605919063 609069407
628.2 609069407 612564445 616272092 619244516 621661544 624227107 626361072 627041459 627326369 629379213
646.5 629379213 632704139 634796381 634876490 634433031 635614216 639500856 645035148 650413156 654283881
664.9 654283881 656816542 659954846 663677514 666668057 668967068 671379030 674296975 676776350
681.2 676776350 678426862 680230379 682508349 684187293 684984326 686075568 687725008 688669860 688818336
699.6F88818336Q39054J677990J097739O99758J756132K310514J318813P71761J620888
717.9G00910985J983345J282036J504779K728164K623618J349926J432300K505898
734.2G16321051J962364M54426Q28147K092659J551032N39422J364231K345085J457870
752.6G28916287O52790J700700K325535J041591M18961J646340K029419N78761R9420
771G39409804J204908R73523p46966j001358k6106m67718j532853p01427J062274J284599
791.4G39458680J144409K801657M470646M081846L514051M401267M688561L149151
807.7G67710268K094746K633155K455949P97510L756M53114k82109k218961k911330
826G70736098k521693l149510m281521l919601k828419k979517l566206k907753j894772
$$ plain form
699.6 688818336 689657390 691335380 692433119 693132877 694889009 697199523 698518336 699290097 700910985
717.9 700910985 702894330 704176366 705681145 708409309 711032927 712382853 713815153 716321051
734.2 716321051 718283415 718737841 719565988 721658647 723209679 723749101 725113332 727458417 728916287
752.6 728916287 729569077 731269777 733595312 734636903 735055864 736702204 738731623 739310384 739409804
771 739409804 740614712 741588235 740841269 739839911 739813805 739346087 737813234 737111807 738174081 739458680
791.4 739458680 740603089 743404746 747875392 751957238 755471289 759872556 764561117 767710268
807.7 767710268 769805014 772438169 774894118 775691628 775695384 776148498 775866389 773647428 770736098
826 770736098 768214405 765064895 760783374 756863773 754035354 751055837 747489631 744581878 742687106
844.4G42687106j783669j440823M13358K627373L772497M711390O219148P063687O642461
862.7G70912528O257653O459594O042540M617989L526271L307044K742827J368463
879.1H05234909L22700R417n65827j595556j986802j547754j226187j164615n79059
897.4G96901226N06103J055718Q96930R15945J124322N95570n75185j287580j563549
915.8G98569500k333343l278434l232241k377092j806498j338541k29717P68483O37591
934.1G85379708K04146N46932Q85010K94387l68953k48313l37541j502573k613127
952.5G82239676k836228l436983n125880o537497p164061q352876j0315954j1555374
968.8G26914823j1702716j1795640j1710346j0451555q634746p638157p132411o169975
$$ plain form
844.4 742687106 740903437 739462614 739875972 742503345 746275842 750987232 757206380 764270067 770912528
862.7 770912528 777170181 783629775 789672315 794290304 797816575 801123619 803866446 805234909
879.1 805234909 805557609 805567026 805001199 803405643 801418841 799871087 798644900 797480285 796901226
897.4 796901226 797407329 798463047 799359977 800275922 801400244 801995814 801420629 800133049 798569500
915.8 798569500 796236157 792957723 789725482 787348390 785541892 784203351 783973634 784742117 785379708
934.1 785379708 785583854 786130786 787015796 787310183 786941230 786692917 786355376 784852803 782239676
952.5 782239676 779403448 775966465 770840585 764303088 757139027 748786151 738470197 726914823
968.8 726914823 715212107 703416467 691706121 681254566 672619820 664981663 657849252 651679277
985.1F51679277n230784m993021m783810l873288k928913k727687k619684j957834
1001.4F22564256j596629k243996l103018l521562m054546m928052n357087n059898
1017.7E92699468m777789m748285m378855l709674l455281l568232l327430k762913
1034.1E61971009k521754k487719k059042j534879j582206j961350k041817j908898
1050.4E45873344j819372j367986k96057Q29637J358271J341820R38833q6904j659751
1068.7E45111835l024817l606438l645778l496945l167927k783954k758861l222942
1085E19404173l810406m184484m217208l673136k412021q07822N53846J408637J837671
1103.4E04099250J911819J666665J127779L67880n53667j819492l570258n408764o096631
$$ plain form
985.1 651679277 646448493 641455472 636671662 632798374 629869461 627141774 624522090 622564256
1001.4 622564256 620967627 618723631 615620613 612099051 608044505 603116453 597759366 592699468
1017.7 592699468 587921679 583173394 578794539 575084865 571629584 568061352 564733922 561971009
1034.1 561971009 559449255 556961536 554902494 553367615 551785409 549824059 547782242 545873344
1050.4 545873344 544053972 542685986 542389929 543219566 544577837 545919657 546858490 546771586 545111835
1068.7 545111835 542087018 538480580 534834802 531337857 528169930 525385976 522627115 519404173
1085 519404173 515593767 511409283 507192075 503518939 501106918 500299096 500852942 502261579 504099250
1103.4 504099250 506011069 507677734 508805513 509173393 508619726 506800234 503229976 497821212 491724581
1121.8D91724581m410595j294047R44168J676946J204849J58280K16573J755834L252298
1140.1D95228887L743857L527075L074407K507627J953483J765251K039373K445936
1156.4E16285896K908707L776431N069912O283342P191003P999778Q577823Q535862
1172.7E66628754Q065641P658005P250488O492734N473136M444123L158569J377463
1189.1F10548913l31223j257240j481533j265526l69370J153111K372325K676725K555192
1207.4F14601374K389431J862466J036048N81801O10947N71907M09305N66840R93491
1225.8F23623610J253664J410365J814962K249896K298415K220034K384723K447545
1242.1F39703214K067506J602173J349449R99451M34101J26302K58625M41432O07669
$$ plain form
1121.8 491724581 487313986 486019939 486964107 488641053 489845902 490004182 490220755 491976589 495228887
1140.1 495228887 498972744 502499819 505574226 508081853 510035336 511800587 513839960 516285896
1156.4 516285896 519194603 522971034 528040946 534324288 541515291 549515069 558092892 566628754
1172.7 566628754 574694395 582352400 589602888 596095622 601568758 606012881 609171450 610548913
1189.1 610548913 610217690 608960450 607478917 606213391 605844021 606997132 609369457 612046182 614601374
1207.4 614601374 616990805 618853271 619889319 620471120 621082067 621653974 622063279 622630119 623623610
1225.8 623623610 624877274 626287639 628102601 630352497 632650912 634870946 637255669 639703214
1242.1 639703214 641770720 643372893 644722342 645721793 646155894 646282196 646540821 646982253 647589922
1260.4F47589922J105428J832664K365112K710462L193438L777861M140556M313409
1276.8F71028852M556835M803360M859209M901349N138040N313396N183399M963577
1293.1G10748017M776537M432082L971875L639817L369391K994717K623140K374769
1309.4G38930345K155363J844645J542926J401841J303852J187742J198828J219749
1325.7G50785291J012683P15494N40912L30389L5644r6202%J19269J79946L09467M04418
1348.1G54337311K40385K39l9041j32084n77986j202107j781166k034842j864732j637041
1368.5G45308936j637578k199471k966702k475262r10282j48654l66688R2745J122475
1386.9G35819519J001060J48892k10285m03762r56655j628458j758397j693845k130925
$$ plain form
1260.4 647589922 648695350 650528014 652893126 655603588 658797026 662574887 666715443 671028852
1276.8 671028852 675585687 680389047 685248256 690149605 695287645 700601041 705784440 710748017
1293.1 710748017 715524554 719956636 723928511 727568328 730937719 733932436 736555576 738930345
1309.4 738930345 741085708 742930353 744473279 745875120 747178972 748366714 749565542 750785291
1325.7 750785291 751797974 752513468 753054380 753384769 753420413 753324211 753324211 753443480 753623426 753932893 754337311
1348.1 754337311 754577696 754577935 754538894 754406810 753828824 752626717 750845551 748810709 746945977 745308936
1368.5 745308936 743671358 741471887 738505185 736029923 735119641 734970987 734604299 734697044 735819519
1386.9 735819519 736820579 736969471 736759186 736355424 735398769 733770311 732011914 730318069 728187144
1405.3G28187144k383828k036035j808167j873016j642466j216233j233577j296640
1421.6G14697182r95159o78241p00593j135528j160384o77466p18415j027047n86391
1439.9G07017958j18315k30193l44992M768L84391L24607N90503K126753L877580L768504
1460.3G17401564L845692N124986O489158P634043R736896J1917651J0235905O809473
1476.6G79195368N348921M876971L940940K541125J730442J273453L35992m11868n02825
1495G98328519p61271j492142j803875j425505j569629l152966l500641k676129k395451
1513.4G79550910k374053k144396j610637j662076k009749j867294j669467j431048
1529.7G64782190j433372j615107j121819o33538j134217j486063r37342o37353l87549
$$ plain form
1405.3 728187144 725803316 723767281 721959114 720086098 718443632 717227399 715993822 714697182
1421.6 714697182 713702023 713023782 712323189 711187661 710027277 709349811 708631396 707604349 707017958
1439.9 707017958 706899643 706669450 706324458 706329226 706713617 707038224 707628727 709755480 713633060 717401564
1460.3 717401564 721247256 726372242 732861400 740495443 750232339 762149990 772385895 779195368
1476.6 779195368 784544289 789421260 793362200 795903325 797633767 798907220 799243212 798831344 798328519
1495 798328519 797567248 796075106 794271231 792845726 791276097 788123131 784622490 781946361 779550910
1513.4 779550910 777176857 775032461 773421824 771759748 769749999 767882705 766213238 764782190
1529.7 764782190 763348818 761733711 760611892 759978354 758844137 757358074 756420732 755783379 755395830
1548G55395830l8743K63869L80874M31478J26302q49545j119375j236617j525164k106845
1568.4G49722064l095329l277481l589749n133093n539178n213798n618929o031514
1584.7G12222993o434738o808579o996393p086039p368982p536888p398903p297695
1601.1F55294776p319748p209003p050813p133782p086396o613135o763637p458627
1617.4E98659635o142378n014897n245745m901647m248083l612578k410769j456559
1633.7E65626979j097381j93238J067698K048015K823055L989935M913807M527867
1650E83706737N399882P310152O154299N511046O186068P079363P351040O700695P034063
1668.4F42433345P818282P251739P195116P519006P048071O892383P468462Q558214
$$ plain form
1548 755395830 755357087 755620956 756001830 756433308 756559610 755710065 754590690 753354073 751828909 749722064
1568.4 749722064 746626735 743349254 739759505 734626412 729087234 723873436 718254507 712222993
1584.7 712222993 705788255 698979676 691983283 684897244 677528262 669991374 662592471 655294776
1601.1 655294776 647975028 640766025 633715212 626581430 619495034 612881899 606118262 598659635
1617.4 598659635 592517257 587502360 582256615 577354968 573106885 569494307 567083538 565626979
1633.7 565626979 564529598 564336360 565404058 567452073 570275128 574265063 579178870 583706737
1650 583706737 589106619 596416771 602571070 608082116 614268184 621347547 628698587 635399282 642433345
1668.4 642433345 650251627 657503366 664698482 672217488 679265559 686157942 693626404 702184618
1684.7G02184618P674038O595731O565392O109893O657839P282019O915271P193267
1701G57178068O183863N162358M706264M027426L881454L779650L498376L536820L256142
1719.3G95210421K468526K011002K098679K352476K429366K363801K819240L019810
1735.7H14773321K527714K602518K998173L162980L003597K823413K873182K696276
1752H37461174K061247J752138J809538J670003J327336J134038J282155J322091J041412
1770.3H50861132Q17359Q29339P63654O55413P29561Q45730P22826N69641O92487Q35657
1790.7H58322799O70970M35352N51581O68288N00977L26514L93569M81129L95000L06070
1811.1H63052249L55959M10259L03983K36631L28719L66211K57373K07305K38061K24114
$$ plain form
1684.7 702184618 709858656 716454387 723019779 729129672 735787511 743069530 749984801 757178068
1701 757178068 763361931 768524289 773230553 777257979 781139433 784919083 788417459 791954279 795210421
1719.3 795210421 797678947 799689949 801788628 804141104 806570470 808934271 811753511 814773321
1735.7 814773321 817301035 819903553 822901726 826064706 829068303 831891716 834764898 837461174
1752 837461174 839522421 841274559 843084097 844754100 846081436 847215474 848497629 849819720 850861132
1770.3 850861132 851678491 852507830 853271484 853926897 854656458 855502188 856225014 856794655 857487142 858322799
1790.7 858322799 858993769 859429121 859980702 860648990 861149967 861476481 861870050 862351179 862746179 863052249
1811.1 863052249 863408208 863818467 864122450 864359081 864687800 865054011 865311384 865518689 865756750 865980864
1831.5H65980864J88708J48535J70171K58148K97784J98484J24216J66893J55866J11044
1851.9H67800713J37686J78397J21474P0393J43648K43663J95146K8133j5795Q9288
1872.3H68992746P7784k265P6532J66655N8055n0068P0035J53721p034r3460N8532
1894.7H69501233J27852n4121j31249N6505J36077k9385q0347Q1301R3639j03414j39356
1917.2H69458735M9353K9087j89722j28746J04845L4153j74343r6202O9379n5074k21133
1939.6H68880332p0096P9096j44422l39270j35660L5524j49667k47478m8042p75k53260
1962.1H67606282l01242k9087J9372k55168k90870k5690j3292k58803k52426j7285
1982.5H66181791j8537k17617j72674K4437r5307l45290k33769N960p4744k81096j92284
$$ plain form
1831.5 865980864 866169572 866318107 866488278 866746426 867044210 867242694 867366910 867533803 867689669 867800713
1851.9 867800713 867938399 868116796 868238270 868308663 868452311 868695974 868891120 868919253 868903458 868992746
1872.3 868992746 869070530 869068265 869144797 869311452 869369507 869319439 869389474 869543195 869536161 869442701 869501233
1894.7 869501233 869629085 869574964 869443715 869500220 869636297 869606912 869526565 869607866 869701505 869598091 869458735
1917.2 869458735 869508088 869537175 869347453 869218707 869323552 869357705 869183362 869087160 869156539 869101465 868880332
1939.6 868880332 868810236 868889332 868744910 868405640 868269980 868305504 868155837 867908359 867860317 867859542 867606282
1962.1 867606282 867305040 867275953 867295325 867040157 866749287 866723597 866710305 866451502 866199076 866181791
1982.5 866181791 866163254 865945637 865772963 865797400 865702093 865356803 865123034 865128994 865054250 864773154 864580870
2004.9H64580870k4081j58369l31819j88887k4855j90855l44693j50204K802k05279
2025.3H62964630l33428j06633L5882j58071k99275j27256j2279j90139k55704l9279
2045.7H61478448K205j90198j91808J5676L0875j93655k31147r298K0802j79172j41203
2068.1H60411525P5698K6226j87576j23382J05560N1618j48714o4552J30058k563k28227
2090.5H60045671p8499J70887K5689j74820J1265J96040K742j79053K1041J87039o56
2113H60227346j15931Q0467J67548o3359j33455J63615K54571l6120j12832J41203
2133.4H60573053J70648p5578n5969K06590J74880p5996j6213K31088J56819o8903
2153.8H61220419L4810K46286R5904j21296O3539K82586R3817r3519J16467L03566
$$ plain form
2004.9 864580870 864556789 864398420 864066601 863877714 863852859 863662004 863317311 863167107 863169909 862964630
2025.3 862964630 862631202 862524569 862560451 862402380 862103105 861975849 861963570 861773431 861517727 861478448
2045.7 861478448 861480653 861290455 861098647 861114323 861145198 860951543 860720396 860711098 860731900 860552728 860411525
2068.1 860411525 860487223 860513449 860325873 860202491 860308051 860359669 860210955 860146403 860276461 860273898 860045671
2090.5 860045671 859967172 860138059 860163748 859988928 860000193 860196233 860198975 860019922 860040963 860228002 860227346
2113 860227346 860111415 860191882 860359430 860296071 860162616 860326231 860580802 860544682 860431850 860573053
2133.4 860573053 860743701 860668123 860612154 860818744 860993624 860917628 860901415 861132503 861289322 861220419
2153.8 861220419 861255229 861501515 861597419 861476123 861539662 861822248 861916065 861822546 861939013 862242579
2174.2H62242579R8825p8619J04130K28226L0339p3076J35422K12729k9802q9348J73510
2196.6H62954915K12192n5909r1612J31249J32740q0288n7936J55092J04844r0122
2217H63315165k5034J33753L4869j30117j5080J42038J7404j30951j2219J12176m471
2239.4H63437533j04069j0491M9949m2856j07646l7789N007p9394j03712p689Q35q2493
2263.9H62917185m3690R6321J18851J6213l9518J7643P3433L8266j2219%J6987l6239
2288.4H63163233r8169n5969N424o1273j40012j08599m4883o1690j59562j95146j24931
2310.8H62118423r1791j30356j54793k01881k93612k78771j34468q2672j52886j81257
2331.2H60415936r6977m0174j17242q9526R6082K02656L75331N62012L21746k93613
$$ plain form
2174.2 862242579 862341404 862262785 862366915 862595141 862625480 862552404 862687826 862900555 862870753 862781405 862954915
2196.6 862954915 863167107 863111198 863019586 863150835 863283575 863203287 863145351 863300443 863405287 863315165
2217 863315165 863290131 863423884 863458753 863328636 863313556 863455594 863472998 863342047 863329828 863442004 863437533
2239.4 863437533 863333464 863322973 863372922 863330066 863222420 863184631 863189638 863110244 863006532 862998843 862999678 862917185
2263.9 862917185 862873495 862969816 863088667 863104880 863065362 863083005 863156438 863194704 863182485 863182485 863199472 863163233
2288.4 863163233 863065064 863009095 863014519 862953246 862813234 862704635 862659752 862598062 862438500 862243354 862118423
2310.8 862118423 862026632 861896276 861741483 861539602 861245990 860967219 860832751 860750079 860597193 860415936
2331.2 860415936 860318959 860278785 860161543 860072017 860168099 860370755 860746086 861308098 861629844 861336231
2351.6H61336231q13603p42555l88861k33590n4181L34323O38723O38008N79179P25388
2372H62019062Q19266O43909N34356O70969O85036M14550K03431K41161K14934l5823
2392.4H66410851j32858O8366J22726r0062j08779R8229Q3446r9063n3346J17183M0233
2414.8H66456926j60098p7069J14501l458j91450p4088J12533q523k05457q4162P7069
2437.3H65956724o6877j85132k1040P1466j09136k15471p0393J0192j25885j60515
2457.7H65083933m053M411j56284j62601q524j5795j80066j59144l696m7862k02119
2480.1H64148200j39475R298p6950k19345j27852L58r6858k14219j05858M292r9719
2502.5H63081872j88052q6904j9669j12593j67490q3565k9385j14560j75059j13070
$$ plain form
2351.6 861336231 860522628 859780073 859391212 859157622 859103441 859437764 860076487 860714495 861293674 862019062
2372 862019062 862838328 863482237 864016593 864687562 865372598 865787148 865990579 866231740 866446674 866410851
2392.4 866410851 866277993 866346359 866469085 866379023 866270244 866368473 866451919 866352856 866299510 866416693 866456926
2414.8 866456926 866296828 866219759 866334260 866330802 866139352 866065264 866177797 866169274 865963817 865879655 865956724
2437.3 865956724 865889847 865704715 865683675 865755141 865646005 865430534 865360141 865370333 865244448 865083933
2457.7 865083933 865079880 865084291 864928007 864765406 864756882 864741087 864561021 864401877 864398181 864350319 864148200
2480.1 864148200 864008725 864018023 863941073 863721728 863593876 863594234 863497376 863283157 863177299 863181591 863081872
2502.5 863081872 862893820 862806916 862787247 862674654 862507164 862423599 862394214 862279654 862104595 861991525
2522.9H61991525q7321j52052j54852o4612n0366j31607j42217p9572r4294j70887
2543.3H60863745j49846n6684q7500j97768j67310n8234r0360k13623k06173j06037
2563.7H59530210j15394j96874j89722j31190j75058k62499k29419j71303k22743k84910
2584.1H57551098k56300j99080k11179k56955k39194k10106k70844l50475l25084k49445
2604.5H54982436k56896k90573k44379k35617l52025m02272k89500k27928l07321l42191
2624.9H52033734k90632k92182l44217l27587k79426l16859l60369k96116k24948k82705
2645.3H49018693l63946l28183k80500l12626l50237l23057k67863k72394l22699l20256
2665.7H45876932k81513k62379k37942k16603k14696k53320l15487l32475l12984k91049
$$ plain form
2522.9 861991525 861904204 861752152 861597300 861532688 861482322 861350715 861208498 861128926 861034632 860863745
2543.3 860863745 860713899 860657215 860569715 860371947 860204637 860146403 860056043 859842420 859636247 859530210
2563.7 859530210 859414816 859217942 859028220 858897030 858721972 858459473 858230054 858058751 857836008 857551098
2584.1 857551098 857294798 857095718 856884539 856627584 856388390 856178284 855907440 855556965 855231881 854982436
2604.5 854982436 854725540 854434967 854190588 853954971 853602946 853200674 852911174 852683246 852375925 852033734
2624.9 852033734 851743102 851450920 851106703 850779116 850499690 850182831 849822462 849526346 849301398 849018693
2645.3 849018693 848654747 848326564 848046064 847733438 847383201 847060144 846792281 846519887 846197188 845876932
2665.7 845876932 845595419 845333040 845095098 844878495 844663799 844410479 844094992 843762517 843449533 843158484
2686.1H43158484k65778k25365k11298k63930l01301k75672k70128l28898l96431m05609
2706.5H40214074l89696m16100m54187m32432l94404m18484m25696l74735l56197m00305
2726.9H36151838m26113l50178k59518k45035k47002k31683k47121l03805l21447k62678
2747.3H33257258k59519m03762n05507m14788l38257m18663m68015m01676m29451n62847
2767.7H29054773n60880m43101m37319n83410o76871o38365o44625p19845p06494o46174
2788.1H22997689p01010q19087q40783p97451q65817j013040j025081r73165j023948
2806.4H14938307j075804j110495j267969j472652j534581j502872j610994j887798
2822.7H03475142k138973k353787k719343l285468l966331m816592o027162p612467
$$ plain form
2686.1 843158484 842892706 842667341 842456043 842192113 841890812 841615140 841345012 841016114 840619683 840214074
2706.5 840214074 839824378 839408278 838954091 838521659 838127255 837708771 837283075 836908340 836552143 836151838
2726.9 836151838 835725725 835375547 835116029 834870994 834623992 834392309 834145188 833841383 833519936 833257258
2747.3 833257258 832997739 832593977 832088470 831673682 831335425 830916762 830448747 830047071 829617620 829054773
2767.7 829054773 828493893 828050792 827613473 827030063 826353192 825714827 825070202 824350357 823643863 822997689
2788.1 822997689 822296679 821477592 820636809 819839358 818973541 817960501 816935420 815962255 814938307
2806.4 814938307 813862503 812752008 811484039 810011387 808476806 806973934 805362940 803475142
2822.7 803475142 801336169 798982382 796263039 792977571 789011240 784194648 778167486 770555019
2839.1G70555019r306430j0970831j2758971j4360070j4555037j2048006o745279l07739
2855.4F89502656M806519P083952O664157M693151K355456M60148l58343K17020J534701
2873.7G16959417K362668K114058J056552l07143j692593k957940l914654m551590
2890.1G09068775m982829n218446n298853n387127n583168n890250o366610p166148
2906.4F63175344q442163j0167599j2172639j4087916j5094518j4359296j1690259
2920.6E77160954p454931k340794K795100P048965R840786J1388600J2148082J2142897
2937F22729659J1231363R523511P216632M466593J623810o82235j783550j497507o2704
2955.3F52765572K077699M296422O189108P615745Q542835Q969367Q804381Q100629
$$ plain form
2839.1 770555019 761248589 750277758 737518787 723158717 708603680 696555674 689810395 689502656
2855.4 689502656 694309175 701393127 708057284 712750435 715105891 715566039 715207696 715424716 716959417
2873.7 716959417 719322085 721436143 722492695 722185552 720492959 717535019 713620365 709068775
2890.1 709068775 704085946 698867500 693568647 688181520 682598352 676708102 670341492 663175344
2906.4 663175344 654733181 644565582 632392943 618305027 603210509 588851213 577160954
2920.6 577160954 569706023 567365229 570160329 577209294 587050080 598438680 610586762 622729659
2937 622729659 633961022 643484533 650701165 655167758 656791568 656109333 654325783 652828276 652765572
2955.3 652765572 654843271 659139693 665328801 672944546 681487381 690456748 699261129 707361758
2971.6G07361758P113755O025731N030215M202604L392875K665818K187252J864135
2987.9G39844143J568020J218140P85828M29511J39713j41025l13580m17411m24683
3006.3G42688656k89202j83403k71023m87566o42776p07805p62225p81297q18670r52840
3026.7G36791849j043737j026273r92238j109004j330197j326680j185954j258254
3043G27519512j522660j666963j551807j485050j603126j617194j560866j611174j625001
3061.4G13275671j502395j375973j443267j648843j715124j587510j408398j306891
3077.7G01287270j410544j596392j680374j747369j767159j735985j829744j917302
3094F87602401j812518j703501j793801j941562j961529j890242j874328j998305k026082
$$ plain form
2971.6 707361758 714475513 720501244 725531459 729734063 733126938 735792756 737980008 739844143
2987.9 739844143 741412163 742630303 743416131 743845642 743985355 743844330 743530750 743113339 742688656
3006.3 742688656 742399454 742216051 741945028 741457462 740814686 740106881 739344656 738563359 737744689 736791849
3026.7 736791849 735748112 734721839 733729601 732620597 731290400 729963720 728777766 727519512
3043 727519512 725996852 724329889 722778082 721293032 719689906 718072712 716511846 714900672 713275671
3061.4 713275671 711773276 710397303 708954036 707305193 705590069 704002559 702594161 701287270
3077.7 701287270 699876726 698280334 696599960 694852591 693085432 691349447 689519703 687602401
3094 687602401 685789883 684086382 682292581 680351019 678389490 676499248 674624920 672626615 670600533
3112.4F70600533j893520j926899k116203k314448k475322k456069k310395k270520
3128.7F52837157k387881k458036k365708k252460k295434k539993k709746k657056
3145F33170843k596676k551258k498448k628028k863288k905786k843559k870679k873361
3163.4F08539760k795756k776086k850175k902687k888083k878249k918482k971530
3179.7E85558712k991437k958179k951682k968251k932191k931595k971232k985895
3196E61868250k973616k941787k932549k919554k876759k870440k871394k825499k790689
3214.3E35865963k774477k741933k711892k691985k693653k703786k616465k451777
3230.7E14479995k403379k542078k635062k535403k418518k327561k225727k218902
$$ plain form
3112.4 670600533 668707013 666780114 664663911 662349463 659874141 657418072 655107677 652837157
3128.7 652837157 650449276 647991240 645625532 643373072 641077638 638537645 635827899 633170843
3145 633170843 630574167 628022909 625524461 622896433 620033145 617127359 614283800 611413121 608539760
3163.4 608539760 605744004 602967918 600117743 597215056 594326973 591448724 588530242 585558712
3179.7 585558712 582567275 579609096 576657414 573689163 570756972 567825377 564854145 561868250
3196 561868250 558894634 555952847 553020298 550100744 547223985 544353545 541482151 538656652 535865963
3214.3 535865963 533091486 530349553 527637661 524945676 522252023 519548237 516931772 514479995
3230.7 514479995 512076616 509534538 506899476 504364073 501945555 499617994 497392267 495173365
3247D95173365k290011k263516k113163k035946k128154k185315k113700k060711k032429
3265.3D75950420j968026j890272j943976k108782k133459k042264k028584k052427
3281.6D59782630k023130k012998k028048j989991j975059k065957k184749k250284
3298D43252414k196431k027273j906395j991540k263635k459407k417773k323211k305388
3316.3D23361361k296120k268761k211303k157807k237410k348005k323211k276629
3332.6D05242115k230912k124518k126366k267927k343297k346546k262503k077728
3348.9C87462318k126068k389610k434790k217114k020061k011984k048702j931995
3365.3C70281994j797109j894385k127349k116740j827955j585454j493961j472354
$$ plain form
3247 495173365 492883354 490619838 488506675 486470729 484342575 482157260 480043560 477982849 475950420
3265.3 475950420 473982394 472092122 470148146 468039364 465905905 463863641 461835057 459782630
3281.6 459782630 457759500 455746502 453718454 451728463 449753404 447687447 445502698 443252414
3298 443252414 441055983 439028710 437122315 435130775 432867140 430407733 427989960 425666749 423361361
3316.3 423361361 421065241 418796480 416585177 414427370 412189960 409841955 407518744 405242115
3332.6 405242115 403011203 400886685 398760319 396492392 394149095 391802549 389540046 387462318
3348.9 387462318 385336250 382946640 380511850 378294736 376274675 374262691 372213989 370281994
3365.3 370281994 368484885 366590500 364463151 362346411 360518456 358933002 357439041 355966687
3381.6C55966687j376182j158416q70764n84454n99563q76128q51095m40508k17050
3399.9C48992527m96090p66098n27233j65820l0667n990n8383o1095J38402K95937
3420.3C47315490L09766M61578P46548R52155R86456J077086J249403J117974Q13932
3438.7C55030388Q72314J286298J615703J680612J634926J696706J832902J980663
3455C67630512K164244K309710K254277K224803K539516K777636K490550K041131K071888
3473.4C88504267K446443K765715K816349K561688K499819K731741K801597K787411
3489.7D09915030K898872K985567L051817L079653L098041L126949K978086K855510
3506D33989525L048032L301353L443777L446967L306925L321737L565907L810138L719002
$$ plain form
3381.6 355966687 354590505 353432089 352561325 351976871 351377308 350501180 349650085 349209577 348992527
3399.9 348992527 348496437 347730339 347203106 347037286 347006619 347000629 346942246 346881151 347019553 347315490
3420.3 347315490 347625256 348086834 348833382 349785537 350771993 351849079 353098482 354216456 355030388
3438.7 355030388 355902702 357189000 358804703 360485315 362120241 363816947 365649849 367630512
3455 367630512 369794756 372104466 374358743 376583546 379123062 381900698 384391248 386432379 388504267
3473.4 388504267 390950710 393716425 396532774 399094462 401594281 404326022 407127619 409915030
3489.7 409915030 412813902 415799469 418851286 421930939 425028980 428155929 431134015 433989525
3506 433989525 437037557 440338910 443782687 447229654 450536579 453858316 457424223 461234361 464953363
3524.4D64953363L475189L541857L761411L894687M052192M123479L987640M044473
3540.7D95834291M324973M396617M133046L993153M195333M394710M427254M494131
3557E30193508M666328M728496M643858M709005N112529N264222N021096M974544N168080
3575.3E74481666N345821N536139N722642N724490N673945N687237N619943N519986
3591.7F19311869N685806N944908O015182N975782N897165N777538N712270N871952
3608F66192472N958259N852580N791187N640567N659163N822837N442858M927814M826248
3626.3G16113985N293965N503714M893363M640340M604042M434287M276872M089058
3642.6G53849626L869116L752947L931403L838539L137767K827168L056347K967179
$$ plain form
3524.4 464953363 468428552 471970409 475731820 479626507 483678699 487802178 491789818 495834291
3540.7 495834291 500159264 504555881 508688927 512682080 516877413 521272123 525699377 530193508
3557 530193508 534859836 539588332 544232190 548941195 554053724 559317946 564339042 569313586 574481666
3575.3 574481666 579827487 585363626 591086268 596810758 602484703 608171940 613791883 619311869
3591.7 619311869 624997675 630942583 636957765 642933547 648830712 654608250 660320520 666192472
3608 666192472 672150731 678003311 683794498 689435065 695094228 700917065 706359923 711287737 716113985
3626.3 716113985 721407950 726911664 731805027 736445367 741049409 745483696 749760568 753849626
3642.6 753849626 757718742 761471689 765403092 769241631 772379398 775206566 778262913 781230092
3659G81230092K566695K358079K342105K297521K218485K128422J850724J602888J561702
3677.3H00156713J594662J645208J693189J732945J745582J493752J166820J153708
3693.6H12382579J211107J155197J008272Q58903Q49307R22799Q51274O59525O27995
3712H20526958P50243P01666N61476M76181M06087L38971L51966N36203O59585N42641
3732.4H25851977L76403L79086M52578M37021K56300J56403M07934L74377R1731K24412
3752.8H29008222M79817L90291K06590K15113K73466K02835J45554J52707J27078J61409
3773.2H31363082K60055L24249K39313R4473R4772R8467O6340J12116J95920K15292
3793.6H33064079J64151K05875J89722m4883o7413J4425J1384J20521J95920J43945
$$ plain form
3659 781230092 783796787 786154866 788496971 790794492 793012977 795141399 796992123 798595011 800156713
3677.3 800156713 801751375 803396583 805089772 806822717 808568299 810062051 811228871 812382579
3693.6 812382579 813593686 814748883 815757155 816616058 817465365 818388164 819239438 819898963 820526958
3712 820526958 821277201 821978867 822540343 823016524 823422611 823761582 824113548 824649751 825309336 825851977
3732.4 825851977 826228380 826607466 827060044 827497065 827753365 827909768 828317702 828692079 828783810 829008222
3752.8 829008222 829488039 829878330 830084920 830300033 830573499 830776334 830921888 831074595 831201673 831363082
3773.2 831363082 831623137 831947386 832186699 832281172 832375944 832474411 832540751 832652867 832848787 833064079
3793.6 833064079 833228230 833434105 833623827 833578944 833511531 833525956 833537340 833657861 833853781 833997726
3814H33997726J13726K09451P0929j59204P272J28627O5625O2465J24455J88649N0723
3836.4H34860444j57177j12236q2612l2783J57536K31504N9307l42846l43204J58191
3856.8H34396124K75075J21534j2636m5955o3300j14501k8312R1612R6381O9499k4021
3879.2H34761500l7372K1219n1319j9312O0141l7193o6340M9829J01149J2637j18137
3901.7H34676802j85966j12951L2306M0292R656N4479L3855m2855n4181m3750n3465
3924.1H34354222M530N9783p75j6152L9875K1577J3471J5378n9128o2764M053J2696
3948.6H34386766M1306L2365k4795K2828Q2851O4611k384q9228n1260P8499J07169
3971H34648728N3347j7405l5226M0471R8467J11640P8916J8180J0311o974m7803o55
$$ plain form
3814 833997726 834111452 834320903 834391832 834232628 834239900 834368527 834434152 834496617 834621072 834809721 834860444
3836.4 834860444 834703267 834591031 834508419 834475636 834633172 834864676 834923983 834581137 834237933 834396124
3856.8 834396124 834671199 834792733 834780097 834734142 834670842 834556341 834528029 834619641 834716022 834785521 834761500
3879.2 834761500 834724128 834745347 834694028 834674716 834734857 834697664 834631324 834681153 834782302 834794939 834676802
3901.7 834676802 834490836 834377885 834410191 834450483 834460139 834514618 834548473 834505618 834451437 834407687 834354222
3924.1 834354222 834358752 834418535 834417760 834401608 834441483 834463060 834476531 834491909 834432781 834370017 834374070 834386766
3948.6 834386766 834428072 834460437 834435642 834458470 834541321 834605932 834603548 834514320 834463060 834541559 834648728
3971 834648728 834702075 834684670 834649444 834689915 834788382 834900022 834978938 834997118 835007429 835000455 834952652 834951997
3995.5H34951997R6798
3997.5H35048795
$$ plain form
3995.5 834951997 835048795
3997.5 835048795
##END=$$ End of the data block
