##TITLE=$$ Begin of the data block
##JCAMP-DX=5.00 $$ ACD/SpecManager v 10.08
##SPECTROMETER/DATA SYSTEM=Alpha
##DATE=14 Apr 2014 11:23:48
##DATA TYPE=INFRARED SPECTRUM
##DATA CLASS=XYDATA
##ORIGIN=
##OWNER=
##NPOINTS=1765
##FIRSTX=399.75695801
##LASTX=3997.56933594
##MAXX=3997.56933594
##MINX=399.75695801
##MAXY=0.86977667
##MINY=0.34757408
##XFACTOR=1.0000000000
##YFACTOR=1.000000000000000e-9
##FIRSTY=0.68775874
##DELTAX=2.03957629
##XUNITS=1/CM
##YUNITS=ARBITRARY UNITS
##XYDATA=(X++(Y..Y))
399.8 687758744 686011374 684858203 684879720 684367657 682599068 681226790 680981159 681090415 680583060
418.1 680583060 679660976 679217100 678500772 677432179 677066088 677066863 676203132 674768925 674062908 674084187
438.5 674084187 673937201 673646152 673816860 673835814 672926426 672261178 672683656 672746480 671418548 670334637
458.9 670334637 670658946 670566201 669300139 668541789 668649971 667904556 666243255 665601432 665615916 664517760
479.3 664517760 663203895 663284957 663470626 662374437 661362946 661484838 661191940 659607351 658592045
497.7 658592045 658725441 657982409 656182230 655415952 655499041 654466629 652911663 652689695 652624965 650812507
518.1 650812507 648763537 648206413 647601902 645536244 643809199 643559933 642799795 640827656 639710367
536.4 639710367 639688969 638704479 637040913 636789560 637328804 636330068 634417653 633716702 633365333 631713450
556.8 631713450 629934490 629228890 628108740 625633597 623397350 622056067 620029330 617160618 615258753
575.2 615258753 614216506 612293303 609890401 608462155 607397914 605437040 603198290 601888895
591.5 601888895 600822985 598877311 596893847 595745862 594312251 591903567 590091050 589871943 589967906
609.8 589967906 589343190 588927150 589753568 591697156 594402552 598024368 602315247 606099486 609281838
628.2 609281838 612866938 616642714 619582355 621949673 624459803 626469195 627106488 627532303 629763424
646.5 629763424 633185446 635241449 635147631 634553075 635752261 639731824 645288765 650687158 654671788
664.9 654671788 657372773 660525084 664103508 667009175 669253349 671595633 674486935 676988959
681.2 676988959 678679585 680539846 682850003 684551418 685440421 686599195 688161314 688992143 689137161
699.6 689137161 689986050 691665471 692823470 693542004 695246339 697515368 698792696 699570060 701274037
717.9 701274037 703311443 704551458 705963016 708623648 711241364 712652802 714150369 716627955
734.2 716627955 718502343 718949914 719838977 721942008 723499060 724085212 725493431 727837801 729216695
752.6 729216695 729739308 731374979 733795404 734983563 735484064 737142026 739113748 739624918 739683867
771 739683867 740878582 741873682 741142154 740154207 740156531 739683807 738158107 737540841 738605917 739779174
791.4 739779174 740859568 743660510 748152137 752217174 755641818 760002375 764789224 768040657
807.7 768040657 770092249 772624791 775073767 775929511 775945842 776354492 776037216 773835897 770953119
826 770953119 768440068 765292227 761005878 757092237 754288197 751355588 747829080 744904160 742939055
844.4 742939055 741086543 739668906 740144908 742752910 746472478 751160562 757363439 764404476 771031082
862.7 771031082 777297020 783772707 789808631 794400513 797906756 801201463 803931057 805311799
879.1 805311799 805682182 805739641 805180550 803561926 801577568 800062537 798842549 797624707 796998680
897.4 796998680 797533095 798629284 799515128 800427556 801590323 802213252 801630318 800322652 798717618
915.8 798717618 796313643 793002009 789823413 787530243 785760641 784403741 784128189 784872115 785530984
934.1 785530984 785737872 786246836 787117541 787415326 787028015 786769092 786429584 784922063 782333255
952.5 782333255 779515266 776035905 770840466 764280617 757164001 748858094 738543630 726989329
968.8 726989329 715299070 703492761 691753864 681278884 672648191 665060163 657966852 651771724
985.1 651771724 646526694 641543210 636731803 632853687 629967809 627251387 624597847 622606754
1001.4 622606754 621002316 618757904 615642369 612124085 608085573 603132188 597714067 592623830
1017.7 592623830 587879419 583188713 578832746 575115442 571636260 568027616 564712107 562010407
1034.1 562010407 559519947 557061136 555060446 553541899 551894963 549885333 547871292 545995057
1050.4 545995057 544164777 542766750 542455137 543315768 544750631 546139777 547068775 546940923 545227110
1068.7 545227110 542179883 538586974 534953535 531440735 528231680 525411487 522630274 519414067
1085 519414067 515646577 511509061 507328212 503675282 501260221 500452101 501025736 502447546 504285932
1103.4 504285932 506201506 507850349 508950293 509320736 508792937 507000268 503415465 497968614 491874933
1121.8 491874933 487470537 486130506 487024426 488716245 489966542 490135252 490338057 492085546 495336592
1140.1 495336592 499078631 502593637 505649209 508177042 510183036 511957407 513964891 516406238
1156.4 516406238 519362330 523166418 528188825 534428954 541633964 549648225 558210015 566719353
1172.7 566719353 574753642 582367003 589593291 596105099 601588786 606008410 609133303 610496998
1189.1 610496998 610174477 608905077 607383847 606121540 605818331 607009649 609360099 612014651 614578068
1207.4 614578068 616999090 618886948 619920850 620490670 621102989 621684909 622099817 622673869 623673856
1225.8 623673856 624916852 626315176 628150225 630436718 632756352 634979367 637342870 639755428
1242.1 639755428 641825438 643483818 644901216 645943642 646380782 646468282 646685421 647123754 647736549
1260.4 647736549 648825228 650634706 652963161 655638576 658842087 662628531 666718662 670995474
1276.8 670995474 675579906 680395246 685229063 690119743 695257068 700570166 705756605 710726500
1293.1 710726500 715521276 719972908 723943710 727574408 730965853 734004021 736639202 738997698
1309.4 738997698 741148889 742999852 744549811 745946765 747228086 748401821 749591351 750795245
1325.7 750795245 751806855 752537549 753088951 753431916 753491402 753430009 753455698 753551126 753680170 753969908
1346.1 753969908 754388154 754643023 754647493 754602253 754470289 753919303 752742052 750944197 748873889 747007370
1366.5 747007370 745401025 743803680 741633356 738661170 736159503 735232294 735061765 734664083 734769464
1384.9 734769464 735937536 736943901 737080514 736898899 736527443 735550880 733892262 732134163 730452299
1403.2 730452299 728321493 725919724 723866343 722068489 720224857 718612134 717441082 716226339
1419.5 716226339 714891195 713873029 713195264 712487817 711323261 710119545 709447324 708773375 707733989
1437.9 707733989 707092464 706958592 706769228 706472039 706478238 706830144 707149088 707781136 709961176 713828027
1458.3 713828027 717562199 721421480 726552188 732997060 740603149 750358462 762308359 772554159
1474.6 772554159 779349566 784678161 789533377 793469250 796055019 797848761 799128830 799407363
1490.9 799407363 798961759 798499405 797794282 796294868 794460118 793038368 791522622 788419187 784903646
1509.3 784903646 782202899 779785872 777389288 775246084 773677945 772040725 769995809 768074691
1525.6 768074691 766350210 764928102 763592660 762048721 760898888 760264575 759226322 757768452
1541.9 757768452 756758690 756060302 755642354 755589545 755856216 756267428 756780684 756978631 756047249 754851401
1562.3 754851401 753619671 752125740 750054538 746958733 743653178 740075886 734964073 729391336
1578.6 729391336 724139571 718508780 712479293 706059694 699276745 692287743 685194135 677822351
1594.9 677822351 670272350 662864923 655579627 648266792 641042650 633974791 626845360 619777501
1611.3 619777501 613187313 606443465 598965406 592789114 587794244 582595766 577702045 573435783
1627.6 573435783 569799423 567381740 565963924 564892471 564644337 565653324 567690134 570553184
1643.9 570553184 574607849 579551160 584099412 589527309 596771657 602820158 608275771 614458799
1660.2 614458799 621599853 629033267 635773778 642800450 650599718 657860219 665066063 672560871
1676.5 672560871 679575622 686461926 693946660 702484369 710102618 716679096 723256946 729383528
1692.8 729383528 736039579 743313551 750271857 757495165 763645351 768779457 773459435 777459621
1709.2 777459621 781333447 785133898 788694799 792253494 795420408 797813892 799812794 801925719
1725.5 801925719 804310620 806777894 809173107 811998844 814961910 817447186 820065379 823088109
1741.8 823088109 826264679 829287350 832130253 835006654 837665200 839682400 841447413 843295574
1758.1 843295574 844969809 846265495 847368956 848642945 849966228 851038039 851883769 852667749 853372574
1776.5 853372574 854027689 854792297 855662584 856403112 856987417 857697427 858549654 859195530 859580219 860112906
1796.9 860112906 860798776 861305058 861601830 861977220 862463534 862867475 863171339 863488913 863855004 864169359
1817.2 864169359 864461005 864831746 865217924 865503788 865746439 865990639 866164565 866302252 866456866 866659164
1837.6 866659164 866919160 867201924 867409229 867520332 867630184 867764831 867912114 868071973 868221343 868323147
1858 868323147 868415833 868571401 868818760 869049847 869099796 869053721 869130075 869230390 869214296 869230390 869362175
1880.5 869362175 869437277 869417429 869504273 869662702 869648695 869546950 869597673 869705141 869633794 869510710 869590998
1902.9 869590998 869737029 869702578 869616568 869689465 869776666 869693041 869592369 869639456 869652808 869491100 869394898
1925.3 869394898 869491041 869477034 869259894 869151890 869238794 869230270 869046450 868963003 868995130 868825376 868501782
1947.8 868501782 868396103 868452251 868295133 867998123 867903233 867911458 867688596 867404342 867393613 867415190 867150843
1970.2 867150843 866872370 866854191 866819024 866536319 866297722 866317928 866304994 866059303 865876257 865913272
1990.6 865913272 865808904 865446329 865216970 865216911 865135789 864890456 864727139 864669442 864462376 864133418 863990545
2013 863990545 864004850 863832235 863489628 863307714 863263249 863049150 862734675 862643778 862680793 862492263 862179697
2035.5 862179697 862091422 862109184 861914635 861645341 861606419 861630917 861447811 861226857 861200333 861203432 861012518
2057.9 861012518 860795915 860796869 860842705 860691607 860548973 860617638 860655487 860471845 860325575 860406518 860460460
2080.3 860460460 860327482 860278904 860422313 860417187 860177100 860084832 860233009 860256732 860106349 860127151 860320032
2102.8 860320032 860323727 860145092 860158384 860338509 860319376 860156238 860211551 860410452 860389650 860248089 860362113
2125.2 860362113 860588729 860566854 860474288 860631943 860824764 860754728 860700309 860917389 861094534 861018538
2145.6 861018538 860998094 861226439 861386299 861313462 861356199 861635089 861761868 861647308 861691177 861952424
2166 861952424 862039983 861939549 862039566 862319648 862405777 862342775 862472773 862708688 862740993 862696767 862858951
2188.4 862858951 863064706 863030672 862936437 863067091 863238871 863185763 863114238 863257766 863394320 863338530
2208.8 863338530 863331616 863515019 863619626 863531232 863502562 863599241 863595009 863465309 863456249 863595009 863619506
2231.3 863619506 863500893 863481939 863560021 863533318 863453865 863489509 863552868 863484383 863356590 863326371 863337159
2253.7 863337159 863249123 863144279 863146722 863169432 863110304 863055766 863106370 863193274 863199532 863147914 863177538 863307595
2278.2 863307595 863399744 863386929 863344133 863327265 863295317 863221109 863182187 863218307 863203764 863084733 862982213
2300.6 862982213 862921596 862787366 862585723 862446785 862391472 862310171 862170339 862042964 861872375 861565471
2321 861565471 861279547 861195564 861150682 860972583 860747516 860609233 860528052 860371053 860245705 860354304
2341.4 860354304 860625446 861042738 861598432 861896515 861578345 860779405 860102355 859774768 859549522 859440744
2361.8 859440744 859721959 860387325 861063421 861618698 862292290 863075674 863706172 864241004 864918947 865588605
2382.2 865588605 865955114 866101503 866303742 866513669 866505265 866411150 866499305 866626799 866529763 866403580
2402.6 866403580 866501272 866592109 866472900 866392434 866508722 866557896 866408110 866342068 866462648 866462231 866269350
2425 866269350 866204381 866311073 866264760 866054595 866017103 866125762 866046309 865839958 865809083 865856290 865703166
2447.5 865703166 865479648 865448534 865475833 865343213 865205228 865243018 865267932 865101457 864917278 864893973
2467.9 864893973 864881754 864719987 864569545 864540815 864444256 864213884 864077508 864103198 864047885 863840401
2488.3 863840401 863698125 863682032 863595665 863398433 863299012 863304257 863200068 863005161 862934113 862958252 862855792
2510.7 862855792 862637579 862501204 862459302 862354457 862196565 862124145 862060249 861881852 861710012 861659765
2531.1 861659765 861625314 861490786 861332834 861251175 861159742 860979438 860816658 860760987 860694706 860501707
2551.5 860501707 860297680 860189795 860083282 859914422 859766245 859675646 859557748 859372199 859194994 859055102
2571.9 859055102 858856082 858582973 858359158 858210683 858013630 857708275 857423186 857241988 857043862 856761336
2592.3 856761336 856486082 856239796 855959892 855676174 855441213 855197489 854882717 854569852 854311347 854028940
2612.7 854028940 853679419 853330970 853062928 852819145 852497876 852160633 851890922 851608515 851235509 850869834
2633.1 850869834 850586951 850304186 849983871 849698484 849447846 849130809 848751783 848420262 848140478 847836256
2653.5 847836256 847509503 847217083 846950054 846628428 846259475 845947802 845702529 845445037 845165551 844923913
2673.9 844923913 844745934 844553888 844269633 843929887 843610585 843330324 843080878 842866480 842636704 842338741
2694.3 842338741 842030942 841770709 841512263 841182768 840783596 840388298 840002716 839573503 839127541 838719964
2714.6 838719964 838311851 837848783 837387741 837004244 836681604 836334288 835924804 835541070 835247278 835008264
2735 835008264 834769964 834518850 834275663 834019482 833747149 833498120 833213151 832790077 832299054 831894040
2755.4 831894040 831543624 831122696 830666959 830262303 829824865 829281032 828732669 828270733 827837229 827299297
2775.8 827299297 826653421 825979769 825270951 824526250 823821902 823171735 822447836 821594656 820758224 820012033
2796.2 820012033 819182992 818185151 817173898 816200912 815157413 814024746 812850833 811577559 810138285
2814.6 810138285 808621168 807120562 805522084 803647459 801519573 799172997 796429634 793115854
2830.9 793115854 789151073 784345090 778339088 770754874 761443377 750434339 737649679 723297656
2847.2 723297656 708773732 696767986 690054059 689732015 694497049 701576233 708266079 712951720
2863.5 712951720 715273440 715741575 715413749 715624511 717158020 719540358 721655786 722711205 722406089
2881.9 722406089 720698357 717715561 713787377 709261954 704322159 699089825 693721116 688302815
2898.2 688302815 682764113 676927447 670572460 663373947 654894829 644728482 632556438 618430436
2914.5 618430436 603314221 589005232 577400625 569988251 567638040 570424199 577475131 587298393
2930.8 587298393 598654628 610789001 622940779 634180486 643699586 650917649 655394971 657021642
2947.2 657021642 656358957 654614449 653132439 653054118 655121088 659428060 665605724 673184633 681719363
2965.5 681719363 690694690 699488521 707588553 714712858 720743001 725789309 730011702 733403623
2981.8 733403623 736082613 738280773 740112484 741680861 742945790 743734956 744136155 744251728 744068027
3000.2 744068027 743730545 743331015 742904961 742608726 742471695 742264092 741802871 741164207 740449250 739652753
3020.6 739652753 738830447 737996757 737051129 736047864 735092282 734125376 732985139 731641054 730342448
3038.9 730342448 729178965 727906644 726374805 724711180 723139167 721642315 720070899 718478799
3055.3 718478799 716905475 715293944 713703752 712219775 710815132 709323883 707635522 705913484
3071.6 705913484 704340518 702931046 701616347 700193942 698576510 696882546 695128143 693380833
3087.9 693380833 691691577 689880610 687960029 686131179 684409976 682646811 680734396 678761780
3104.2 678761780 676861286 674987674 673016250 671029747 669132531 667182863 665080547 662791252
3120.5 662791252 660323262 657877088 655573487 653299451 650917947 648446798 646044850 643749595
3136.8 643749595 641394377 638843119 636177182 633543134 630945623 628402472 625927866 623316288
3153.2 623316288 620443344 617514670 614679277 611857295 609012425 606196105 603383720 600501895
3169.5 600501895 597567379 594662011 591787279 588856876 585877180 582940638 580042005 577092230
3185.8 577092230 574103832 571163237 568233311 565245509 562235355 559262693 556350291 553467095
3202.1 553467095 550569296 547671735 544790387 541950464 539181292 536432743 533671558 530904233
3218.4 530904233 528143704 525423765 522746623 520079732 517444372 514924884 512499154 510005295
3234.7 510005295 507424414 504874170 502406657 500070870 497862577 495672375 493427575 491214573
3251.1 491214573 489106834 486988723 484791428 482622296 480544895 478493333 476449609 474493504
3267.4 474493504 472629309 470689207 468578637 466427624 464339703 462284744 460226893 458184183
3283.7 458184183 456167072 454156667 452186525 450239241 448208630 446069032 443872720 441711605
3300 441711605 439647049 437658042 435633272 433398575 430947363 428488225 426167786 423940808 421706736
3318.4 421706736 419419378 417149007 414957225 412701577 410352290 408076286 405846089 403614283
3334.7 403614283 401467443 399315298 397033453 394712865 392419070 390206456 388135523 385981888
3351 385981888 383605063 381210506 378949523 376823127 374760926 372753501 370927006 369204789 367304444
3369.3 367304444 365182579 363098830 361256421 359618694 358110338 356665492 355284095 354109794
3385.7 354109794 353276461 352744818 352151930 351232111 350341350 349927604 349768192 349255353 348395437 347816110
3406.1 347816110 347703725 347733200 347701639 347604632 347574085 347755432 348066777 348419249 348929465 349685848
3426.5 349685848 350616992 351561189 352590233 353800654 354915977 355766952 356658220 357904673 359472930
3444.8 359472930 361166775 362846166 364562124 366401583 368395448 370572299 372882277 375135869
3461.1 375135869 377379417 379914790 382643223 385096163 387145936 389237016 391696721 394478768
3477.4 394478768 397286713 399834305 402357429 405146271 407985121 410721630 413520664 416470349
3493.8 416470349 419572860 422683060 425739467 428851902 431870937 434710026 437681079 440977722
3510.1 440977722 444497734 447942942 451142550 454389721 457964718 461839348 465640485 469151407
3526.4 469151407 472667575 476389766 480273664 484331757 488426536 492383391 496462584 500812531
3542.7 500812531 505183518 509301305 513264537 517418206 521863282 526422679 530968904 535555720
3559 535555720 540207744 544877768 549656153 554789484 560010016 564984322 569942594 575091362 580446780
3577.4 580446780 586041927 591786504 597471535 603115022 608832359 614490390 619996548 625646949
3593.7 625646949 631599426 637678981 643699050 649591506 655351222 661024690 666844249 672785461
3610 672785461 678652585 684418857 690013349 695699990 701544762 706923366 711842120 716784954 722143888
3628.4 722143888 727534533 732337058 736982286 741562724 745887101 750103056 754255831 758213401
3644.7 758213401 762062550 766050696 769803882 772851348 775653481 778704107 781691194 784278154
3661 784278154 786606133 788910568 791207552 793393850 795458376 797332168 799020648 800629854 802196980
3679.4 802196980 803775191 805443048 807203710 809025288 810588241 811682940 812729478 813897133
3695.7 813897133 814999521 815956712 816834033 817740977 818728924 819653690 820318818 820834816 821501076
3714 821501076 822225809 822838187 823353469 823774040 824048758 824306071 824831784 825567126 826211929 826624870
3734.4 826624870 826968431 827421784 827883601 828151405 828301072 828692675 829094946 829208136 829351604 829734623
3754.8 829734623 830106735 830332577 830536783 830786943 830990553 831173360 831391454 831557214 831679165 831876636
3775.2 831876636 832218170 832533777 832639694 832656085 832670808 832739294 832895815 833090425 833333373 833594561
3795.6 833594561 833806813 833873034 833775759 833801150 833923399 833976448 834062278 834196568 834321499 834473193
3816 834473193 834736645 834853411 834677398 834586978 834591329 834560215 834608793 834802747 835099280 835233033 835051298
3838.4 835051298 834879816 834836423 834863901 835014939 835235178 835323691 834981918 834557235 834643841 834890783
3858.8 834890783 835003674 835007906 834998786 834994495 834974766 834978819 835009038 835022032 835004866 834926307 834918499 835068822
3883.3 835068822 835129619 835091770 835087419 834978700 834839761 834890723 835008323 834982038 834862471 834725797 834601581
3905.7 834601581 834590197 834631622 834658504 834716439 834751129 834715903 834673464 834622264 834561408 834565461 834637761 834700286
3930.2 834700286 834731162 834713399 834613860 834543347 834565222 834563494 834540069 834589541 834692061 834748924 834702849
3952.7 834702849 834627092 834620714 834693313 834793568 834867477 834880471 834863603 834884048 834932268 834945083 834922194
3975.1 834922194 834925830 834989727 835125804 835279107 835323930 835262716 835214853 835201204 835165203 835161328 835258842
3997.5 835258842
##END=$$ End of the data block
