##TITLE=$$ Begin of the data block
##JCAMP-DX=5.00 $$ ACD/SpecManager v 10.08
##SPECTROMETER/DATA SYSTEM=Alpha
##DATE=14 Apr 2014 11:23:48
##DATA TYPE=INFRARED SPECTRUM
##DATA CLASS=XYDATA
##ORIGIN=
##OWNER=
##NPOINTS=1765
##FIRSTX=399.75695801
##LASTX=3997.56933594
##MAXX=3997.56933594
##MINX=399.75695801
##MAXY=0.86985630
##MINY=0.34831670
##XFACTOR=1.0000000000
##YFACTOR=1.000000000000000e-9
##FIRSTY=0.68928164
##DELTAX=2.03957629
##XUNITS=1/CM
##YUNITS=ARBITRARY UNITS
##XYDATA=(X++(Y..Y))
399.8F89281642j908540j836479q52466q61585j570165r47893J42575J55151l49224
418.1F81253016o86646q30173j144767j260280n36979K8491n48362j052857o53982
436.5F74567461k52724n23090n77033K65420L32296p34389p20084M55261M67300q55267
456.9F72425151j180709l39210n80430j285851o65545Q4281o49214j433372o92308
475.2F65682793j41561r73404j282036k42531Q94q64029o06299L54290l43322j760900
495.6F59823895j101077K45035o47307j879692q59678M7803j109361j686871k87533
514F52545214N9j750588j998842m09126n80549k329290k014876l37243p56800k005577
534.4F40362382j079738J97708o87062j458168k83659K38955j212776j759052m48942
$$ plain form
399.8 689281642 687373102 685536623 684684157 683822572 682252407 681304514 681447089 681602240 681253016
418.1 681253016 680566370 679736197 678591430 677331150 676794171 676822662 676274300 675221443 674567461
436.5 674567461 674314737 673791647 673214614 673480034 673812330 673077941 672357857 672813118 673280418 672425151
456.9 672425151 671244442 670905232 670324802 669038951 668373406 668457687 667808473 666375101 665682793
475.2 665682793 665541232 664567828 663285792 663043261 663044155 662180126 661573827 661928117 661584795 659823895
495.6 659823895 658722818 658967853 658320546 656440854 655581176 655628979 654519618 652832747 652545214
514 652545214 652545273 650794685 648795843 648386717 647806168 645476878 643462002 643124759 642367959 640362382
534.4 640362382 639282644 639480352 638793290 637335122 637051463 637290418 636077642 634318590 633869648
552.7F33869648k85387j768529j881004o38842j054824k469420k132535j278401k103209
571.1F20257497k952397k040565j142561j852334k373815j426935j032650k001822
587.4F05434418k214074j301587j254678k037167j850963j053333j430154k404094
603.7E91888368j769364j25348J57654o57499m69148P83324J887322K758443L744960
622.1E98198712M291832L739238L193736L591180L780246K951145K338171K538502
638.4F24622762K207995Q26120L82960K041519L300011K086103K4199m71055J238882
656.7F36259496L916860N490601N365014L945649K593934L079653L626943K924800
673.1F67202950K299904K457798K964914K570748J701236J760959K283156J755119
$$ plain form
552.7 633869648 633584261 631815732 629934728 629295886 628241062 625771642 623639107 622360706 620257497
571.1 620257497 617305100 615264535 614121974 612269640 609895825 608468890 607436240 605434418
587.4 605434418 603220344 601918757 600664079 598626912 596775949 595722616 594292462 591888368
603.7 591888368 590119004 589993656 590151310 589493811 589024663 589807987 591695309 594453752 598198712
622.1 598198712 602490544 606229782 609423518 613014698 616794944 619746089 622084260 624622762
638.4 624622762 626830757 627656877 628039837 630081356 633381367 635467470 635491669 635020614 636259496
656.7 636259496 640176356 645666957 651031971 654977620 657571554 660651207 664278150 667202950
673.1 667202950 669502854 671960652 674925566 677496314 679197550 680958509 683241665 684996784
689.4F84996784Q78572J113713J583755Q71778J26957Q34406J685262J154780P00057
707.7F93946064J675784K309144J393437Q41439J668095J955450J186013J399338K623082
726.1G08997846K589643J430988J529217K474785J827657M32730Q95261K090395J536310
744.4G23804832N50150J400054K399981J444459N52535J592636K301276J127720N38230
762.8G35711873J675129J955509N23388P6056J186370J033903o33181r59932q7738
781.2G40481377n70476j569689o24597J100004J214266J092136K784907M454971M050731
799.5G52413630L484428M449487M752815L138959K040208K565920K403975Q32557P7665
817.9G76159644M13120l71158k217353k864837k487242l154994m317343l931820k828479
$$ plain form
689.4 684996784 685875356 686989069 688572824 689444602 689571559 690405965 692091227 693246007 693946064
707.7 693946064 695621848 697930992 699324429 700165868 701833963 703789413 704975426 706374764 708997846
726.1 708997846 711587489 713018477 714547694 717022479 718850136 719282866 720178127 722268522 723804832
744.4 723804832 724354982 725755036 728155017 729599476 730152011 731744647 734045923 735173643 735711873
762.8 735711873 737387002 739342511 739865899 739941955 741128325 742162228 741529047 740569115 740481377
781.2 740481377 739910901 738341212 737716615 738816619 740030885 741123021 743907928 748362899 752413630
799.5 752413630 755898058 760347545 765100360 768239319 770279527 772845447 775249422 776081979 776159644
817.9 776159644 776572764 776201606 773984253 771119416 768632174 765477180 761159837 757228017 754399538
836.2G54399538k975523l547073k873182j850128j758695j389980M72486K587497L687680
854.6G46752620M642546O144226P018208O637096O247580O422341N997002M610181
870.9G94471800L546179L283560K689958J357436L59237O9857n39184j643419k012730
889.3H01582694j489162j208723j228809o01590N45442J078129Q67724Q75712J135528
907.6H01556945O40452n52178j273870j558542k403796l385604l227949k282142j769424
926G85743892j355827k55584P40945O45041K02299N00083Q47399K87175l62515k45393
946.4G86747515l67999j538694k579987k790034l490328n225599o573439p156789q357048
964.7G48667598j0309518j1521995j1682987j1787653j1661053j0390102q603514p610798
$$ plain form
836.2 754399538 751424015 747876942 745003760 743153632 741394937 740004957 740477443 743064940 746752620
854.6 746752620 751395166 757539392 764557600 771194696 777442276 783864617 789861619 794471800
870.9 794471800 798017979 801301539 803991497 805348933 805708170 805778027 805238843 803595424 801582694
889.3 801582694 800093532 798884809 797656000 797054410 797599852 798677981 799545705 800421417 801556945
907.6 801556945 802197397 801645219 800371349 798812807 796409011 793023407 789795458 787513316 785743892
926 785743892 784388065 784132481 784873426 785518467 785720766 786220849 787068248 787355423 786992908 786747515
946.4 786747515 786379516 784840822 782260835 779470801 775980473 770754874 764181435 757024646 748667598
964.7 748667598 738358080 726836085 715153098 703365445 691704392 681314290 672710776 665099978
981F65099978p120072o183863n225480m974305m800141l915727k965331k747417k644539
999.4F24523103k023220j663923k265036l080011l476023m047334m966736n360902
1015.7E97639918m996776m711628m730106m385411l714383l475785l586829l278315
1032E64760685k693951k494693k447605k003789j537323j640618j985073k015173j896084
1050.4E46046376j830935j367867k66016Q58307J374006J360000R34004j26838j685560
1068.7E45295477l012836l598929l669261l540099l203929k787709k737105l199398
1085E19546211l798247m162669m158318l616035k396345q00431N81086J433313J834392
1103.4E04462957J888454J646817J125574L65317n65648j819968l597498n454809o078809
$$ plain form
981 665099978 657979906 651796043 646570563 641596258 636796117 632880390 629915059 627167642 624523103
999.4 624523103 622499883 620835960 618570924 615490913 612014890 607967556 603000820 597639918
1015.7 597639918 592643142 587931514 583201408 578815997 575101614 571625829 568039000 564760685
1032 564760685 562066734 559572041 557124436 555120647 553583324 551942706 549957633 547942460 546046376
1050.4 546046376 544215441 542847574 542581558 543439865 544813871 546173871 547107875 546981037 545295477
1068.7 545295477 542282641 538683712 535014451 531474352 528270423 525482714 522745609 519546211
1085 519546211 515747964 511585295 507426977 503810942 501414597 500614166 501195252 502628565 504462957
1103.4 504462957 506351411 507998228 509123802 509489119 508923471 507103503 503506005 498051196 491972387
1121.8D91972387m380524j340926Q72463J675576J257181K05219K56896J771808L242373
1140.1D95532453L738314L506094L024817K482116J984894J792491K013683K411604
1156.4E16486466K896905L754556N025506O262958P224739Q039295Q579016Q502007
1172.7E66771448Q021474P617116P197737O444812N448997M428387L139853J356125
1189.1F10425949l45945j263678j478315j235068l16321J155555K322614K668321K606034
1207.4F14539146K453983J889766J018226N67972O03915N44250L94940O05047J041472
1225.8F23658717J272738J432418J840294K255142K305567K234936K397418K461910
1242.1F39859140K093851J642764J374483R98795M30346J12653K44200M59730O16193
$$ plain form
1121.8 491972387 487591863 486250937 487123400 488798976 490056157 490261376 490518272 492290080 495532453
1140.1 495532453 499270767 502776861 505801678 508283794 510268688 512061179 514074862 516486466
1156.4 516486466 519383371 523137927 528163433 534426391 541651130 549690425 558269441 566771448
1172.7 566771448 574792922 582410038 589607775 596052587 601501584 605929971 609069824 610425949
1189.1 610425949 610080004 608816326 607338011 606102943 605786622 606942177 609264791 611933112 614539146
1207.4 614539146 616993129 618882895 619901121 620469093 621073008 621617258 622012198 622617245 623658717
1225.8 623658717 624931455 626363873 628204167 630459309 632764876 634999812 637397230 639859140
1242.1 639859140 641952991 643595755 644970238 645969033 646399379 646512032 646756232 647215962 647832155
1260.4F47832155J064122J772523K306402K667486L183723L777802M113674M272878
1276.8F70990765M524589M785597M858911M907966N144953N305291N169451M980504
1293.1G10668027M806102M447579L990650L658474L373980L011585K653122K389729
1309.4G38999248K167344J860499J558602J409769J289844J165748J182914J206994
1325.7G50840962J010954P35402N58794L38674O2704m5300K3008Q8334J51276L13461
1346.1G54078269M18425K37643j4484m2438j26481n58198j171589j782238k072215
1364.5G48966694j878917j609743j596808k172590k985358k521813r36448j60993l78489
1382.8G34725535J06931J154482J014352J69396j67072l89397r81748j653194j778603
$$ plain form
1260.4 647832155 648896277 650668800 652975202 655642688 658826411 662604213 666717887 670990765
1276.8 670990765 675515354 680300951 685159862 690067828 695212781 700518072 705687523 710668027
1293.1 710668027 715474129 719921708 723912358 727570832 730944812 733956397 736609519 738999248
1309.4 738999248 741166592 743027091 744585693 745995462 747285306 748451054 749633968 750840962
1325.7 750840962 751851916 752587318 753146112 753484786 753547490 753502190 753525198 753613532 753764808 754078269
1346.1 754078269 754496694 754734337 754719853 754677415 754550934 753992736 752821147 751038909 748966694
1364.5 748966694 747087777 745478034 743881226 741708636 738723278 736201465 735265017 735104024 734725535
1382.8 734725535 734832466 735986948 737001300 737170696 737003624 736614227 735632479 733979285 732200682
1401.2G32200682j704573k130867k392888k040505j794338j856089j611590j161874
1417.5G17507958j214563j328588j002610o60300o89268j143575j187444o56425o53267
1435.9G08971918j038134o56069j72674k64347l50714P510L82185L58463O81519K236188
1456.2G10155845L852665L642798L799080N137086O459475P618248R802342J1979997
1472.6G62447536J0203302O740391N309522M871786L956199K590298J812995J315713
1488.9G99247742K84373m62532m83989p35700j514614j815260j374483j433432l034889
1507.2G88677216l561497k789855k440393k332628k084494j572847j648426k031982
1523.6G70215094j883745j688838j437485j365722j545190j128197n90026j018823
$$ plain form
1401.2 732200682 730496109 728365242 725972354 723931849 722137511 720281422 718669832 717507958
1417.5 717507958 716293395 714964807 713962197 713301897 712612629 711469054 710281610 709625185 708971918
1435.9 708971918 707933784 707277715 707105041 706840694 706489980 706497490 706879675 707238138 707919657 710155845
1456.2 710155845 714008510 717651308 721450388 726587474 733046949 740665197 750467539 762447536
1472.6 762447536 772650838 779391229 784700751 789572537 793528736 796119034 797932029 799247742
1488.9 799247742 799532115 799069583 798585594 797849894 796335280 794520020 793145537 791712105 788677216
1507.2 788677216 785115719 782325864 779885471 777552843 775468349 773895502 772247076 770215094
1523.6 770215094 768331349 766642511 765205026 763839304 762294114 761165917 760575891 759557068
1539.9G59557068j514315j060605p09534m03643l6180K67864M09603N34653K68400
1558.2G57313311r00924j256406j279891j501322k066791l109634l318548l560245
1574.5G40319550n114198n603969n253613n610168o009578o417811o800831p007181
1590.9F92502201p102490p361472p525026p394255p285714p321417p240593p070303
1607.2F34200931p107735p049799o593287o740987p458687o163061m996896n224883
1623.5E82865596m917979m271925l646195k429843j414835j043916k32637J001775
1639.8E65910041K029121K852202M057586M956663M558384N468070P269681O005704
1656.1F03107452N408228O173909P153451P431269O754994P062316P806063P237553
$$ plain form
1539.9 759557068 758042753 756982148 756272614 755868971 755832791 756100655 756510258 757044911 757313311
1558.2 757313311 756412387 755155981 753876090 752374768 750307977 747198343 743879795 740319550
1574.5 740319550 735205352 729601383 724347770 718737602 712728024 706310213 699509382 692502201
1590.9 692502201 685399711 678038239 670513213 663118958 655833244 648511827 641271234 634200931
1607.2 634200931 627093196 620043397 613450110 606709123 599250436 593087375 588090479 582865596
1623.5 582865596 577947617 573675692 570029497 567599654 566184819 565140903 564908266 565910041
1639.8 565910041 567939162 570791364 574848950 579805613 584363997 589832067 597101748 603107452
1656.1 603107452 608515680 614689589 621843040 629274309 636029303 643091619 650897682 658135235
1672.4F58135235P192374P495820P019103O905555P529319Q549332P552326O503165
1688.8G16882229O522775O119668O727695P347703O957889P184208O110429N099714
1705.1G68952310M634619L965556L893972L855884L610253L586114L143608K343953
1721.4G97986269J964211K093614K386808K506912K459466K868593K955258K479791
1737.7H17700922K621115K995431L134310K999366K860486K904892K647281J989365
1754H39853168J730322J814545J667320J282215J090050J303971J370788J103341Q48413
1772.4H52064133P37011O58393O54578P83265Q79526P36713N60046O83903Q59380O74486
1792.8H59291434L84033M96686O50405N02885L04162L84689N24163M35889K88665L07977
$$ plain form
1672.4 658135235 665327609 672823429 679842532 686748087 694277406 702826738 710379064 716882229
1688.8 716882229 723405004 729524672 736252367 743600070 750557959 757742167 763852596 768952310
1705.1 768952310 773586929 777552485 781446457 785302341 788912594 792498708 795642316 797986269
1721.4 797986269 799950480 802044094 804430902 806937814 809397280 812265873 815221131 817700922
1737.7 817700922 820322037 823317468 826451778 829451144 832311630 835216522 837863803 839853168
1754 839853168 841583490 843398035 845065355 846347570 847437620 848741591 850112379 851215720 852064133
1772.4 852064133 852801144 853459537 854114115 854897380 855776906 856513619 857073665 857757568 858616948 859291434
1792.8 859291434 859675467 860172153 860822558 861325443 861629605 862014294 862538457 862974346 863263011 863570988
1813.2H63570988L82006K94447K41578L58164M11690K96473K49088K66254J65283J06037
1833.6H66342008J43886K01523K77162L30984K24829Q8930J17660J30474Q6069J18435
1854H68061960J73866J30475Q0526J38879K67923K77400Q4042o3538J7464N7816O378
1876.4H69233191Q6486J76192M9710o9261Q5056J87576P331q3446N8830R8347q4400
1898.8H69745612j27971N9724J00672n6982o8426R6917J06752p4923j10567N3048K9207
1921.3H69753063j92762j49548R0003L815k16842r6321J05679k2173j94192m3034P2300
1943.7H69109988j72078l44992j28746L8326j82450l18587q7619K0623k10583k60114
1964.1H67463768m232j1146k93911k52128L0280j4842k75493k43008j2994m7028k43187
$$ plain form
1813.2 863570988 863952994 864247441 864489019 864847183 865258873 865555346 865804434 866070688 866235971 866342008
1833.6 866342008 866485894 866687417 866964579 867295563 867520392 867609322 867726982 867857456 867943525 868061960
1854 868061960 868235826 868366301 868446827 868585706 868853629 869131029 869215071 869151533 869168997 869226813 869233191
1876.4 869233191 869319677 869495869 869545579 869476318 869561374 869748950 869756281 869672835 869731665 869830012 869745612
1898.8 869745612 869617641 869677365 869778037 869721055 869652629 869749546 869856298 869781375 869670808 869723856 869753063
1921.3 869753063 869560301 869410753 869500756 869504571 869287729 869191408 869297087 869274914 869080722 869037688 869109988
1943.7 869109988 868937910 868592918 868464172 868502498 868320048 868001461 867913842 867934465 867723882 867463768
1964.1 867463768 867459536 867448390 867154479 866902351 866932631 866917789 866642296 866399288 866386294 866339266 866096079
1986.5H66096079j65522M0949j03176l61383k28465J5498q1659k96294j94371k6643
2006.9H64695013j80781l46184j68920J7226j43647l06606j46687k9386k34246l33369
2027.3H62822413q7976L7312j78992k90990r4831r120k07364k74718n8234M769j95623
2049.8H61466646k17616J1742L2544j99258k16067J9133M2319j75357j65522M0770
2070.2H60639334R238j70648p7903J27792K0206j88410n3346J75059K8848k17020q5592
2092.6H60207558J45912Q344j69575k563J56105j6034j67548L7431J90974k3425j59204
2115H60207975Q1122K24709l2782j59204J31070K43545l1889j07288J42336J77681
2135.4H60877275q0764q3864K02656K10285n7756l6896K20418J65642o5446M7564K66075
$$ plain form
1986.5 866096079 865930557 865971506 865868330 865506947 865278482 865293980 865212321 864916027 864721656 864695013
2006.9 864695013 864514232 864168048 863999128 864016354 863872707 863566101 863419414 863390028 863155782 862822413
2027.3 862822413 862734437 862771749 862592757 862301767 862206936 862197816 861990452 861715734 861657500 861662269 861466646
2049.8 861466646 861249030 861260772 861293316 861094058 860877991 860897124 860939443 860764086 860598564 860639334
2070.2 860639334 860648572 860477924 860400021 860527813 860548019 860359609 860306263 860481322 860510170 860293150 860207558
2092.6 860207558 860353470 860361814 860192239 860189676 860345781 860329747 860162199 860199630 860390604 860367179 860207975
2115 860207975 860289097 860513806 860481024 860321820 860452890 860696435 860664546 860557258 860699594 860877275
2135.4 860877275 860796511 860712647 860915303 861125588 861067832 861030936 861251354 861416996 861351550 861399114 861665189
2157.9H61665189R8765j30057N5253K89083J06335q7560J27137K88248N7280p3492
2178.2H62396181J49667K29001j2815p9095J74343K33650m0710j08003J40607J73926
2198.6H63256752m2796k7239J72257J26183q5532m4823J59025J04189p9453o139J31965
2221.1H63664389J3351j24156m828J08897j2099j08898J4961J13547o497r9421n36
2243.5H63558710L7431q7440j28925j5914J4782r4235j17660j0788K7001m0293l2902
2265.9H63109767P2539R3699q106n1678L6538J02341N6446N603J7881Q702p4088j46389
2290.4H63223255o5089P6771K7001j00791q5950m7088j11461j79529j56045q2433o6578
2312.9H62432063j04607j35302k29120l39032k30073j5140m8280k08378k31325j43945
$$ plain form
2157.9 861665189 861763954 861633897 861689150 861978233 862084568 861997008 862124145 862412393 862469673 862396181
2178.2 862396181 862545848 862774849 862762034 862682939 862857282 863090932 863050222 862942219 863082826 863256752
2198.6 863256752 863213956 863186717 863358974 863485157 863399625 863354802 863513827 863618016 863538563 863532424 863664389
2221.1 863664389 863677740 863553584 863548756 863657653 863645554 863536656 863551617 863665164 863658667 863559246 863558710
2243.5 863558710 863596141 863508701 863379776 863363862 863378644 863284409 863166749 863155961 863182962 863142669 863109767
2265.9 863109767 863182306 863276005 863267899 863216221 863252759 863355100 863411546 863417149 863435030 863443732 863369644 863223255
2290.4 863223255 863158166 863234937 863261938 863161147 863075197 863028109 862916648 862737119 862581074 862498641 862432063
2312.9 862432063 862327456 862192154 861963034 861624002 861393929 861378789 861330509 861122131 860890806 860746861
2333.3H60746861j22667j97887j40488R9241L24965N23329O07013K96176l21686q23200
2353.6H60991657p71523m28915k38120p689L93688O73473O44684N37396O61492P54058
2374H63210201N88775N08726O44922O51479L78430J64091K18213K06291k6285j04308
2394.4H66440535Q2016J18613q0109q7440J18733J05738j03771q3328Q5712M053j58310
2416.9H66442442j9729J57594l755k02357p7963R3996l5763j98245n8233P7486q8275
2439.3H66087198j97530j5080N2572j52469k15649k0683M7981j27434j72794N841K2650
2461.7H65314603j60396j85311k7359j2576j66595j62780j7882n9068k18391j54317
2482.1H64149928J2040p6413k44260j41442L2127n0604j76132p2360K4319j14024k34842
$$ plain form
2333.3 860746861 860624194 860426307 860285819 860385060 860710025 861233354 861840367 862136543 861814857 860991657
2353.6 860991657 860220134 859791219 859553099 859545410 859939098 860612571 861257255 861794651 862456143 863210201
2374 863210201 863798976 864307702 864952624 865604103 865982533 866146624 866364837 866571128 866544843 866440535
2394.4 866440535 866522551 866641164 866561055 866473615 866592348 866698086 866594315 866510987 866596699 866600752 866442442
2416.9 866442442 866422713 866580307 866576552 866374195 866296232 866390228 866354465 866156220 866097987 866175473 866087198
2439.3 866087198 865889668 865874588 865927160 865774691 865559042 865538359 865586340 865458906 865286112 865291953 865314603
2461.7 865314603 865154207 864968896 864941537 864928961 864762366 864599586 864581704 864522636 864304245 864149928
2482.1 864149928 864161968 864085555 863841295 863699853 863731980 863681376 863505244 863432884 863457203 863343179 863108337
2504.6H63108337j23561k5630j03533j66237r3520k6524j14977j93000j04666p0870
2525H62085819j70767j65880m3034l1710j38998j48356n4300p9632k16722k16961p8261
2547.4H60741198n8591j65880j58429n2750p2122j95086k04980j21236j31428j74463
2567.8H59406233j34289j10150k00331k92480k38657j60933k19047l09229k75969j90616
2588.2H57274532k12848k67625k25365k08497k93255l30925k76148k45869k94805l10719
2608.6H54608476k52008k53976l37124l67820k91705k51830l15070l33249k94447l17574
2629H51593673l61800l12328k52903l03983l47078k83540k42173l06428l58701l25560
2649.4H48499179k94805l15487l23653k90275k82049l10779l18169k84314k58744k74658
$$ plain form
2504.6 863108337 862984776 862959146 862855613 862689376 862595856 862569332 862454355 862261355 862156689 862085819
2525 862085819 861915052 861749172 861706138 861674428 861535430 861387074 861332774 861253142 861036420 860819459 860741198
2547.4 860741198 860682607 860516727 860358298 860305548 860233426 860038340 859833360 859712124 859580696 859406233
2567.8 859406233 859271944 859161794 858961463 858668983 858430326 858269393 858050346 857741117 857465148 857274532
2588.2 857274532 857061684 856794059 856568694 856360197 856066942 855736017 855459869 855214000 854919195 854608476
2608.6 854608476 854356468 854102492 853765368 853397548 853105843 852854013 852538943 852205694 851911247 851593673
2629 851593673 851231873 850919545 850666642 850362659 850015581 849732041 849489868 849183440 848824739 848499179
2649.4 848499179 848204374 847888887 847565234 847274959 846992910 846682131 846363962 846079648 845820904 845546246
2669.8H45546246k90931k67505k09868k14637k79069l02493k94209k71201k51233k47717
2690.2H42917383k57790k83063k94864k85089k86222l34143l98517m09007l78430l90827
2710.6H39599431m42446m33564l92795m05311m11570l68774l33190l78192m61459m18782
2731H35553348k92778k31326k20477k28405k52307k68101k70069k68340l04520m10140
2751.4H32806885m58598l91662l88443m51386m15862l55840m43160n73397n58138m64678
2771.8H28305721m50074n60284o62863o53088o61135p30693p06673o24836o94275q56459
2792.2H21705341q68022p79212q25762r73702j029312j019419j050949j073122j127481
2810.5H12958360j306773j463711j491785j497984j610160j865089k141416k377808
$$ plain form
2669.8 845546246 845255315 844987810 844777942 844563305 844284236 843981743 843687534 843416333 843165100 842917383
2690.2 842917383 842659593 842376530 842081666 841796577 841510355 841176212 840777695 840368688 839990258 839599431
2710.6 839599431 839156985 838723421 838330626 837925315 837513745 837144971 836811781 836433589 835972130 835553348
2731 835553348 835260570 835029244 834808767 834580362 834328055 834059954 833789885 833521545 833217025 832806885
2751.4 832806885 832348287 831956625 831568182 831116796 830700934 830345094 829901934 829328537 828770399 828305721
2771.8 828305721 827855647 827295363 826632500 825979412 825318277 824587584 823880911 823256075 822561800 821705341
2792.2 821705341 820837319 820058107 819232345 818258643 817229331 816209912 815158963 814085841 812958360
2810.5 812958360 811651587 810187876 808696091 807198107 805587947 803722858 801581442 799203634
2826.8G99203634k735913l280341l935099m813611o071687p635713r268641j0923743
2843.1G50538886j2767077j4392853j4543950j2008012o734490l35515M780770P086813
2859.5G01624572O693244M735589K363503M16458m14789J89483J555682K388596K126873
2877.8G21679211J081347k93136j707673k979517l945708m577875m964292n185604
2894.1F99106753n301237n383313n545318n883575o396770p192373q471072j0194123
2910.4F44738972j2189805j4102400j5083909j4289558j1598467p409156k332389K802789
2926.8E70536077P059455R836018J1362374J2124538J2139797J1243999R530783P197440
2943.1F51030481M434109J621544o35624j719177j455724o7651K078593M350543O208717
$$ plain form
2826.8 799203634 796467721 793187380 789252281 784438670 778366983 770731270 761462629 750538886
2843.1 750538886 737771809 723378956 708835006 696826994 690092504 689756989 694537759 701624572
2859.5 701624572 708317816 713053405 715416908 715833366 715418577 715608060 717163742 719552338 721679211
2877.8 721679211 722760558 722467422 720759749 717780232 713834524 709256649 704292357 699106753
2894.1 699106753 693805516 688422203 682876885 676993310 670596540 663404167 654933095 644738972
2910.4 644738972 632549167 618446767 603362858 589073300 577474833 570065677 567733288 570536077
2926.8 570536077 577595532 587431550 598793924 610918462 623058259 634302258 643833041 651030481
2943.1 651030481 655464590 657086134 656450510 654731333 653275609 653207958 655286551 659637094 665845811
2961.4F65845811P552743Q474529Q954466Q826911Q118153P101535N998195N019545
2977.8G25891888M198373L399252K722025K234876J846016J571953J276613Q01980
2994.1G43942976L94046J29879j44959l43859m52041m63367k83003j07825k01165m55737
3014.5G42014945o21379o98686p67171p93934q49128r78887j034677r91165r73702
3032.8G34306216j124680j338422j312256j191974j276195j506507j659989j584709
3049.1G23311484j499891j574815j588404j576960j636982j590013j457632j399219
3065.5G10987568j465142j601815j657546j571417j416981j324057j436353j642048
3081.8F98872209j742125j784742j754939j701475j810908j904786j791119j672030
$$ plain form
2961.4 665845811 673398554 681873083 690827549 699654460 707772613 714874148 720872343 725891888
2977.8 725891888 730090261 733489513 736211538 738446414 740292430 741864383 743140996 743942976
2994.1 743942976 744337022 744466901 744321942 743978083 743526042 743062675 742779672 742671847 742470682 742014945
3014.5 742014945 741393566 740694880 739927709 739133775 738284647 737305760 736271083 735279918 734306216
3032.8 734306216 733181536 731843114 730530858 729338884 728062689 726556182 724896193 723311484
3049.1 723311484 721811593 720236778 718648374 717071414 715434432 713844419 712386787 710987568
3065.5 710987568 709522426 707920611 706263065 704691648 703274667 701950610 700514257 698872209
3081.8 698872209 697130084 695345342 693590403 691888928 690078020 688173234 686382115 684710085
3098.1F84710085j762211j943648j964152j873374j883804k007962k010107j878261
3114.4F69386566j905501k083183k292573k483249k498030k355636k258658k307892
3130.7F51201844k418041k422452k316236k318562k519309k669036k642513k600729
3147F31294966k558530k502024k631843k871454k918124k841592k816736k822280k815068
3165.4F06517315k811194k862215k927124k911210k849341k869129k928316k937138
3181.7E83421648k952219k971351k943396k920389k965272l014803l010750k980291
3198E59663177k930463k896964k903045k894520k882481k855003k781510k752066k768516
3216.4E33998609k770544k753794k724588k713322k696574k608359k486288k456844
$$ plain form
3098.1 684710085 682947874 681004226 679040074 677166700 675282896 673274934 671264827 669386566
3114.4 669386566 667481065 665397882 663105309 660622060 658124030 655768394 653509736 651201844
3130.7 651201844 648783803 646361351 644045115 641726553 639207244 636538208 633895695 631294966
3147 631294966 628736436 626234412 623602569 620731115 617812991 614971399 612154663 609332383 606517315
3165.4 606517315 603706121 600843906 597916782 595005572 592156231 589287102 586358786 583421648
3181.7 583421648 580469429 577498078 574554682 571634293 568669021 565654218 562643468 559663177
3198 559663177 556732714 553835750 550932705 548038185 545155704 542300701 539519191 536767125 533998609
3216.4 533998609 531228065 528474271 525749683 523036361 520339787 517731428 515245140 512788296
3232.7E12788296k524436k549946k506375k444685k347708k222657k183318k247006
3249D93762165k230167k126694k104580k158314k161294k099365k042950k013623j967162
3267.4D74858016j889199j926989k075225k140999k106070k048731k002060j980633
3283.7D58688110k010137k037406j982569j974136k084553k177865k202868k148867
3300D42069709k028942j950502k029419k244204k412379k429188k332031k237797k236187
3318.4D22169060k257795k203285k147645k250999k367199k319753k269298k213508
3334.7D04139578k095312k136498k296776k333075k318948k249569k069026k102464
3351C86537910k355546k412647k210826k035558k043545k040565j882941j787126j907975
$$ plain form
3232.7 512788296 510263860 507713914 505207539 502762854 500415146 498192489 496009171 493762165
3249 493762165 491531998 489405304 487300724 485142410 482981116 480881751 478838801 476825178 474858016
3267.4 474858016 472968817 471041828 468966603 466825604 464719534 462670803 460668743 458688110
3283.7 458688110 456677973 454640567 452657998 450683862 448599309 446421444 444218576 442069709
3300 442069709 440040767 438090265 436060846 433816642 431404263 428975075 426643044 424405247 422169060
3318.4 422169060 419911265 417707980 415560335 413309336 410942137 408622384 406353086 404139578
3334.7 404139578 402044266 399907768 397610992 395277917 392958969 390709400 388640374 386537910
3351 386537910 384182364 381769717 379558891 377523333 375479788 373439223 371556282 369769156 367861181
3369.3C67861181k097696k067178j797229j578778j489014j459270j378298j159102
3385.7C54834616q48830n64813n96941r05245r07451m56453j61528m63963q34435n74678
3406.1C48520279j10745j014l5107m2796j3918J31041K64973L46213N48542P81923
3426.5C50389391R12190R42766J050651J221180J114428Q53777R20207J293629J610279
3444.8C60308498J710147J647502J682192J840800J984418K154290K302140K252639
3461.1C75882626K222895K518565K760261K477914K035439K091438K470493K768815
3477.4C95228446K783924K520561K457917K698690K804845K783418K879381L002197
3493.8D17159379L087461L049314L025025L108650K975822K820581L035039L343999
$$ plain form
3369.3 367861181 365763485 363696307 361899078 360320300 358831286 357372016 355993718 354834616
3385.7 354834616 353985786 353420973 352824032 351918787 351011336 350554883 350393355 349929392 349094957 348520279
3406.1 348520279 348409534 348408520 348373413 348330617 348316699 348447740 348712713 349058926 349607468 350389391
3426.5 350389391 351301581 352244347 353294998 354516178 355630606 356484383 357404590 358698219 360308498
3444.8 360308498 362018645 363666147 365348339 367189139 369173557 371327847 373629987 375882626
3461.1 375882626 378105521 380624086 383384347 385862261 387897700 389989138 392459631 395228446
3477.4 395228446 398012370 400532931 402990848 405689538 408494383 411277801 414157182 417159379
3493.8 417159379 420246840 423296154 426321179 429429829 432405651 435226232 438261271 441605270
3510.1D41605270L485113L427595L288835L345877L576905L822356L776581L512352
3526.4D69840884L492117L695101L893494M061491M064232L938883M077941M376144
3542.7E01440287M455387M194319L992737M154265M361152M403890M492700M701435
3559E36196172M773855M652381M687369N094648N228877M966259M938662N158841N353988
3577.4E81051052N560875N741298N714118N650223N661249N613208N544602N702973
3593.7F26239598N945027O030440N994797N893767N748570N676984N869210N976200
3610F73374593N858302N759895N608559N694151N844533N406678M925132M886746N309105
3628.4G22667694N361199M719675M550755M579783M410505M266441M118740L904462
$$ plain form
3510.1 441605270 445090383 448517978 451806813 455152690 458729595 462551951 466328532 469840884
3526.4 469840884 473333001 477028102 480921596 484983087 489047319 492986202 497064143 501440287
3542.7 501440287 505895674 510089993 514082730 518236995 522598147 527002037 531494737 536196172
3559 536196172 540970027 545622408 550309777 555404425 560633302 565599561 570538223 575697064 581051052
3577.4 581051052 586611927 592353225 598067343 603717566 609378815 614992023 620536625 626239598
3593.7 626239598 632184625 638215065 644209862 650103629 655852199 661529183 667398393 673374593
3610 673374593 679232895 684992790 690601349 696295500 702140033 707546711 712471843 717358589 722667694
3628.4 722667694 728028893 732748568 737299323 741879106 746289611 750556052 754674792 758579254
3644.7G58579254L843784M042984L769278K985835K759457L036976K940774K523124
3661G84481466K278626K293587K369761K340198K201795J913786J615882J468122J505792
3679.4H02469015J601219J638890J703977J864910J631975J069069R72212J113832
3695.7H14065099J130938J056671R48012Q72016Q96335Q99851P70867O16014N95391
3714H21851194O20007N81921M90725M49419L89337K83778M36485O90818P18116M99726
3734.4H27011526K99751L32237L75211K68161K68281N14388M61578J45257R4831K92003
3754.8H30063224L30984K23637K08378K52902J82033J19567J48177J22905R5010K04026
3775.2H31950843L76940K95878N3703P7963J53840J00553J01745J90675K41399K01702
$$ plain form
3644.7 758579254 762423038 766466022 770235300 773221135 775980592 779017568 781958342 784481466
3661 784481466 786760092 789053679 791423440 793763638 795965433 797879219 799495101 800963223 802469015
3679.4 802469015 804070234 805709124 807413101 809278011 810909986 811979055 812951267 814065099
3695.7 814065099 815196037 816252708 817200720 818072736 818969071 819868922 820639789 821255803 821851194
3714 821851194 822471201 823053122 823543847 823993266 824382603 824666381 825102866 825793684 826511800 827011526
3734.4 827011526 827311277 827643514 828018725 828286886 828555167 829069555 829531133 829676390 829771221 830063224
3754.8 830063224 830394208 830617845 830826223 831079125 831261158 831380725 831528902 831651807 831746817 831950843
3775.2 831950843 832327783 832623661 832677364 832755327 832909167 833009720 833111465 833302140 833543539 833745241
3795.6H33745241J99557J38580m7505K265R5487K5094L6716J38640J95086K01941K56836
3818H34987938J08838j76250p6890O3180K4796N4836J42813K03192R8050r9659j15216
3840.5H35215628j22964r3937J05738K52367J71721k37167m02868L9339K01464J20818
3860.9H35250139M7624m7028n8830O617M6849J5139l5703R418O139Q881J36137M9412
3885.4H35434794j08599n9605q6844j22726M3392J75834O0260j05500j65880j91807
3905.7H34873319r2090J0908J3709K3604K8073K8730L9041l1591j11877n1618N6505
3928.2H34786713N6028J0312q941n2869k6405N2810J9908l159J0490k2471L636L2425
3952.7H34858477K1458P0095R6202K7299j7405k2709m6134j7405N4240P0036M4584
$$ plain form
3795.6 833745241 833944798 834083378 834035873 834038138 834133625 834158719 834195435 834334075 834529161 834731102 834987938
3818 834987938 835096776 834920526 834843636 834906816 834931612 834986448 835129261 835332453 835430503 835330844 835215628
3840.5 835215628 835092664 834998727 835104465 835356832 835528553 835291386 834888518 834927857 835129321 835250139
3860.9 835250139 835297763 835250735 835191905 835198522 835245371 835260510 835224807 835234225 835240364 835249245 835385382 835434794
3885.4 835434794 835326195 835266590 835179746 835057020 835100412 835276246 835336506 835231006 835065126 834873319
3905.7 834873319 834781229 834792137 834805846 834829450 834857523 834886253 834925294 834893703 834781826 834730208 834786713
3928.2 834786713 834842741 834853053 834844112 834791243 834764838 834817648 834837556 834834397 834844887 834822416 834826052 834858477
3952.7 834858477 834879935 834950030 835046232 835073531 835056126 835033417 834987283 834969878 835024118 835094154 835138738
3975.1H35138738M7863P6174J03593J02222N3585J4961j6690m4226k9087J5497R1970
3997.5H35554600
$$ plain form
3975.1 835138738 835186601 835262775 835366368 835468590 835522175 835537136 835520446 835476220 835447133 835462630 835554600
3997.5 835554600
##END=$$ End of the data block
