##TITLE=$$ Begin of the data block
##JCAMP-DX=5.00 $$ ACD/SpecManager v 10.08
##SPECTROMETER/DATA SYSTEM=Alpha
##DATE=14 Apr 2014 11:23:48
##DATA TYPE=INFRARED SPECTRUM
##DATA CLASS=XYDATA
##ORIGIN=
##OWNER=
##NPOINTS=1765
##FIRSTX=399.75695801
##LASTX=3997.56933594
##MAXX=3997.56933594
##MINX=399.75695801
##MAXY=0.86997336
##MINY=0.34946898
##XFACTOR=1.0000000000
##YFACTOR=1.000000000000000e-9
##FIRSTY=0.68903863
##DELTAX=2.03957629
##XUNITS=1/CM
##YUNITS=ARBITRARY UNITS
##XYDATA=(X++(Y..Y))
$$ plain form
399.8 689038634 687294841 685641170 684959233 684113324 682244599 681088746 681543350 682086051 681523144
418.1 681523144 680297732 679249346 678057551 677030087 677017868 677536249 677156448 675780237 674783587
436.5 674783587 674559593 674238145 673705101 673664808 673760533 673174143 672732472 673161805 673251987 672194719
456.9 672194719 671148658 671085477 670933187 669922709 669044614 668731809 667909980 666440427 665771365
475.2 665771365 665659904 664525211 663248301 663402438 663647771 662556708 661532581 661680579 661484182
493.6 661484182 660002112 658935249 658948004 658211529 656577885 655944169 655987084 654872298 653250813
511.9 653250813 652926862 652779043 651005328 649102867 648650706 647980094 645819247 644163370 644016683
530.3 644016683 643243968 641233087 640141487 640211046 639317989 637625337 637202322 637479186 636388242
$$ packed form
399.8F89038634j743793j653671o81937q45909j868725j155853M54604N42701n62907
418.1F81523144j225412j048386j191795j027464j2219N18381l79801j376211r96650
436.5F74783587k23994l21448n33044m0293R5725n86390m41671M29333R0182j057268
456.9F72194719j046061o3181j52290j010478q78095l12805q21829j469553o69062
475.2F65771365j11461j134693j276910J54137K45333j091063j024127J47998j96397
493.6F61484182j482070j066863J2755p36475j633644o33716M2915j114786j621485
511.9F53250813l23951j47819j773715j902461m52161o70612k160847j655877j46687
530.3F44016683p72715k010881j091600O9559q93057j692652m23015K76864j090944
$$ plain form
548.6 636388242 634730637 634281516 633901834 632078588 630214214 629525661 628383517 625899971 623819828
567 623819828 622678339 620701075 617730916 615623713 614438772 612537563 610169768 608743548 607663333
585.4 607663333 605701268 603576005 602352798 601187110 599164903 597280443 596204519 594683707
601.7 594683707 592224717 590569377 590523183 590634227 589977801 589530647 590277970 592092991 594778359
620 594778359 598527491 602895916 606736362 610029876 613696635 617500067 620414674 622708082 625208318
638.4 625208318 627311051 628013849 628431857 630622149 633982718 635980725 635946333 635549009 636826932
656.7 636826932 640678227 646167815 651649594 655717254 658417940 661425233 664861977 667719424
673.1 667719424 669982731 672376454 675332844 677921891 679596066 681402683 683818519 685639560
$$ packed form
548.6F36388242j657605m49121l79682j823246j864374o88553j142144k483546k080143
567F23819828j141489j977264k970159k107203j184941j901209k367795j426220j080215
585.4F07663333j962065k125263j223207j165688k022207j884460j075924j520812
601.7E94683707k458990j655340m6194J11044o56426m47154P47323J815021K685368
620E94778359L749132M368425L840446L293514L666759L803432K914607K293408K500236
638.4F25208318K102733P02798M18008K190292L360569J998007l4392l97324J277923
656.7F36826932L851295N489588N481779M067660K700686L007293L436744K857447
673.1F67719424K263307K393723K956390K589047J674175J806617K415836J821041
$$ plain form
689.4 685639560 686496913 687570214 689122021 689956367 690053523 690913498 692677021 693900824 694654167
707.7 694654167 696346343 698574781 699864268 700668752 702296197 704159617 705330431 706879795 709703863
726.1 709703863 712333679 713631809 715050220 717527986 719427526 719890594 720723450 722735286 724235952
744.4 724235952 724790096 726192951 728553593 729973793 730616212 732343018 734663785 735699832 736159742
762.8 736159742 737826884 739802957 740346849 740473270 741678953 742559612 741699040 740712345 740796149
781.2 740796149 740359187 738809407 738147318 739180207 740346313 741430163 744237125 748729229 752798438
799.5 752798438 756263614 760655820 765375078 768519223 770577788 773187757 775616467 776389301 776369154
817.9 776369154 776765108 776424348 774180889 771258891 768749833 765626431 761340797 757431865 754670799
$$ packed form
689.4F85639560Q57353J073301J551807Q34346R7156Q59975J763523J223803P53343
707.7F94654167J692176K228438J289487Q04484J627445J863420J170814J549364K824068
726.1G09703863K629816J298130J418411K477766J899540M63068Q32856K011836J500666
744.4G24235952N54144J402855K360642J420200O42419J726806K320767J036047M59910
762.8G36159742J667142J976073N43892J26421J205683Q80659q60572r86695Q3804
781.2G40796149m36962j549780o62089J032889J166106J083850K806962M492104M069209
799.5G52798438L465176M392206M719258L144145K058565K609969K428710P72834k0147
817.9G76369154L95954l40760k243459k921998k509058l123402m285634l908932k761066
$$ plain form
836.2 754670799 751798093 748337209 745453775 743488610 741668642 740353525 740916610 743497193 747113168
854.6 747113168 751756787 757989347 765030921 771602094 777794182 784183800 790126681 794682562
870.9 794682562 798256516 801623881 804337502 805657148 805975556 806005418 805431068 803774655 801741898
889.3 801741898 800216019 799005806 797780216 797167242 797757506 798885643 799729109 800571918 801692128
907.6 801692128 802308738 801770508 800520420 798934877 796543419 793246448 790044785 787690759 785862386
926 785862386 784482300 784228742 785005748 785644889 785789907 786268294 787120223 787377059 786969721 786718726
946.4 786718726 786400676 784931481 782382548 779575348 776055038 770804703 764227033 757091880 748747766
964.7 748747766 738434851 726909220 715230703 703450859 691774249 681372225 672789633 665185452
$$ packed form
836.2G54670799k872706l460884k883434j965165j819968j315117N63085K580583L615975
854.6G47113168M643619O232560P041574O571173O192088O389618N942881M555881
870.9G94682562L573954L367365K713621J319646L18408K9862n74350j656413k032757
889.3H01741898j525879j210213j225590o12974N90264J128137Q43466Q42809J120210
907.6H01692128O16610n38230j250088j585543k391458l296971l201663k354026j828373
926G85862386j380086k53558P77006O39141J45018M78387Q51929K56836m07338k50995
946.4G86718726l18050j469195k548933k807200l520310n250335o577670p135153q344114
964.7G48747766j0312915j1525631j1678517j1779844j1676610j0402024q582592p604181
$$ plain form
981 665185452 658050418 651878953 646687567 641712725 636876285 632942915 629977643 627200782 624518931
999.4 624518931 622496307 620835781 618553281 615435302 611915827 607878208 602958083 597612977
1015.7 597612977 592589915 587848127 583113730 578756869 575102687 571711898 568201602 564925671
1032 564925671 562181532 559658766 557211637 555217385 553694069 552068651 550099552 548117578 546253800
1050.4 546253800 544412911 542999625 542688787 543531656 544907808 546245515 547146857 547023356 545353353
1068.7 545353353 542344034 538759947 535123408 531614661 528417051 525622666 522886634 519674659
1085 519674659 515863001 511729360 507605910 503997087 501626372 500873208 501475930 502887189 504687309
1103.4 504687309 506579161 508250773 509389520 509768844 509206116 507364810 503741860 498253167 492131412
$$ packed form
981F65185452p135034o171465n191386m974842m836440l933370k965272k776861k681851
999.4F24518931k022624j660526k282500l117979l519475m037619m920125n345106
1015.7E97612977n023062m741788m734397m356861l654182l390789l510296l275931
1032E64925671k744139k522766k447129j994252j523316j625418j969099j981974j863778
1050.4E46253800j840889j413286l10838Q42869J376152J337707R01342j23501j670003
1068.7E45353353l009319l584087l636539l508747l197610k794385k736032l211975
1085E19674659l811658m133641m123450l608823k370715p53164O02722J411259J800120
1103.4E04687309J891852J671612J138747L79324n62728j841306l622950n488693o121755
$$ plain form
1121.8 492131412 487729043 486392081 487261146 488906443 490143239 490379930 490683913 492473960 495726496
1140.1 495726496 499475807 502978265 505987644 508458316 510425031 512200296 514231682 516667068
1156.4 516667068 519577265 523334622 528329492 534560025 541788518 549810708 558314085 566781223
1172.7 566781223 574816048 582409084 589584231 596039534 601502597 605941117 609073758 610401809
1189.1 610401809 610025048 608737946 607249379 606018126 605726302 606936574 609301925 611959457 614523470
1207.4 614523470 616932273 618807971 619866014 620485544 621125579 621687293 622061610 622643530 623705566
1225.8 623705566 624984860 626372159 628199697 630503356 632847548 635096729 637518823 639999986
1242.1 639999986 642070889 643680930 645070672 646116793 646565139 646663308 646910310 647385418 648005128
$$ packed form
1121.8D92131412m402369j336962Q69065J645297J236796K36691L03983J790047L252536
1140.1D95726496L749311L502458L009379K470672J966715J775265K031386K435386
1156.4E16667068K910197L757357M994870O230533P228493Q022190Q503377Q467138
1172.7E66781223Q034825P593036P175147O455303N463063M438520L132641J328051
1189.1F10401809l76761j287102j488567j231253k91824J210272K365351K657532K564013
1207.4F14523470K408803J875698J058043O19530O40035N61714L74317N81920J062036
1225.8F23705566J279294J387299J827538K303659K344192K249181K422094K481163
1242.1F39999986K070903J610041J389742J046121M48346R8169K47002M75108O19710
$$ plain form
1260.4 648005128 649068713 650832295 653121233 655773282 658933818 662667751 666727722 670961380
1276.8 670961380 675484538 680291593 685148478 690012515 695102155 700403750 705611289 710612357
1293.1 710612357 715426445 719882727 723868847 727515280 730901182 733946741 736630797 739046931
1309.4 739046931 741213918 743045449 744595110 746022344 747327387 748506725 749709725 750931501
1325.7 750931501 751953006 752702415 753259122 753577769 753638029 753609598 753646135 753730834 753848135 754119873
1346.1 754119873 754536688 754818857 754855752 754818797 754656553 754083574 752928317 751161873 749094605
1364.5 749094605 747206032 745570779 743958592 741803646 738838255 736313343 735364854 735194564 734819591
1382.8 734819591 734955728 736148059 737148225 737270176 737105370 736762166 735794067 734116256 732316375
$$ packed form
1260.4F48005128J063585J763582K288938K652049L160536L733933M059971M233658
1276.8F70961380M523158M807055M856885M864037N089640N301595N207539N001068
1293.1G10612357M814088M456282L986120L646433L385902L045559K684056K416134
1309.4G39046931K166987J831531J549661J427234J305043J179338J203000J221776
1325.7G50931501J021505P49409N56707L18647O0260k8431L6537Q4699J17301K71738
1346.1G54119873M16815K82169L6895l6955j62244n72979j155257j766444k067268
1364.5G49094605j888573j635253j612187k154946k965391k524912r48489j70290l74973
1382.8G34819591J36137J192331J000166J21951j64806l43204r68099j677811j799881
$$ plain form
1401.2 732316375 730605364 728471994 726091385 724074543 722278893 720419705 718839347 717719793
1417.5 717719793 716486216 715093374 714081347 713445783 712769091 711628258 710437655 709782362 709124327
1435.9 709124327 708059847 707382500 707203150 706934810 706606209 706635892 706970096 707276404 708008945 710345507
1456.2 710345507 714187026 717775762 721577048 726727188 733171821 740783393 750624716 762656391
1472.6 762656391 772859216 779585063 784897387 789746463 793663740 796270788 798145235 799478352
1488.9 799478352 799717426 799209356 798724234 798013031 796480417 794638157 793319643 792026103 789049506
1507.2 789049506 785395741 782548606 780128896 777836919 775778055 774240673 772621989 770545065
1523.6 770545065 768578708 766837001 765399218 764074743 762544632 761400998 760870099 759984136 758507431
$$ packed form
1401.2G32316375j711011k133370k380609k016842j795650j859188j580358j119554
1417.5G17719793j233577j392842j012027o35564o76692j140833j190603o55293o58035
1435.9G09124327j064480o77347j79350k68340l28601K9683L34204L06308P32541K336562
1456.2G10345507L841519L588736L801286N150140O444633P611572R841323J2031675
1472.6G62656391J0202825O725847N312324M849076L917277K607048J874447J333117
1488.9G99478352K39074n08070m85122p11203j532614j842260j318514j293540k976597
1507.2G89049506l653765k847135k419710k291977k058864j537382j618684k076924
1523.6G70545065j966357j741707j437783j324475j530111j143634n30899q85963j476705
$$ plain form
1541.9 758507431 757381141 756599605 756165445 756136715 756443799 756936312 757571161 757876754 756827831
1560.3 756827831 755431831 754129171 752647042 750611961 747519076 744192123 740661263 735604703
1576.6 735604703 729983449 724663079 719021857 713017881 706597269 699797571 692829132 685762525
1592.9 685762525 678381205 670823872 663438499 656192958 648917854 641700923 634627342 627497196
1609.2 627497196 620417237 613840222 607173443 599748671 593541384 588513672 583286703 578344524
1625.5 578344524 574023426 570338786 567918301 566558123 565525889 565224826 566179812 568211973 571117401
1643.9 571117401 575248837 580212414 584757090 590278327 597545803 603447735 608808339 615000427
1660.2 615000427 622187734 629641712 636438251 643571675 651403606 658616543 665791154 673248172
$$ packed form
1541.9G58507431j126290p81536m34160k8730L07084M92513O34849L05593j048923
1560.3G56827831j396000j302660j482129k035081l092885l326953l530860n056560
1576.6G35604703n621254n320370n641222o003976o420612o799698o968439p066607
1592.9F85762525p381320p557333p385373p245541p275104p216931p073581p130146
1609.2F27497196p079959o577015o666779p424772o207287n027712n226969m942179
1625.5E78344524m321098l684640k420485j360178j032234l01063R54986K032161K905428
1643.9E71117401M131436M963577M544676N521237P267476N901932N360604O192088
1660.2F15000427P187307P453978O796539P133424P831931P212937P174611P457018
$$ plain form
1676.5 673248172 680212915 687116623 694693804 703232110 710709751 717170298 723656833 729757428
1692.8 729757428 736527085 743907571 750860214 758028328 764115512 769222975 773865640 777791381
1709.2 777791381 781635344 785506010 789205730 792853653 795952022 798226297 800167143 802271307
1725.5 802271307 804672897 807195663 809695721 812605560 815525532 817947030 820536971 823520422
1741.8 823520422 826663435 829699397 832615256 835536838 838115036 840022027 841723621 843537986
1758.1 843537986 845224440 846531987 847603023 848876715 850258112 851406693 852289379 853021145 853646874
1776.5 853646874 854256809 855000198 855870485 856620908 857185960 857897878 858816028 859505355 859857559 860346794
1796.9 860346794 861011684 861505866 861785948 862147331 862647057 863088191 863410413 863729477 864100158 864397228
$$ packed form
1676.5F73248172O964743O903708P577181Q538306P477641O460547O486535O100595
1692.8G29757428O769657P380486O952643P168114O087184N107463M642665L925741
1709.2G77791381L843963L870666L699720L647923L098369K274275J940846K104164
1725.5H02271307K401590K522766K500058K909839K919972K421498K589941K983451
1741.8H23520422L143013L035962K915859K921582K578198J906991J701594J814365
1758.1H43537986J686454J307547J071036J273692J381397J148581Q82686P31766O25729
1776.5H53646874O09935P43389Q70287P50423N65052P11918R18150O89327L52204M89235
1796.9H60346794O64890M94182K80082L61383M99726M41134L22222L19064L70681K97070
$$ plain form
1817.2 864397228 864643216 864980102 865380228 865699530 865972817 866232932 866380811 866494536 866639912 866826415
1837.6 866826415 867094636 867432177 867688358 867788017 867878556 867979586 868047476 868169188 868368685 868508518
1858 868508518 868568838 868701756 868986130 869271696 869352043 869285405 869308710 869377434 869386494 869467437 869625986
1880.5 869625986 869661510 869606793 869709849 869892895 869891465 869814157 869868219 869937420 869830132 869698107 869777024
1902.9 869777024 869921744 869888484 869797409 869868636 869973361 869917393 869832337 869886160 869896948 869701266 869560361
1925.3 869560361 869647205 869644403 869422615 869318068 869410038 869376302 869196534 869165361 869205534 868995547 868661702
1947.8 868661702 868575156 868645489 868498385 868209660 868111491 868099451 867866039 867596209 867591381 867590427 867295265
1970.2 867295265 867021024 867038846 867025256 866749704 866514742 866520166 866490304 866266787 866121769 866175711 866077244
$$ packed form
1817.2H64397228K45988L36886M00126L19302K73287K60115J47879J13725J45376J86503
1837.6H66826415K68221L37541K56181R9659R0539J01030O7890J21712J99497J39833
1858H68508518O0320J32918K84374K85566Q0347o6638K3305O8724R060Q0943J58549
1880.5H69625986L5524n4717J03056J83046j430p7308N4062O9201j07288j32025P8917
1902.9H69777024J44720l3260r1075P1227J04725n5968q5056N3823J0788j95682j40905
1925.3H69560361Q6844k802k21788j04547R1970l3736j79768l1173M0173k09987l33845
1947.8H68661702q6546P0333j47104k88725r8169j2040k33412k69830m828r54k95162
1970.2H67295265k74241J7822j3590k75552k34962N424k9862k23517j45018N3942r8467
$$ plain form
1992.6 866077244 865708053 865458608 865445673 865342081 865043283 864861608 864856303 864696562 864352286 864176631
2013 864176631 864184082 864008904 863677442 863532484 863499105 863263547 862940252 862845600 862874627 862701654 862422824
2035.5 862422824 862345517 862346828 862138033 861867130 861815810 861802399 861601949 861428261 861474931 861494720 861271024
2057.9 861271024 861052573 861062527 861070931 860867500 860698044 860751152 860781908 860640883 860570490 860671461 860682786
2080.3 860682786 860516787 860461891 860602319 860598028 860370457 860289335 860434055 860438526 860285521 860322297 860503316
2102.8 860503316 860484362 860298216 860325098 860523462 860504210 860349953 860444605 860675812 860650480 860514879
2123.2 860514879 860647142 860851765 860804737 860735893 860913575 861087620 861000896 860937953 861139476 861290693
2143.6 861290693 861200213 861201882 861451805 861597121 861498177 861524403 861791074 861916184 861812115 861862779 862122118
$$ packed form
1992.6H66077244l69191k49445j2935j03592k98798j81675n305j59741l44276j75655
2013H64176631P451j75178l31462j44958l3379k35558l23295r4652K9027j72973k78830
2035.5H62422824p7307J311k08795k70903n1320j3411k00450j73688M6670J9789k23696
2057.9H61271024k18451R954Q404k03431j69456N3108L0756j41025p0393J00971J1325
2080.3H60682786j65999n4896J40428m291k27571q1122J44720M471j53005L6776J81019
2102.8H60503316j8954j86146K6882J98364j9252j54257R4652K31207k5332j35601
2123.2H60514879J32263K04623m7028o8844J77682J74045q6724o2943K01523J51217
2143.6H61290693r0480J669K49923J45316r8944K6226K66671J25110j04069N0664K59339
$$ plain form
2166 862122118 862208068 862123549 862248540 862524867 862575948 862498045 862652004 862899423 862905681 862832129 863004386
2188.4 863004386 863252401 863245845 863164783 863310635 863477647 863416016 863358378 863505602 863624156 863544464 863518417
2210.9 863518417 863703489 863808632 863710523 863698006 863837659 863864005 863732696 863699317 863810539 863838911
2231.3 863838911 863746524 863726079 863783181 863745213 863655090 863692880 863784134 863728762 863599360 863575220 863574684 863470316
2255.8 863470316 863370895 863389909 863425553 863358438 863289952 863353908 863469958 863488853 863429666 863432050 863521814
2278.2 863521814 863597214 863602698 863596201 863616288 863592148 863496125 863440990 863473535 863450408 863325357 863241315 863200903
2302.7 863200903 863069415 862881303 862759590 862688899 862578511 862461865 862397373 862247169 861932933 861673594
2323.1 861673594 861596107 861518919 861362398 861208439 861074805 860905349 860703588 860642552 860796630 861066878
$$ packed form
2166H62122118Q5950q4519J24991K76327N1081p7903J53959K47419O258p3552J72257
2188.4H63004386K48015o556q1062J45852J67012o1631n7638J47224J18554p9692k6047
2210.9H63518417J85072J05143r8109j2517J39653K6346j31309l3379J11222K8372
2231.3H63838911r2387k0445N7102l7968r0123L7790R1254n5372j29402k4140n36j04368
2255.8H63470316r9421J9014L5644o7115o8486O3956J16050J8895n9187K384Q9764
2278.2H63521814P5400N484o497K0087k4140r6023n5135L2545k3127j25051q4042m0412
2302.7H63200903j31488j88112j21713p0691j10388j16646o4492j50204l14236k59339
2323.1H61673594p7487p7188j56521j53959j33634j69456k01761o1036J54078K70248
$$ plain form
2343.5 861066878 861490607 862027526 862306297 862007916 861215651 860460401 860013306 859734416 859757602 860291243
2363.8 860291243 861060679 861653805 862147093 862861216 863627017 864145637 864594102 865218759 865845799 866178572
2384.2 866178572 866325498 866573751 866808474 866766989 866629541 866707981 866837204 866750419 866646349 866750419
2404.6 866750419 866842330 866744459 866689682 866787791 866776526 866600454 866575837 866725802 866706312 866498709 866425395
2427.1 866425395 866537452 866524935 866318882 866243184 866334081 866279602 866103530 866074443 866116762 865972996 865748644
2449.5 865748644 865719795 865771532 865640938 865459800 865443826 865446150 865293086 865136743 865142822 865142763 864971042
2471.9 864971042 864808917 864784479 864717364 864528477 864409089 864400089 864286065 864061475 863950133 863942623 863843501
2494.4 863843501 863658786 863579869 863593996 863479316 863266170 863167524 863143206 863038421 862879515 862772942
$$ packed form
2343.5H61066878M23729N36919K78771k98381p92265p55250m47095k78890K3186N33641
2363.8H60291243P69436N93126M93288P14123P65801N18620M48465O24657O27040L32773
2384.2H66178572J46926K48253K34723m1485j37448P8440J29223q6785j04070J04070
2404.6H66750419R1911r7871n4777R8109j1265j76072k4617J49965j9490k07603p3314
2427.1H66425395J12057j2517k06053p5698R0897n4479j76072k9087M2319j43766k24352
2449.5H65748644k8849N1737j30594j81138j5974K324j53064j56343O079n9j71721
2471.9H64971042j62125k4438o7115j88887j19388r000j14024k24590j11342p510r9122
2494.4H63843501j84715p8917J4127j14680k13146r8646k4318j04785j58906j06573
$$ plain form
2514.8 862772942 862711251 862588167 862422168 862339377 862293005 862163663 862001777 861912787 861851633 861714005
2535.2 861714005 861552358 861460209 861365736 861198843 861054063 860987723 860895097 860709369 860546529 860479295
2555.6 860479295 860365093 860138655 859948933 859857917 859750688 859584749 859437525 859295428 859064043 858771741
2576 858771741 858538628 858373702 858179390 857928514 857691884 857501328 857273221 856979489 856726587 856505334
2596.4 856505334 856216490 855904281 855651498 855421364 855127752 854803264 854553223 854314446 853951454 853548169
2616.8 853548169 853263736 853039920 852729976 852382720 852104187 851822555 851470113 851140916 850867152 850545108
2637.1 850545108 850196183 849917769 849664450 849347770 848984122 848658562 848376751 848088682 847790718 847491622
2657.5 847491622 847191453 846872866 846535325 846236885 845972180 845682323 845398009 845171034 844990969 844779313
$$ packed form
2514.8H62772942o1691j23084j65999q2791m6372j29342j61886q8990o1154j37628
2535.2H61714005j61647r2149r4473j66893j44780o6340r2626j85728j62840o7234
2555.6H60479295j14202k26438j89722r1016j07229j65939j47224j42097k31385k92302
2576H58771741k33113j64926j94312k50876k36630j90556k28107k93732k52902k21253
2596.4H56505334k88844l12209k52783k30134k93612l24488k50041k38777l62992m03285
2616.8H53548169k84433k23816l09944l47256k78533k81632l52442l29197k73764l22044
2637.1H50545108l48925k78414k53319l16680l63648l25560k81811k88069k97964k99096
2657.5H47491622l00169l18587l37541k98440k64705k89857k84314k26975j80065k11656
$$ plain form
2677.9 844779313 844491541 844182014 843883514 843587935 843305051 843049109 842803955 842528522 842240632 841983736
2698.3 841983736 841718137 841403604 841042995 840644777 840231478 839797556 839353621 838962436 838598490 838174701
2718.7 838174701 837717950 837305665 836947262 836565673 836125493 835761070 835524499 835299253 835050285 834830761
2739.1 834830761 834626079 834354699 834031820 833744884 833439350 833013475 832551301 832181871 831846714 831413209
2759.5 831413209 830923557 830504000 830088019 829573333 829045177 828583717 828114688 827508211 826795399 826119125
2779.9 826119125 825468838 824755490 824042916 823408246 822724342 821888685 821030617 820256531 819448531 818493366
2800.3 818493366 817468286 816446602 815377116 814252794 813120604 811891437 810455501 808905602
2816.6 808905602 807382882 805798709 803943992 801818132 799491167 796778619 793456852 789466739
$$ packed form
2677.9H44779313k87772l09527k98500k95579k82884k55942k45154k75433k87890k56896
2698.3H41983736k65599l14533l60609l98218m13299m33922m43935l91185l63946m23789
2718.7H38174701m56751m12285l58403l81589m40180l64423k36571k25246k48968k19524
2739.1H34830761k04682k71380l22879k86936l05534m25875m62174l69430l35157m33505
2759.5H31413209m89652m19557m15981n14686n28156m61460m69029o06477p12812o76274
2779.9H26119125o50287p13348p12574o34670o83904q35657q58068p74086q08000r55165
2800.3H18493366j025080j021684j069486j124322j132190j229167j435936j549899
2816.6H08905602j522720j584173j854717k125860k326965k712548l321767l990113
$$ plain form
2832.9 789466739 784641206 778597414 770977497 761680007 750706851 737921417 723556042 709044278
2849.3 709044278 697036386 690277934 689931571 694725752 701825321 708523393 713265717 715641141
2865.6 715641141 716069341 715673447 715879798 717413843 719766259 721893787 723005354 722741306 721037328
2883.9 721037328 718031585 714059591 709473252 704522133 699370623 694100738 688707650 683116794
2900.2 683116794 677213788 670822203 663623869 655172884 645031333 632863700 618729711 603610337
2916.6 603610337 589322329 577731967 570318043 567992687 570805609 577861607 587690532 599056602
2932.9 599056602 611195862 623319030 634512603 644033730 651284993 655780077 657410443 656731904
2949.2 656731904 654977262 653528273 653491080 655579925 659896612 666067183 673634231 682174444 691161096
$$ packed form
2832.9G89466739m825533o043792p619917r297490j0973156j2785434j4365375j4511764
2849.3G09044278j2007892o758452l46363M794181P099569O698072M742324K375424
2865.6G15641141M28200l95894K06351J534045K352416K127528J111567k64048j703978
2883.9G21037328l005743l971994m586339m951119n151510n269885n393088n590856
2900.2F83116794n903006o391585p198334q450985j0141551j2167633j4133989j5119374
2916.6F03610337j4288008j1590362p413924k325356K812922P055998R828925J1366070
2932.9E99056602J2139260J2123168J1193573R521127P251263M495084J630366o78539
2949.2F56731904j754642j448989l7193K088845M316687O170571P567048Q540213Q986652
$$ plain form
2967.6 691161096 699946761 708026588 715122461 721140444 726202369 730429590 733826697 736505330
2983.9 736505330 738684952 740511596 742091596 743375659 744180202 744604230 744784653 744665504 744322121
3002.2 744322121 743864954 743406057 743137121 743038952 742824912 742343664 741703629 740993500 740238369 739475846
3022.6 739475846 738653541 737680674 736630917 735619724 734637797 733526289 732204080 730919600 729769111
3041 729769111 728494942 726954639 725283086 723715663 722239733 720709264 719175279 717620909 715965569
3059.3 715965569 714344800 712864280 711428344 709904253 708254874 706602335 705079794 703692555
3075.6 703692555 702367067 700938702 699326396 697619557 695851803 694094598 692399859 690607071
3092 690607071 688711107 686914206 685229421 683462739 681520939 679542124 677652180 675783992 673811913
$$ packed form
2967.6F91161096Q785665Q079827P095873O017983N061925M227221L397107K678633
2983.9G36505330K179622J826644J580000J284063Q04543M24028J80423j19149l43383
3002.2G44322121m57167m58897k68936r8169k14040m81248o40035p10129p55131p62523
3022.6G39475846q22305r72867j049757j011193r81927j111508j322209j284480j150489
3041G29769111j274169j540303j671553j567423j475930j530469j533985j554370j655340
3059.3G15965569j620769j480520j435936j524091j649379j652539j522541j387239
3075.6G03692555j325488j428365j612306j706839j767754j757205j694739j792788
3092F90607071j895964j796901j684785j766682j941800j978815j889944j868188j972079
$$ plain form
3110.3 673811913 671809912 669908404 667980254 665875494 663565099 661073446 658576548 656247318
3126.6 656247318 654031575 651740968 649303794 646852612 644510865 642183125 639683068 637027800
3143 637027800 634362936 631733477 629176497 626708567 624124467 621278167 618355572 615510285 612699449
3161.3 612699449 609883964 607076764 604267299 601420164 598547578 595670104 592775404 589847326
3177.6 589847326 586897373 583950400 581009030 578064501 575148523 572254479 569292009 566264093
3193.9 566264093 563265085 560308039 557366073 554446161 551550269 548692465 545857191 543025851
3210.3 543025851 540234149 537471354 534689963 531907737 529172778 526457012 523715079 520988762
3226.6 520988762 518372834 515918612 513535261 511032820 508428812 505906701 503506720 501197219
$$ packed form
3110.3F73811913k002001j901508j928150k104760k310395k491653k496898k329230
3126.6F56247318k215743k290607k437174k451182k341747k327740k500057k655268
3143F37027800k664864k629459k556980k467930k584100k846300k922595k845287k810836
3161.3F12699449k815485k807200k809465k847135k872586k877474k894700k928078
3177.6E89847326k949953k946973k941370k944529k915978k894044k962470l027916
3193.9E66264093k999008k957046k941966k919912k895892k857804k835274k831340
3210.3E43025851k791702k762795k781391k782226k734959k715766k741933k726317
3226.6E20988762k615928k454222k383351k502441k604008k522111k399981k309501
$$ plain form
3242.9 501197219 498946548 496698439 494419068 492182344 490070164 487990916 485841393 483700246
3259.2 483700246 481658876 479627848 477536678 475505680 473618776 471716434 469653487 467520416
3275.5 467520416 465436310 463393182 461353183 459324896 457298070 455269426 453309268 451392114
3291.8 451392114 449382126 447253227 445050776 442871243 440837204 438915789 436924040 434681982
3308.2 434681982 432223827 429784685 427480996 425240010 423007309 420788348 418595016 416381687
3324.5 416381687 414037585 411644280 409379095 407187313 405014873 402915448 400781214 398512334
3340.8 398512334 396207750 393909723 391673863 389601469 387478352 385112584 382723987 380534530
3357.1 380534530 378494382 376445472 374379933 372490495 370784104 368956625 366846561 364710957
$$ packed form
3242.9E01197219k250671k248109k279371k236724k112180k079248k149523k141147
3259.2D83700246k041370k031028k091170k030998j886904j902342k062947k133071
3275.5D67520416k084106k043128k039999k028287k026826k028644j960158j917154
3291.8D51392114k009988k128899k202451k179533k034039j921415j991749k242058
3308.2D34681982k458155k439142k303689k240986k232701k218961k193332k213329
3324.5D16381687k344102k393305k265185k191782k172440k099425k134234k268880
3340.8C98512334k304584k298027k235860k072394k123117k365768k388597k189457
3357.1C80534530k040148k048910k065539j889438j706391j827479k110064k135604
$$ plain form
3373.4 364710957 362882823 361336172 359870970 358408570 357019305 355834365 354971647 354419202 353828013
3391.8 353828013 352936774 352092206 351712376 351571143 351082057 350253195 349684477 349538445 349540293 349540561
3412.2 349540561 349494606 349468976 349620730 349914551 350264728 350797385 351568043 352490753 353438556 354449272
3432.6 354449272 355635554 356769264 357665718 358618498 359910816 361465424 363095999 364734977 366504461
3450.9 366504461 368424952 370411843 372521341 374760866 376963288 379194260 381738514 384477377
3467.2 384477377 386926681 388966382 391057491 393504947 396228164 398986399 401563853 404090762
3483.6 404090762 406789690 409564942 412324756 415171146 418123841 421172678 424236149 427320898
3499.9 427320898 430501401 433525264 436313182 439278603 442598164 446096033 449523568 452775508
$$ packed form
3373.4C64710957j828134j546651j465202j462400j389265j184940q62718n52445n91189
3391.8C53828013q91239q44568l79830j41233m89086q28862n68718j46032J848K68
3412.2C49540561m5955k5630J51754K93821L50177N32657P70658R22710R47803J010716
3432.6C54449272J186282J133710Q96454R52780J292318J554608J630575J638978J769484
3450.9C66504461J920491J986891K109498K239525K202422K230972K544254K738863
3467.2C84477377K449304K039701K091109K447456K723217K758235K577454K526909
3483.6D04090762K698928K775252K759814K846390K952695L048837L063471L084749
3499.9D27320898L180503L023863K787918K965421L319561L497869L427535L251940
$$ plain form
3516.2 452775508 456102937 459705979 463546783 467299908 470784217 474300414 478030294 481928200
3532.5 481928200 485998541 490095884 494050860 498131305 502526641 506920516 510973454 514926851
3548.8 514926851 519153416 523581982 528037548 532551289 537172794 541835129 546474338 551231742
3565.1 551231742 556396663 561662555 566631258 571544290 576662183 581959188 587460279 593168378
3581.5 593168378 598898709 604628980 610392511 616018534 621472776 627091825 633015633 639059246
3597.8 639059246 645055175 650926054 656696737 662456930 668381333 674364209 680225194 685978115
3614.1 685978115 691562831 697207034 702933133 708193123 713062763 718013346 723416686 728793681
3630.4 728793681 733464658 737958074 742487371 746858776 751107216 755250156 759214222 763109922
$$ packed form
3516.2D52775508L327429L603042L840804L753125L484309L516197L729880L897906
3532.5D81928200M070341M097343L954976M080445M395336M393875M052938L953397
3548.8E14926851M226565M428566M455566M513741M621505M662335M639209M757404
3565.1E51231742N164921N265892M968703M913032N117893N297005N501091N708099
3581.5E93168378N730331N730271N763531N626023N454242N619049N923808O043613
3597.8F39059246N995929N870879N770683N760193N924403N982876N860985N752921
3614.1F85978115N584716N644203N726099N259990M869640M950583N403340N376995
3630.4G28793681M670977M493416M529297M371405M248440M142940L964066L895700
$$ plain form
3646.7 763109922 767180741 770915091 773804784 776472092 779451251 782397628 784952700 787243545
3663 787243545 789550245 791946232 794315934 796518922 798433185 800094843 801575959 803007782 804525554
3681.4 804525554 806182325 807961464 809808433 811397910 812502742 813472748 814524114 815624714
3697.7 815624714 816723347 817705214 818536818 819392085 820334017 821208477 821882308 822438657 822945476
3716.1 822945476 823421299 823917150 824432552 824855208 825176120 825658679 826389432 827161431 827710092 828003883
3736.5 828003883 828246832 828569114 828921914 829244673 829668939 830069482 830193162 830240071 830475450 830768883
3756.9 830768883 830996811 831206083 831436336 831633031 831838727 832056403 832128048 832154989 832376301 832777202
3777.3 832777202 833066463 833113492 833156765 833251357 833300829 833385348 833603323 833905876 834190249 834471762
$$ packed form
3646.7G63109922M070819L734350K889693K667308K979159K946377K555072K290845
3663G87243545K306700K395987K369702K202988J914263J661658J481116J431823J517772
3681.4H04525554J656771J779139J846969J589477J104832R70006J051366J100600
3697.7H15624714J098633R81867Q31604Q55267R41932Q74460O73831N56349N06819
3716.1H22945476M75823M95851N15402M22656L20912M82559P30753P71999N48661K93791
3736.5H28003883K42949L22282L52800L22759M24266M00543J23680M6909K35379K93433
3756.9H30768883K27928K09272K30253J96695K05696K17676P1645K6941K21312M00901
3777.3H32777202K89261M7029M3273R4592M9472Q4519K17975L02553K84373K81513
$$ plain form
3797.7 834471762 834666252 834597051 834538400 834584177 834533691 834553003 834766209 834998846 835140705 835363805
3818 835363805 835515022 835354745 835249305 835300922 835336208 835411131 835611284 835892558 835995317 835822582
3838.4 835822582 835676789 835575819 835479498 835557580 835813463 836033046 835876048 835513830 835486412 835605681
3858.8 835605681 835681379 835725844 835749686 835770369 835730016 835627973 835585415 835613966 835697711 835753381 835767388
3881.3 835767388 835852981 835880697 835793853 835734487 835645080 835531056 835568488 835748911 835866928 835812271 835602462
3903.7 835602462 835365295 835276723 835259974 835229576 835248828 835309505 835365236 835403323 835383773 835269809 835158587
3926.1 835158587 835186720 835297525 835383952 835399151 835301876 835212886 835240185 835283816 835295081 835290611 835265338
3948.6 835265338 835247457 835246086 835272610 835344613 835396349 835400224 835427523 835457861 835446358 835453629 835505426 835551083
$$ packed form
3797.7H34471762J94490o9201n8651M5777n0486J9312K13206K32637J41859K23100
3818H35363805J51217j60277j05440N1617L5286P4923K00153K81274J02759j72735
3838.4H35822582j45793j00970r6321P8082K55883K19583j56998l62218k7418J19269
3858.8H35605681P5698M4465K3842K0683m0353j02043m2558K8551Q3745N5670J4007
3881.3H35767388Q5593K7716q6844n9366q9407j14024L7432J80423J18017n4657k09809
3903.7H35602462k37167q8572j6749l0398J9252O0677N5731L8087j9550j13964j11222
3926.1H35158587K8133J10805Q6427J5199r7275q8990K7299M3631J1265m470k5273
3948.6H35265338j7881j371K6524P2003N1736L875K7299L0338j1503P271N1797M5657
$$ plain form
3973.1 835551083 835559845 835566461 835603774 835669577 835762680 835824430 835834146 835849524 835867345 835859001 835863829 835948348
3997.5 835948348
$$ packed form
3973.1H35551083Q762O616L7313O5803R3103O1750R716J5378J7821q344M828Q4519
3997.5H35948348
##END=$$ End of the data block
