##TITLE=$$ Begin of the data block
##JCAMP-DX=5.00 $$ ACD/SpecManager v 10.08
##SPECTROMETER/DATA SYSTEM=Alpha
##DATE=14 Apr 2014 11:23:48
##DATA TYPE=INFRARED SPECTRUM
##DATA CLASS=XYDATA
##ORIGIN=
##OWNER=
##NPOINTS=1765
##FIRSTX=399.75695801
##LASTX=3997.56933594
##MAXX=3997.56933594
##MINX=399.75695801
##MAXY=0.87009072
##MINY=0.35091472
##XFACTOR=1.0000000000
##YFACTOR=1.000000000000000e-9
##FIRSTY=0.68935484
##DELTAX=2.03957629
##XUNITS=1/CM
##YUNITS=ARBITRARY UNITS
##XYDATA=(X++(Y..Y))
399.8 689354837 687013924 685060084 684764028 684725642 683353484 681847036 681308746 681147933 680843472
418.1 680843472 680424869 679944634 678942382 677724242 677356184 677454352 676847696 675667167 674869776
436.5 674869776 674589336 674095273 673390508 673267901 673391640 672938466 672539294 672854424 672893703 671898127
456.9 671898127 671098232 671249330 670942128 669803381 669130266 668930292 667918384 666356206 665795088
475.2 665795088 665728092 664600551 663295925 663411796 663625598 662448525 661490679 661842465 661700249
493.6 661700249 660130262 659001708 659021795 658239007 656419754 655708075 655814290 654643893 652952194
511.9 652952194 652743399 652843893 651176155 649102569 648509800 647910476 645794868 644041419 643803895
530.3 643803895 642987311 640994489 639941096 639951348 639056444 637539268 637215793 637441099 636294007
548.6 636294007 634601831 634119987 633670092 631859779 630151689 629586995 628527880 626126766 624017537
567 624017537 622724593 620594621 617619812 615669191 614620149 612765133 610426307 609097838 608140945
585.4 608140945 606150329 603842080 602409065 601146638 599203289 597484946 596584737 595204949 592772543
603.7 592772543 590991259 590798438 590848029 590156913 589695096 590477586 592405736 595246553 599078596
622.1 599078596 603432357 607190073 610390544 614013255 617835701 620813191 623164952 625679374
638.4 625679374 627766788 628485024 628934264 631087780 634351373 636316001 636321843 635937631 637199342
656.7 637199342 641064882 646640599 652192354 656201005 658737540 661698520 665297627 668298066
673.1 668298066 670628726 673085034 676092923 678614557 680213869 682011127 684324443 686039448
689.4 686039448 686950564 688117206 689640760 690412700 690581799 691539407 693262935 694404960 695129991
707.7 695129991 696812093 699049115 700376272 701232255 702929139 704855978 705992877 707417369 710154057
726.1 710154057 712800145 714157820 715586662 718057394 719973981 720434129 721255958 723275542 724755347
744.4 724755347 725269914 726659060 729004145 730366230 730884910 732555926 734962821 736057103 736521482
762.8 736521482 738183975 740066826 740522385 740701318 741983831 742902100 742097020 741138160 741189718
781.2 741189718 740684211 739050865 738349199 739442527 740690231 741752565 744474292 748922288 753016591
799.5 753016591 756559849 761007965 765683830 768747687 770776987 773387194 775802553 776580036 776592076
817.9 776592076 776976824 776583076 774324417 771459281 769015551 765911996 761660516 757814944 755057693
836.2 755057693 752091408 748537540 745670021 743773699 741968393 740615964 741148293 743769765 747468650
854.6 747468650 752103686 758226693 765194654 771785617 778022826 784425974 790374219 794923246
870.9 794923246 798425257 801715612 804395974 805692732 806019247 806064129 805480361 803848028 801883161
889.3 801883161 800398409 799179137 797940373 797313571 797851503 798935711 799807966 800709128 801861167
907.6 801861167 802469015 801895380 800621092 799026251 796595156 793232858 790016413 787706733 785925329
926 785925329 784570992 784294367 785009563 785631180 785802782 786282718 787129104 787414670 787030876 786756217
946.4 786756217 786388338 784870267 782294512 779481947 775955975 770722270 764161170 756993413 748613000
964.7 748613000 738295496 726801097 715198159 703484058 691822946 681409359 672802448 665194571
981 665194571 658096611 651931763 646695793 641696692 636884511 632985890 630034208 627255976 624566913
999.4 624566913 622532070 620853245 618542016 615400970 611874044 607814491 602865517 597534120
1015.7 597534120 592547953 587823451 583100080 578765690 575145483 571773231 568247974 564977050
1032 564977050 562275648 559795797 557383835 555398762 553845942 552183211 550192416 548200786 546339452
1050.4 546339452 544520736 543141901 542836308 543637276 544978559 546311200 547201514 547058940 545401692
1068.7 545401692 542431951 538858473 535203040 531671822 528457344 525674045 522953868 519749761
1085 519749761 515984595 511900246 507786930 504188478 501827300 501068652 501670301 503112495 504968464
1103.4 504968464 506890118 508542955 509648621 510030806 509486079 507634342 504006505 498530865 492395908
1121.8 492395908 487952381 486575931 487423301 489080817 490358114 490609616 490890414 492665321 495899886
1140.1 495899886 499601483 503063679 506081462 508579016 510551155 512315154 514332712 516756594
1156.4 516756594 519637048 523375452 528410435 534668267 541864574 549888313 558423698 566845298
1172.7 566845298 574816227 582416713 589602947 596028447 601464748 605888963 608993590 610293686
1189.1 610293686 609922290 608665347 607204497 605996549 605703712 606871486 609189749 611848414 614463270
1207.4 614463270 616919994 618793130 619796395 620383024 621048450 621639431 622034431 622633815 623694718
1225.8 623694718 624988139 626432776 628311038 630613327 632925570 635149777 637565196 640043855
1242.1 640043855 642127991 643794894 645247400 646310151 646757424 646863341 647081673 647493124 648083389
1260.4 648083389 649168611 650955677 653227806 655837834 658964038 662678957 666747749 671002805
1276.8 671002805 675500751 680236340 685045242 689913511 695039868 700377524 705584645 710557997
1293.1 710557997 715362787 719828963 723803401 727436423 730830252 733873606 736552477 738982975
1309.4 738982975 741184235 743057847 744637609 746086299 747407675 748599052 749808788 751024902
1325.7 751024902 752038956 752787709 753348708 753683984 753780305 753794134 753836036 753880143 753968000 754231930
1346.1 754231930 754624367 754877150 754908979 754882634 754723966 754158258 753046215 751325667 749236524
1364.5 749236524 747298598 745660305 744071662 741922140 738956332 736432254 735462844 735257268 734859049
1382.8 734859049 734999776 736208856 737219036 737365425 737235188 736888349 735898495 734233677 732448518
1401.2 732448518 730738223 728619993 726259053 724247515 722429395 720534027 718973517 717928529
1417.5 717928529 716742635 715358257 714336812 713672996 712973416 711839855 710653186 709972978 709293842
1435.9 709293842 708216906 707515061 707308292 707029164 706713736 706779957 707149863 707451761 708158374 710513115
1456.2 710513115 714386284 717952549 721743405 726912200 733345807 740926087 750764966 762810051
1472.6 762810051 772999167 779690206 784981310 789828539 793736219 796334743 798238933 799635112
1488.9 799635112 799895465 799385130 798947990 798261225 796671271 794789374 793492198 792263091 789334655
1507.2 789334655 785653293 782750487 780290663 777992427 775970638 774495244 772871017 770736814
1523.6 770736814 768786192 767083645 765646398 764334977 762843490 761720300 761217535 760401249 758973777
1541.9 758973777 757826984 756982803 756495059 756449342 756753445 757243991 757912815 758297086 757280707
1560.3 757280707 755862594 754546225 753066480 751048565 747977674 744661510 741133511 736049771
1576.6 736049771 730395794 725097358 719482780 713474393 707064092 700282693 693304837 686236501
1592.9 686236501 678882658 671316445 663879335 656617463 649373174 642184615 635110795 627982616
1609.2 627982616 620930672 614387989 607762873 600359976 594126046 589079320 583836079 578835964
1625.5 578835964 574476182 570800543 568372548 566973925 565899968 565566421 566505134 568534374 571439803
1643.9 571439803 575586200 580576301 585142612 590694606 597970665 603829563 609149992 615345001
1660.2 615345001 622576833 630055070 636829972 643955410 651818395 659044147 666187704 673597693
1676.5 673597693 680543065 687449872 695027649 703534842 710947275 717363596 723855972 730004787
1692.8 730004787 736837268 744269907 751225889 758326411 764335632 769388020 773999691 777932346
1709.2 777932346 781800568 785676837 789365768 793011248 796109140 798390210 800347745 802465737
1725.5 802465737 804884374 807436287 809979081 812926292 815824509 818212450 820829868 823861122
1741.8 823861122 826991022 829954326 832800269 835691512 838256001 840157747 841882825 843736768
1758.1 843736768 845434904 846724570 847780108 849044025 850418866 851577282 852494597 853259027 853876531
1776.5 853876531 854465663 855215311 856062472 856745780 857287407 858030856 858981073 859667242 860000730 860487878
1796.9 860487878 861154199 861653805 861940444 862278759 862739742 863169372 863514841 863847911 864200830 864477694
1817.2 864477694 864717066 865071714 865514576 865863264 866139233 866404533 866539180 866614819 866755962 866965055
1837.6 866965055 867244184 867599368 867878079 867967904 868028760 868119895 868194282 868314505 868511736 868663013
1858 868663013 868732333 868851781 869119823 869423449 869545519 869495392 869479418 869470298 869433701 869528890 869707882
1880.5 869707882 869744062 869680822 869780004 869987369 870009184 869934022 869999170 870074213 869962811 869845033 869946957
1902.9 869946957 870090723 870041966 869949102 870004654 870070279 870021105 869988501 870049298 870040238 869858801 869721234
1925.3 869721234 869768381 869751334 869582832 869521558 869586170 869510591 869335651 869337440 869394422 869179249 868835449
1947.8 868835449 868742287 868788898 868594348 868292391 868240356 868267238 868026972 867742002 867741168 867743909 867448807
1970.2 867448807 867176592 867179990 867154181 866891742 866671920 866684675 866651058 866400599 866246879 866331577 866246402
1992.6 866246402 865862966 865616560 865616977 865512967 865233898 865076482 865035653 864815235 864461720 864315808
2013 864315808 864344180 864180565 863862038 863723338 863684714 863436460 863111258 863034546 863080740 862904072 862596989
2035.5 862596989 862488627 862476766 862256765 861982822 861948490 861948729 861745656 861558855 861597061 861621201 861407399
2057.9 861407399 861202776 861233056 861255527 861050248 860880017 860939503 860956550 860776961 860689461 860813558
2078.3 860813558 860853493 860703826 860660017 860788286 860747635 860504031 860438049 860609055 860625386 860450864
2098.7 860450864 860475779 860673904 860661030 860479116 860508502 860688806 860657513 860504329 860580027 860767484
2119.1 860767484 860717356 860601902 860781312 861016989 860947788 860844314 861035585 861228287 861136079 861072898
2139.5 861072898 861275911 861439466 861374855 861382425 861616671 861762464 861691117 861756086 862044632 862149656
2159.9 862149656 862020969 862072587 862331867 862394154 862283826 862422049 862738907 862819493 862751544 862901032
2180.3 862901032 863128662 863110900 863044739 863234103 863454461 863397241 863293529 863447845 863627911 863571703
2200.7 863571703 863523245 863680124 863790154 863702893 863694966 863896012 863999605 863897622 863880396 864009738
2221.1 864009738 864029646 863920271 863920093 864013016 863974035 863853812 863877892 863987625 863969803 863881350 863899887
2243.5 863899887 863945842 863860130 863734424 863730311 863753438 863654256 863548696 863575399 863613248 863526165 863447726
2265.9 863447726 863525748 863632560 863621771 863577247 863631666 863758564 863841176 863837302 863819182 863819718 863775671 863677740
2290.4 863677740 863641500 863695085 863671005 863542080 863454998 863418639 863325834 863172770 863069415 863025367 862929225
2312.9 862929225 862786055 862695575 862553596 862237632 861983538 861956358 861910284 861695349 861462891 861368060
2333.3 861368060 861319065 861149669 861024499 861162484 861438930 861815929 862346947 862691581 862445593 861678362
2353.6 861678362 860981822 860582650 860296607 860231876 860626996 861311257 861900330 862378001 863027394 863785446
2374 863785446 864346862 864812791 865421832 866017580 866355777 866533339 866764009 866963446 866931498 866829336
2394.4 866829336 866928220 867051244 866951585 866844296 866935730 866992056 866859078 866803706 866943717 866981149 866820216
2416.9 866820216 866778731 866904438 866860569 866638958 866591990 866735935 866728365 866554081 866515577 866572380 866454959
2439.3 866454959 866274297 866273582 866296411 866113365 865884006 865838945 865866482 865758479 865619004 865628719 865631819
2461.7 865631819 865461290 865291834 865284264 865269542 865094185 864942908 864933372 864858866 864643514 864507556 864522338
2484.2 864522338 864467621 864267230 864125550 864097536 864015400 863863409 863792300 863779366 863643169 863441706
2504.6 863441706 863357306 863312185 863168240 862996459 862919509 862878025 862739563 862567186 862493753 862453282 862318814
2527 862318814 862160146 862100899 862061799 861906648 861723006 861639142 861547291 861360729 861216009 861176670 861091137
2549.4 861091137 860889733 860719025 860642493 860514581 860292554 860140085 860092342 859985590 859792411 859643102
2569.8 859643102 859535098 859324574 858997464 858725071 858570814 858398139 858138740 857876003 857664764 857434094
2590.2 857434094 857141495 856875598 856655359 856391668 856081307 855787992 855523229 855226517 854920745 854707837
2610.6 854707837 854487777 854130566 853765070 853511155 853267252 852931499 852576137 852278590 851972938 851613820
2631 851613820 851291835 851013303 850669146 850297332 850013912 849791229 849511683 849158406 848830044 848554075
2651.4 848554075 848255694 847917557 847603858 847331226 847042501 846724093 846432328 846169531 845889807 845603883
2671.8 845603883 845368207 845195055 844988108 844690681 844360530 844039202 843740463 843481421 843261838 843042970
2692.2 843042970 842781365 842480361 842184186 841903508 841581345 841189981 840777993 840386927 839994073 839563012
2712.6 839563012 839128137 838716805 838288844 837865233 837492168 837134182 836723626 836285591 835939109 835693061
2733 835693061 835467696 835251868 835041761 834800422 834504306 834185064 833903909 833614767 833212137 832751334
2753.4 832751334 832359493 831994832 831557631 831115782 830738246 830298305 829744637 829225123 828793943 828326166
2773.8 828326166 827709079 827020049 826372743 825708151 824972153 824259818 823611319 822886884 822044611 821218431
2794.2 821218431 820445418 819608033 818644106 817641497 816631258 815570652 814497828 813395679 812123120
2812.5 812123120 810668528 809170961 807648003 805987239 804117262 802036226 799692750 796915174
2828.9 796915174 793577492 789622843 784825206 778789759 771188378 761925638 750965536 738163650
2845.2 738163650 723800063 709304452 697291434 690532327 690211892 695030749 702122450 708771408
2861.5 708771408 713451982 715816200 716274559 715871751 716048181 717592180 719984055 722133815 723224521
2879.9 723224521 722898126 721160114 718191743 714277565 709733546 704774320 699556470 694229066
2896.2 694229066 688834667 683285117 677435935 671099544 663921416 655433714 645263910 633113980
2912.5 633113980 619005322 603894234 589610457 578035474 570631325 568296552 571113348 578176796
2928.8 578176796 587989807 599339306 611466348 623585105 634782791 644296110 651539326 656038523
2945.1 656038523 657671273 657008410 655293345 653875470 653849721 655943513 660264432 666433454 673989117
2963.5 673989117 682512701 691490829 700281501 708362043 715459287 721478999 726525545 730732560
2979.8 730732560 734141171 736867309 739088416 740950048 742554009 743819296 744597793 745001435 745145082
2998.1 745145082 745041668 744762838 744334996 743885994 743615031 743489921 743263602 742806494 742207110 741508067
3018.5 741508067 740733445 739964426 739147365 738184035 737146318 736144125 735167980 734046221 732712090
3036.9 732712090 731411338 730239213 728976846 727464497 725794673 724215329 722742260 721212864
3053.2 721212864 719659448 718087733 716440201 714830995 713367641 711991310 710518360 708854854
3069.5 708854854 707169056 705640793 704262018 702907383 701415360 699785054 698110342 696375787
3085.8 696375787 694642484 692950606 691142738 689243376 687455475 685757279 683954358 681997776
3102.2 681997776 680041373 678184748 676329970 674340427 672333181 670452535 668531775 666439176
3118.5 666439176 664146245 661651134 659160197 656856775 654657304 652371943 649952888 647521675
3134.8 647521675 645180821 642832577 640283406 637590587 634951711 632369518 629851699 627420008
3151.1 627420008 624842882 622004330 619108200 616271079 613433659 610564113 607709944 604891658
3167.4 604891658 602041185 599121034 596217871 593380034 590517700 587606192 584698200 581762314
3183.7 581762314 578764439 575797677 572917759 570031941 567074120 564075351 561105728 558185458
3200.1 558185458 555260122 552332759 549444854 546568811 543726027 540966928 538233459 535470188
3216.4 535470188 532711506 529985189 527262211 524527788 521832705 519253194 516788900 514345169
3232.7 514345169 511824727 509249210 506716609 504266560 501944244 499755293 497559518 495250583
3249 495250583 492962509 490831047 488752693 486645013 484570652 482517958 480415434 478321761 476355344
3267.4 476355344 474497914 472568542 470490634 468378901 466302127 464247376 462199420 460171968
3283.7 460171968 458168834 456178546 454247355 452331305 450308979 448186725 446011037 443854243
3300 443854243 441823781 439881891 437837690 435576677 433185071 430811793 428516030 426274717 424051881
3318.4 424051881 421831638 419643164 417460680 415165871 412812024 410546809 408319294 406114519
3334.7 406114519 404032946 401938289 399651706 397296369 394999415 392792135 390717357 388603002
3351 388603002 386288196 383915961 381688297 379667282 377711207 375729322 373882830 372167736 370300382
3369.3 370300382 368167132 366053551 364245117 362655610 361142099 359684557 358332008 357198864
3385.7 357198864 356396586 355890751 355324447 354447871 353580385 353123456 352928787 352460712 351655722 351077706
3406.1 351077706 350944757 350973666 350970596 350919574 350914717 351088732 351372927 351678431 352169991 352957666 353946000
3428.5 353946000 354931802 355946869 357150614 358303696 359198898 360123813 361377925 362941533 364624292
3446.8 364624292 366272420 367975950 369824350 371805519 373971701 376291037 378519744 380682230
3463.2 380682230 383149624 385871828 388354421 390428931 392502904 394910544 397622824 400364071
3479.5 400364071 402886361 405387700 408118576 410916030 413666904 416505843 419449359 422459662
3495.8 422459662 425468028 428494215 431623310 434668273 437550366 440564930 443842918 447294682
3512.1 447294682 450731397 453985959 457247615 460796356 464663267 468474865 471982539 475474775
3528.4 475474775 479186177 483083218 487161249 491297305 495296985 499345273 503645599 508025348
3544.7 508025348 512137651 516091883 520269632 524643600 529055297 533562899 538224161 542968214
3561.1 542968214 547683835 552438080 557506680 562670052 567590714 572468579 577576280 582939148
3577.4 582939148 588499248 594195783 599900067 605588078 611301899 616953969 622493386 628155291
3593.7 628155291 634037614 640029609 646015465 651890039 657622516 663301408 669184148 675169528
3610 675169528 681002736 686698854 692241549 697894514 703658402 708935797 713810444 718745589 724105179
3628.4 724105179 729460001 734124482 738594770 743110061 747488081 751711369 755779803 759698272
3644.7 759698272 763614476 767680287 771366596 774228573 776878476 779852211 782799840 785342097
3661 785342097 787612557 789929330 792360246 794726372 796855509 798686624 800337791 801854789 803320944
3679.4 803320944 804871976 806514323 808260262 810148597 811803341 812884331 813790441 814843714
3695.7 814843714 816011846 817126155 818023264 818776369 819611192 820539951 821388960 822058022 822653949
3714 822653949 823207855 823713958 824240685 824766636 825160742 825446904 825884163 826542974 827271879 827849388
3734.4 827849388 828192532 828501165 828875840 829161465 829374671 829814851 830276191 830431342 830465436 830696046
3754.8 830696046 831044853 831326783 831519783 831702352 831866741 832031131 832216501 832302809 832335949 832542896
3775.2 832542896 832930684 833195984 833255649 833341837 833442867 833489060 833567441 833742857 834003448 834276140
3795.6 834276140 834546089 834762156 834789157 834783792 834824145 834777832 834751487 834872723 835087240 835309982 835582554
3818 835582554 835724533 835566759 835461080 835492730 835511029 835591376 835800588 836079299 836236417 836159825 836018145
3840.5 836018145 835885406 835786104 835827053 836041272 836270928 836092234 835631490 835567772 835723639 835872710
3860.9 835872710 835998237 836060584 836076260 836019039 835930824 835898638 835862398 835850418 835872948 835925579 836012661
3883.3 836012661 835999489 835930228 835897446 835783005 835661292 835754037 836000562 836118221 836007833 835772157
3903.7 835772157 835560441 835504174 835488796 835436821 835444570 835500240 835526943 835487247 835388541 835303128 835310400 835399747
3928.2 835399747 835495055 835568547 835570753 835460842 835393131 835466206 835528612 835507929 835471988 835462809 835507393 835539401
3952.7 835539401 835521221 835520685 835532248 835527301 835520267 835534930 835585475 835640371 835669219 835695505 835707068 835693657
3977.1 835693657 835742533 835863411 835965693 836017013 836026847 835994065 835938156 835926831 835966051 836017251
3997.5 836017251
##END=$$ End of the data block
