##TITLE=$$ Begin of the data block
##JCAMP-DX=5.00 $$ ACD/SpecManager v 10.08
##SPECTROMETER/DATA SYSTEM=Alpha
##DATE=14 Apr 2014 11:23:48
##DATA TYPE=INFRARED SPECTRUM
##DATA CLASS=XYDATA
##ORIGIN=
##OWNER=
##NPOINTS=1765
##FIRSTX=399.75695801
##LASTX=3997.56933594
##MAXX=3997.56933594
##MINX=399.75695801
##MAXY=0.85735476
##MINY=0.17780292
##XFACTOR=1.0000000000
##YFACTOR=1.000000000000000e-9
##FIRSTY=0.59558320
##DELTAX=2.03957629
##XUNITS=1/CM
##YUNITS=ARBITRARY UNITS
##XYDATA=(X++(Y..Y))
399.8 595583200 593705595 590721548 590597570 590546966 587433755 584855795 585219085 584787488 582062185
418.1 582062185 581377625 582619905 581491113 579237461 579288542 579863310 578010082 575827360 575913787
436.5 575913787 576005280 574024141 572661519 573734343 573897541 572072208 571896434 573309541 572553337
454.8 572553337 570195436 569832623 570296168 568611920 566485703 566191554 565734565 563286781 561277926
473.2 561277926 561222017 560481787 558276296 557275116 557822585 557251334 555364311 554602683 554890096
491.5 554890096 553658605 551217794 550214112 550012112 548198223 545997441 545531452 545234084 543279588
509.9 543279588 541375279 541015089 540199101 537743509 535712063 534876227 533258379 530479014 528695703
528.3 528695703 528008223 526321530 523720026 522326350 522114575 521067560 519396722 518859088 518668532
546.6 518668532 517037153 515052795 514475942 513961554 511760235 509318233 508158922 506777883 503841877
565 503841877 500911415 498925775 496190697 492336780 489323258 487571269 485206068 481915295 479501814
583.3 479501814 477838367 475057542 471530735 469025135 466955006 463678658 459987193 457371742
599.6 457371742 454845458 451143324 448051661 447495729 447869986 446911663 445639908 446204513 448478311
618 448478311 451367617 455277294 460430443 465006053 468208164 471938163 476802796 480665177 483068794
636.3 483068794 485858858 488687932 489265621 488778979 491104692 495601952 497785091 496797085 495759100
654.7 495759100 497270286 501730680 508118749 515034974 520262718 523167908 526445389 530929804
671 530929804 534302890 536144793 538527489 542462349 545372427 546406627 548326313 551670671 553571463
689.4 553571463 553826749 555313885 557866216 558577597 558121026 559649527 562375486 563377976 563960493
707.7 563960493 566898406 570460320 571980834 573326230 576909781 580616295 582261324 584263921
724 584263921 588370264 591664851 592682421 594609320 598452330 600809634 601022124 602665663 606139481
742.4 606139481 608019590 608434558 610864282 614688039 616303325 616656303 619307816 622999549 624383509
760.8 624383509 625157654 628405690 631991088 632962942 633718789 636717796 639020622 638326824 637706220
779.1 637706220 639054358 639180660 636957586 636248589 638422906 640152812 641011536 644770503 651570439
797.5 651570439 657344520 661855459 668514073 676228344 680928648 683803558 688559711 693372250
813.8 693372250 694684565 694726646 696740031 697945058 695243895 691664517 689988017 687256932 681550562
832.1 681550562 676472902 673859179 670296133 664683163 660554647 658670485 655953944 652777433
848.5 652777433 653316140 658046544 663515031 669655383 679216027 690684319 699960113 707741141
864.8 707741141 717199087 726477742 732000291 735878944 741474569 746296287 747357965 747573078 749534011
883.1 749534011 750055909 747189283 744688094 744533598 743493915 740813553 740477860 743151009 744776726
901.5 744776726 744782805 746627450 749713421 750062704 748221219 747540414 746739328 742640615 737264454
919.8 737264454 734271586 732306480 729130566 727256179 728981376 731399298 731841803 732567191 735240757
938.2 735240757 736998141 736413836 736469507 738027573 737756014 734851837 732310116 730189562 725297272
956.6 725297272 717813313 710567415 702679038 691188931 676922798 662281573 646480024 628490210
972.9 628490210 610903919 596404493 583981931 572025001 561455727 552960157 544981241 536751628
989.2 536751628 529825032 524983406 520821571 516644716 513608098 511910439 509872198 506572127
1005.5 506572127 502612591 497814953 491045952 482710391 474537909 466942340 459250420 451856315
1021.8 451856315 445670754 440303773 434796214 429383427 424861252 420922548 416906446 413240999
1038.1 413240999 410528809 408173800 405364186 402424037 399844646 397278458 394721717 393337637
1054.5 393337637 393974662 396071643 398719013 401467949 403470814 403353363 400651604 396275014 391198367
1072.8 391198367 385746628 380384743 375789732 371825367 367601097 362664133 357120037 350839406
1089.1 350839406 343813211 337087452 332133651 329455137 328676641 329456955 331445754 333823591 335843265
1107.5 335843265 337433547 338615835 338810533 337223381 333385020 327083915 319302738 313484490
1123.8 313484490 312748522 315840214 318922013 319766551 319047272 319127291 321527779 325829387 330856562
1142.2 330856562 335604757 339340419 342014998 344302267 346728176 349325597 352365077 356557667
1158.5 356557667 362287045 369495034 378353268 389105737 401164085 413359404 425182581 436785191
1174.8 436785191 447855085 457749158 466520488 474477887 480996907 485120654 486896724 486898154 485311896
1193.1 485311896 482705623 480744749 480917513 483305722 487356782 492747277 498719603 503870726
1209.5 503870726 507543802 510342419 512724102 514411688 515584469 517058671 518957734 520703197
1225.8 520703197 522401273 524743795 527628422 530335665 532921791 536010861 539339423 542065203
1242.1 542065203 544301331 546595573 548490644 549383283 549859345 550713122 551725924 552678645 554412365
1260.4 554412365 557553232 561443090 565565586 570505381 576539636 582782865 588732541 595094085
1276.8 595094085 602038920 608647704 614783585 621410787 628607810 635294497 641299546 647422016
1293.1 647422016 653383672 658153713 662006378 665946543 669657588 672238171 674222946 676557183
1309.4 676557183 678614020 679578125 680253506 681538045 682808697 683488548 684402764 686009645 687252462
1327.8 687252462 687514961 687672794 688029885 687647939 686520219 686049879 686451912 686456323 685987473 686075330
1348.1 686075330 686514676 686150432 685158312 684534490 683861852 682020605 679570556 677818596 676122427
1366.5 676122427 673473656 670556843 667888403 664628386 660014570 652949870 641233325 627333760
1382.8 627333760 621252477 628272355 639931023 646633148 648435175 648370981 647756040 646026313 643354177
1401.2 643354177 640612900 637901127 634930849 631852388 629388988 627554774 625543952 623371124
1417.5 623371124 622152627 621848822 621281743 620670080 620613039 620700955 620576739 620610535 621556580 623555422
1437.9 623555422 625509202 627512217 630013168 632572055 635194063 638654768 642837167 646994233
1454.2 646994233 652247250 660560608 669140041 676181853 683062255 690871119 698732257 706230402
1470.5 706230402 714640856 723782301 731726766 737514198 741591513 744991064 747313321 747720480
1486.8 747720480 747067809 746960044 746656418 744547606 741162717 738409519 735802233 732037306 726291120
1505.2 726291120 719283462 714112997 709557056 704495609 699469805 694823802 690632522 686736703
1521.5 686736703 683594525 680626869 677342594 674508631 671589255 668050110 664981723 662179053
1537.8 662179053 658861399 656555951 655923545 656038761 656125844 655865908 655763686 656003594 655895710
1556.2 655895710 655064642 655198753 655932903 655324399 653274179 650146961 646434546 642616332 637529016
1574.5 637529016 630543828 624024510 617837191 610556066 602633238 594444633 585836232 576819539
1590.9 576819539 567768991 558766603 549820125 540989757 532279551 523726583 515319169 506915271
1607.2 506915271 498432100 490140736 482123047 473455876 464131683 456747800 450333327 443238884
1623.5 443238884 436649561 430985898 425976634 421874166 418198317 414908975 413527519 413695306
1639.8 413695306 414515585 415773153 417913795 421366900 424819320 428843021 435582608 442374825
1656.1 442374825 448375762 454935461 462747455 471418619 479567796 488340229 498824537 509000778
1672.4 509000778 519562781 531464398 542620003 552662373 563479185 577713251 591647029
1686.7 591647029 603288472 614842296 625553608 636505663 648218691 660040557 673813999
1701 673813999 685838819 695476651 705027759 713573158 720557570 726229846 731397688 737357438
1717.3 737357438 743497014 748454094 752811849 757138610 760871410 764067173 767196059 771096706
1733.6 771096706 775595248 779386580 783236861 787495673 791290045 794613004 798105359 801968157
1749.9 801968157 805760622 808984816 811999619 814743340 816639960 818514645 820964158 822878420
1766.3 822878420 823740721 824472010 826104343 828205347 829661846 830893040 832467318 833762109 834498346
1784.6 834498346 835534036 836766779 837206662 837532938 838964701 840586662 841179550 841366649 842449725
1803 842449725 843850195 844337523 844354093 845151246 846319795 846686602 846741140 847533643 848316848 848132968
1823.4 848132968 847976387 848700404 849335790 849494517 849990964 850932896 851452172 851204455 851037383 851508856
1843.8 851508856 852042198 852168500 852646530 853583395 853859782 853517830 853811264 854651749 854751229 854218662
1864.2 854218662 854123652 854435980 854497731 854640186 855423927 856168568 855970442 855596244 856077492 856576860
1884.6 856576860 856130958 855696082 856327474 856897354 856452882 856223285 856892705 857208073 856700122 856597483
1904.9 856597483 857179403 857228994 856661618 856696784 857191503 856936812 856298268 856519699 857213199 857173979
1925.3 857173979 856668651 856857300 857354760 857028365 856441736 856675506 856958747 856259584 855640709 856114566
1945.7 856114566 856529117 856003821 855569065 855948985 856087744 855351508 854882419 855228841 855204523 854420304
1966.1 854420304 854167402 854691982 854656637 853933632 853760064 854140520 853893638 853179514 853150606 853496790
1986.5 853496790 853080094 852289200 852301359 852666795 852274179 851679623 851847470 852084458 851521730 850907683
2006.9 850907683 851024687 851072729 850378096 849824667 850027800 850054681 849383652 848996460 849248588 849115252
2027.3 849115252 848393142 848138332 848414183 848167419 847443104 847267032 847513437 847195327 846564054 846557319
2047.7 846557319 846822619 846454918 845857859 845856547 845989943 845547736 845084965 845247686 845414400 844990373
2068.1 844990373 844631910 844864488 844954610 844472826 844224632 844550371 844622731 844162822 843986332 844249666
2088.5 844249666 844154418 843704760 843710899 844054341 843960524 843623638 843741715 844026744 843828678 843508720
2108.9 843508720 843692601 843995929 843812883 843550980 843780875 844066858 843897462 843745768 844028056 844241202
2129.3 844241202 844079316 844078660 844440699 844560623 844312727 844320476 844653785 844728887 844564736 844719887 845085621
2151.7 845085621 845107853 844965458 845204711 845558465 845500350 845353663 845587730 845866919 845810056 845790029
2172.1 845790029 846119046 846362650 846260846 846283734 846614599 846768022 846629977 846685827 846993446 847080827
2192.5 847080827 846937120 847001672 847231269 847213566 847069561 847195983 847405493 847331047 847209334 847376704
2212.9 847376704 847546518 847430229 847364247 847571254 847650707 847429633 847352743 847542882 847572386 847382307
2233.3 847382307 847386539 847594619 847576797 847350359 847353995 847535014 847443342 847178996 847184181 847309649 847174346
2255.8 847174346 847006321 847109735 847203255 847027123 846910596 847120702 847270548 847104311 847032785 847243011
2276.1 847243011 847321033 847187996 847268522 847565413 847648621 847547650 847675502 847914398 847834110 847641885
2296.5 847641885 847804904 848080814 848026574 847891629 848051608 848263621 848239422 848250210 848500669 848615944
2316.9 848615944 848378956 848263144 848516583 848650217 848536909 848668396 849033952 849101245 848947942 849051476
2337.3 849051476 849283457 849213600 849071324 849450469 850053072 850191891 849987388 850047588 850319684 850168169
2357.7 850168169 849838376 849968970 850268185 850325167 850551248 851114392 851401925 851325691 851554394 852162898
2378.1 852162898 852542043 852617741 852892816 853345931 853453934 853292763 853456974 853833377 853825331 853631854
2398.5 853631854 853826582 854152977 854058862 853843629 854053020 854323208 854134023 853945792 854213774 854384124
2418.9 854384124 854007244 853620648 853657782 853685915 853491187 853595614 854081810 854243636 853932261 853834629
2439.3 853834629 854081213 854080200 853828490 853903115 854174256 854019701 853641570 853685260 853913069 853724658
2459.7 853724658 853425980 853562057 853738964 853451848 853170455 853339493 853436708 853086770 852851927 853055000
2480.1 853055000 853107393 852720976 852483213 852638185 852603495 852231383 852141261 852388263 852307558 851899207
2500.5 851899207 851828516 852022231 851836979 851433098 851449668 851662159 851435423 851027668 851036489 851168811
2520.9 851168811 850901544 850622535 850793421 850909352 850513577 850145638 850234270 850264847 849906087 849702120
2541.3 849702120 849884331 849818528 849336326 849129021 849317431 849210680 848757625 848643303 848855317 848698556
2561.7 848698556 848213971 848040044 848063648 847739875 847305000 847294331 847381949 846987545 846465707 846364737
2582.1 846364737 846273780 845730960 845268965 845297575 845216691 844646811 844149411 844025135 843718112 843038738
2602.5 843038738 842622876 842584670 842266023 841607630 841205120 841039658 840550423 839851916 839532256 839431345
2622.9 839431345 838945627 838243663 837870181 837599993 836991847 836370587 836154044 835984051 835395515 834740043
2643.3 834740043 834477425 834189415 833503604 832959175 832874060 832658350 831996560 831422627 831184685 830787539
2663.7 830787539 830119312 829726577 829635918 829256833 828576982 828160405 827948809 827404082 826685905 826352596
2684.1 826352596 826207638 825661302 824908435 824486911 824168146 823523223 822878599 822619617 822331131 821606517
2704.5 821606517 820864379 820491493 820073009 819311440 818657994 818336368 817878306 817106307 816474259 816096663
2724.8 816096663 815510631 814675927 814146817 813932359 813432753 812663972 812129736 811750770 811136901 810447276
2745.2 810447276 810039580 809699833 809056520 808298826 807745934 807195246 806390226 805645168 805225551 804738820
2765.6 804738820 803902984 803082168 802494645 801801562 800854087 800012648 799407780 798649967 797629654
2784 797629654 796713054 795937777 794968128 793818235 792826951 791982949 790954888 789736807 788606644
2802.3 788606644 787530601 786287665 785017192 783923328 782798111 781410277 779931247 778570294
2818.7 778570294 777171731 775569201 773922265 772351682 770657599 768702030 766631186 764412522
2835 764412522 761725605 758438408 754640460 750231445 744937241 739025772 733574688 729504168 726891160
2853.3 726891160 725469351 724975228 724882424 724478364 723398745 721721828 719544590 717016280 714570940
2871.7 714570940 712529778 710796654 709152699 707539201 705957353 704251885 702253342 700046301
2888 700046301 697778821 695391774 692833304 690198541 687500238 684669673 681732357 678708136 675442755
2906.4 675442755 671703875 667333603 662278056 656691790 651037931 645877540 641609192 638419032
2922.7 638419032 636316538 635298371 635277390 635972083 637227178 639086127 641528428 644402981 647487938
2941 647487938 650497019 653091550 654966712 656065404 656612039 656810641 656858683 657051742 657575548
2959.4 657575548 658458948 659663260 661118388 662737727 664392948 665948153 667292833 668378055
2975.7 668378055 669331610 670267880 671079993 671723187 672318637 672879696 673320472 673509836 673317194 672848225
2996.1 672848225 672170937 671217263 670113444 668955386 667678595 666318417 665005744 663682818 662145972
3014.5 662145972 660403848 658605337 656750798 654763579 652634501 650450110 648316205 646203101
3030.8 646203101 644078314 641912401 639592111 637148499 634685934 632196903 629599094 626860797
3047.1 626860797 624143124 621540308 618871450 616060317 613245666 610499740 607800603 605147183
3063.4 605147183 602570415 600010633 597321510 594531178 591840744 589332461 586854339 584212661
3079.7 584212661 581461370 578702629 575839162 572911799 570086479 567283332 564374864 561447024
3096 561447024 558597803 555705726 552610278 549429536 546387494 543412745 540269196 537047088 533966422
3114.4 533966422 530882835 527571201 524048865 520435035 516843438 513329327 509872794 506383419
3130.7 506383419 502754092 499061078 495489448 491968185 488234371 484319031 480475277 476719826
3147 476719826 472944826 469139099 465248108 461213410 457136810 453135014 449210495 445255816 441173345
3165.4 441173345 437042117 433009624 429050326 425040990 421047062 417155504 413249254 409236133
3181.7 409236133 405223370 401308626 397438735 393572778 389739543 385928571 382064968 378164351
3198 378164351 374372661 370716631 367082357 363469392 359914422 356378287 352862298 349414498 346080244
3216.4 346080244 342825770 339549661 336248934 333034992 329934508 326883465 323916942 321086526
3232.7 321086526 318256766 315339953 312463284 309693187 307004988 304405898 301873505 299353898
3249 299353898 296854109 294421375 292064190 289733827 287385255 285033017 282706201 280425668 278228521
3267.4 278228521 276112348 273983061 271771342 269494116 267229050 265048712 262900770 260691613
3283.7 260691613 258479655 256381273 254360050 252309322 250203997 248041436 245827422 243658036
3300 243658036 241620734 239691332 237740234 235618860 233344749 231095180 228950292 226863027 224840030
3318.4 224840030 222893089 220975786 219039097 217066243 215109110 213205323 211335272 209571809
3334.7 209571809 207946196 206288859 204528898 202757061 200994000 199336648 197899014 196475953
3351 196475953 194875121 193234548 191729397 190375701 189119905 187938228 186891198 185961053 184941694
3369.3 184941694 183730915 182536185 181571931 180784538 180092648 179464951 178919181 178543851 178397998
3387.7 178397998 178437740 178401172 178102940 177802920 177903906 178306893 178471446 178295523 178251222 178534940
3408.1 178534940 178962946 179404736 179811209 180225894 180759892 181385159 182085991 182995543 184094921
3426.5 184094921 185272887 186479524 187805921 189281330 190582946 191543818 192539498 193889886 195517287
3444.8 195517287 197284982 199107513 200959623 202834979 204794720 206956759 209275395 211525202
3461.1 211525202 213780761 216381565 219222113 221787095 223885924 225960791 228382811 231184050
3477.4 231184050 234118387 236843675 239505216 242413834 245426193 248371959 251410306 254622072
3493.8 254622072 257960826 261289626 264578372 267958462 271329492 274578631 277934045 281597853
3510.1 281597853 285507828 289402664 293118566 296863616 300871283 305152327 309383512 313423306
3526.4 313423306 317583412 321997344 326568186 331312954 336119771 340773165 345494807 350532979
3542.7 350532979 355749875 360827237 365737349 370745987 376010239 381431222 386940032 392623901
3559 392623901 398345679 403813601 409237653 415433675 422279358 428858250 435160995 441636294 448356032
3577.4 448356032 455235422 462183237 468982428 475720346 482882887 490448296 497811556 505155027
3593.7 505155027 512825310 520628393 528463602 536335349 543934882 551230013 558893025 566975057
3610 566975057 574979961 582875133 590523779 598292708 606694102 614798665 621932685 628525794 635877013
3628.4 635877013 644275248 652058661 659237206 666189671 672910035 679534853 685741425 691066086
3644.7 691066086 695921600 701693833 708495080 714528501 719657183 725020051 730402827 735013723
3661 735013723 738978267 742479503 745389879 748202682 751546264 754591703 757290721 760573387 764025152
3679.4 764025152 767156839 769827366 771915197 773781300 775954962 778466105 780953467 783140719
3695.7 783140719 784830272 786048055 787352800 789059103 790496528 791129708 791419744 792421579 794222057
3714 794222057 795822263 796926975 797784388 798438013 798977375 799683630 800551057 801053882 801001132 801163375
3734.4 801163375 802318692 803781390 804392159 804019749 803786457 804438651 804900110 805308998 806649685
3752.8 806649685 808070779 808755875 809168518 809873044 810523748 810840666 811125040 811546445 812129438
3771.1 812129438 812771738 813225091 813433111 813595116 813960314 814413667 814790189 815135419 815518618 815852880
3791.5 815852880 815829337 815508485 815334260 815232754 815263569 815737247 816223919 816751480 817398965 817673266
3811.9 817673266 817424417 817104340 817019403 816805243 816994846 817819059 818355143 818492472 818537712 818541288
3832.3 818541288 818422616 818061590 817838669 818186164 818774879 819427311 820038557 820066154 819052577 817595124
3852.7 817595124 817784488 819229603 820034206 820025027 819795728 819783568 819736242 819431305 819470942 819918156
3873.1 819918156 820351601 820650637 820628881 820511222 820456624 820482790 820801795 820918083 820758522 821029007
3893.5 821029007 821408331 821150541 820410132 819901526 820031583 820637405 821315169 821831405 822048426 821843088
3913.9 821843088 821429014 821308017 821519375 821602404 821537971 821651101 821782708 821662903 821614385 821948469
3934.3 821948469 822289646 822287977 822127402 822108805 822187722 822132230 822102308 822303474 822468996 822504699 822671473
3956.7 822671473 822898149 822927833 822879255 822930694 823012590 823071063 823142231 823276401 823485374 823636055 823666275
3979.2 823666275 823735833 823854923 823884249 823902786 824016094 824120998 824133992 824140906 824245930
3997.5 824245930
##END=$$ End of the data block
