##TITLE=$$ Begin of the data block
##JCAMP-DX=5.00 $$ ACD/SpecManager v 10.08
##SPECTROMETER/DATA SYSTEM=Alpha
##DATE=14 Apr 2014 11:23:48
##DATA TYPE=INFRARED SPECTRUM
##DATA CLASS=XYDATA
##ORIGIN=
##OWNER=
##NPOINTS=1765
##FIRSTX=399.75695801
##LASTX=3997.56933594
##MAXX=3997.56933594
##MINX=399.75695801
##MAXY=0.85747445
##MINY=0.17759402
##XFACTOR=1.0000000000
##YFACTOR=1.000000000000000e-9
##FIRSTY=0.59439266
##DELTAX=2.03957629
##XUNITS=1/CM
##YUNITS=ARBITRARY UNITS
##XYDATA=(X++(Y..Y))
399.8E94392657k591431k579450N18083J84596l167570k681732K65598p76768l447592
418.1E80116391q35538J702011r88066k390564m768P52508j584351j850009L36469
436.5E75254083R5665j800835j027763J038313q2195k052784n30481J239061o02782
454.8E71530282k280533m49657N02109j532674k043128j32680j99258k321482k074718
473.2E60998261r8825n77151k112150j260758L00169l89934j588165p93279K7717j274586
493.6E53231299k250314r77874l37720j840829k065123k23875j21414k034843k143562
511.9E41235745n57900r35733k544761j911759l77059j244247k901852k170205r51469
530.3E27640760j695335k388120j163125j81496j191795j803755o02544j45733j501918
$$ plain form
399.8 594392657 591801226 589221776 589739859 589924455 586756885 584075153 584340751 583563983 580116391
418.1 580116391 579280853 580982864 579994798 577604234 577599466 578351974 576767623 574917614 575254083
436.5 575254083 575349748 573548913 572521150 573559463 573477268 571424484 570894003 572133064 571530282
454.8 571530282 569249749 568800092 569302201 567769527 565726399 565593719 565394461 563072979 560998261
473.2 560998261 560899436 560322285 558210135 556949377 557249546 556859612 555271447 554478168 554505885 553231299
493.6 553231299 550980985 550003111 549665391 547824562 545759439 545535564 545414150 543379307 541235745
511.9 541235745 540677845 539742112 537197351 535285592 534908533 533664286 530762434 528592229 527640760
530.3 527640760 525945425 523557305 522394180 522212684 521020889 519217134 518614590 518468857 516966939
548.6E16966939j955807o66797o01709k259732k471804j098573j301587k907634k972424
567E00730872k019763k572894l710329l131748j876950k276778l150553k373784j673610
585.4D77944463k725034l502220k741278k348184l290236l559530k495795k405674
601.7D54876512l538012k971918o16490K55137r05394j045138P52449K202928K651453
620D51661527L757328N072892M507988L252089L838271M902959L885508K444565K805561
638.4D86128688K832621O15567m86821K192438M301250K107620r10401r79722J492024
656.7D97293264M478484O526947P088125N353629L015519L193497M257143L260493
673.1E34467101J805723K382755L994584K961695J044035J954675L369510J879633
$$ plain form
548.6 516966939 515011132 514344335 513742626 511482894 509011090 507912517 506610930 503703296 500730872
567 500730872 498711109 496138215 492427886 489296138 487419188 485142410 481991857 479618073 477944463
585.4 477944463 475219429 471717209 468975931 466627747 463337511 459777981 457282186 454876512
601.7 454876512 451338500 448366582 447750092 448005229 447099835 446054697 446807146 449010074 451661527
620 451661527 455418855 460491747 464999735 468251824 472090095 476993054 480878562 483323127 486128688
638.4 486128688 488961309 489576876 489090055 491282493 495583743 497691363 496780962 495801240 497293264
656.7 497293264 501771748 508298695 515386820 520740449 523755968 526949465 531206608 534467101
673.1 534467101 536272824 538655579 542650163 545611858 546655893 548610568 551980078 553859711
689.4E53859711K70307J539111K534091O21617n00679J515627K698541J023769O01471
707.7E64163566K902567L558993J605809J476884L664613L680765J572609J966954
724E84592760M127085L357827J020551J833856L768564K324581J83761J677275L600299
742.4F06486559J940489L07023K277434L735006J626015M79161K800763L720284J316666
760.8F24689400P71225L338277L637314R28044P07269L002405K296388p37905o43432
779.1F37988985J379728J31607k315164q02159K103031J685977R50515L898621O861984
797.5F51883125N790472M519523O615042P641673M686415K865196M706859M803419
813.8F93511724J384974R6142J950085J083613k716124l464341j609385k766192n734682
$$ plain form
689.4 553859711 554130018 555669129 558203220 558824837 558324158 559839785 562538326 563562095 564163566
707.7 564163566 567066133 570625126 572230935 573707819 577372432 581053197 582625806 584592760
724 584592760 588719845 592077672 593098223 594932079 598700643 601025224 601208985 602886260 606486559
742.4 606486559 608427048 608734071 611011505 614746511 616372526 616851687 619652450 623372734 624689400
760.8 624689400 625460625 628798902 632436216 633364260 634071529 637073934 639370322 638632417 637988985
779.1 637988985 639368713 639500320 637185156 636382997 638486028 640172005 641122520 645021141 651883125
797.5 651883125 657673597 662193120 668808162 676449835 681136250 684001446 688708305 693511724
813.8 693511724 694896698 694992840 696942925 698026538 695310414 691846073 690236688 687470496 681735814
832.1F81735814n055905k619922l617287n603909m032135j812935k696276l117382
848.5F53180063N51164M581630N322516O107569R556234J1456847R275019P797718
864.8G07828760R447992R251356N583406M007399N631625M677534Q91865J79410J998484
883.1G49497831N48124k852320k466918j22964j042485k670527l06070K631844J535713
901.5G44752228l874J882672L094197L20553j882910o77824p73907m067957n339683
919.8G37303495l003656k017618l212928j868487J754284K401114L74853O94156K687991
938.2G35113204J754999n95868P5936J580716k87235k896786k496481k125204m929542
956.6G25193739p477522p231832p898628j1507571j4307499j4667034j5785635j7955839
$$ plain form
832.1 681735814 676679909 674059987 670442700 664838791 660806656 658993721 656297445 653180063
848.5 653180063 653731227 658312857 663635373 669742942 679299176 690756023 700031042 707828760
864.8 707828760 717276752 726528108 732111514 736118913 741750538 746428072 747319937 747499347 749497831
883.1 749497831 750045955 747193635 744726717 744603753 743561268 740890741 740584671 743216515 744752228
901.5 744752228 744748354 746631026 749725223 750045776 748162866 747485042 746711135 742643178 737303495
919.8 737303495 734299839 732282221 729069293 727200806 728955090 731356204 731731057 732425213 735113204
938.2 735113204 736868203 736272335 736348271 737928987 737641752 734744966 732248485 730123281 725193739
956.6 725193739 717716217 710484385 702585757 691078186 676770687 662103653 646318018 628362179
972.9F28362179j7519057j4434040j2415349j2006283j0621250q489608p944703q222282
989.2E36709607o928444m854858m192829m192591l055275j722991k051651l325880
1005.5E06385088l990471m807175o781667q348852q142591p530868p618308p317782
1021.8D51847374o127864n369901n554557n410999m465282l918290m036785l664761
1038.1D13298935k725572k399295k783358k838344k513140k570182k593488j393109
1054.5C93482447O73502K090782K572388K713918K059848o7443k728969m407138n070269
1072.8C91319066n452573n371243m579425l922194m179865m901499n535721o306619
1089.1C51069927p045805o723523m954189k694875q02547P71761K024770K441495K043933
$$ plain form
972.9 628362179 610843122 596409082 583993733 571987450 561366200 552876592 544931889 536709607
989.2 536709607 529781163 524926305 520733476 516540885 513485610 511762619 509710968 506385088
1005.5 506385088 502394617 497587442 490805775 482456923 474314332 466783464 459165156 451847374
1021.8 451847374 445719510 440349609 434795052 429384053 424918771 421000481 416963696 413298935
1038.1 413298935 410573363 408174068 405390710 402552366 400039226 397469044 394875556 393482447
1054.5 393482447 394155949 396246731 398819119 401533037 403592885 403525442 400796473 396389335 391319066
1072.8 391319066 385866493 380495250 375915825 371993631 367813766 362912267 357376546 351069927
1089.1 351069927 344024122 337300599 332346410 329651535 328848988 329620749 331645519 334087014 336130947
1107.5C36130947J576930J176030J92433j581371l825605o298244p782071n850643
1123.8C13738406q15004L036379L088415Q67248o99580J02669K399921M289538N041778
1142.2C31049770M766703L720939K655685K295911K423614K578408L023297M155248
1158.5C56669575N713254P241965Q867651J0709584J2014061J2198984J1848420J1583418
1174.8D36846912J1018008R872794Q778930P936239O491333M140526J811892J8180
1191.1D86914814j583070k598554j956195J81795K394437M020811N360722N990416
1207.4D98725176N181908L684342K793014K359152J680136J182675J452923J871407
1223.7E18930733J762450J743078K386809K897441K684891K592087L116012L324270
$$ plain form
1107.5 336130947 337707877 338883907 339076340 337494969 333669364 327371120 319589049 313738406
1123.8 313738406 312923402 315959781 319048196 319915444 319215864 319318533 321718454 326007992 331049770
1142.2 331049770 335816473 339537412 342193097 344489008 346912622 349491030 352514327 356669575
1158.5 356669575 362382829 369624794 378492445 389202029 401216090 413415074 425263494 436846912
1174.8 436846912 447864920 457737714 466516644 474452883 480944216 485084742 486896634 486914814
1191.1 486914814 485331744 482733190 480776995 480958790 483353227 487374038 492734760 498725176
1207.4 498725176 503907084 507591426 510384440 512743592 514423728 515606403 517059326 518930733
1223.7 518930733 520693183 522436261 524823070 527720511 530405402 532997489 536113501 539437771
1240.1E39437771K731681K260446K290070J876891Q82506M71831Q72552J058281R79483
1258.4E52861512J704037L071487L829360M108012M953861O024539O212294N935729
1274.7E88700831O360650O955385O623030O137490O613791P168055O676852O009400
1291F41245484O117821N984068M798174L853083L945231L719687K585769K008915K345741
1309.4F76603973K011895R12547O83010J329839J324773P17699R06468J584232J225173
1327.8F87299609K65956J97828L84331l85225j136780m89771L88264K3008m28736J11758
1348.1F86230242M16994l97920r78351o00338o83367j838446k421617j728773j685560
1366.5F76312864k662122k933145k666295l266811m646480p108808j1742889j3885677
$$ plain form
1240.1 539437771 542169452 544429898 546719968 548596859 549479365 549951196 550823748 551882029 552861512
1258.4 552861512 554565549 557637036 561466396 565574408 570528269 576552808 582765102 588700831
1274.7 588700831 595061481 602016866 608639896 614777386 621391177 628559232 635236084 641245484
1291 641245484 647363305 653347373 658145547 661998630 665943861 669663548 672249317 674258232 676603973
1309.4 676603973 678615868 679528415 680211425 681541264 682866037 683583736 684490204 686074436 687299609
1327.8 687299609 687565565 687763393 688147724 687762499 686625719 686135948 686524212 686547220 686118484 686230242
1348.1 686230242 686647236 686249316 685270965 684670627 683987260 682148814 679727197 677998424 676312864
1366.5 676312864 673650742 670717597 668051302 664784491 660138011 653029203 641286314 627400637
1382.8F27400637o057620P014453J1645496O709039J811624p4327o34015j738787k663314
1401.2F43413186k718270k701938k982497l079593k429903j786291k005518k228320
1417.5F23480856j258254k74777n16415n67734n6028M2498j49965L2782R28998J992464
1437.9F23654425J989067K033531K491236K526283K577067L423273M179955M167139
1454.2F47041976N252481Q301139Q567631P040739O894648P838011P881522P485509
1470.5G06303656Q378148R135425P947326N778551M078925L397524K307415M15087
1486.8G47742057o17862q0764k94984k114236l406167k774596k616763l777147n766034
1505.2G26293504p016539n158425m522979n026877n023479m669369m219114l920138
$$ plain form
1382.8 627400637 621343017 628357470 640002966 646712005 648523629 648449302 647815287 646076500 643413186
1401.2 643413186 640694916 637992978 635010481 631930888 629500985 627714694 625709176 623480856
1417.5 623480856 622222602 621947825 621431410 620863676 620807648 620850146 620700181 620732963 621661961 623654425
1437.9 623654425 625643492 627677023 630168259 632694542 635271609 638694882 642874837 647041976
1454.2 647041976 652294457 660595596 669163227 676203966 683098614 690936625 698818147 706303656
1470.5 706303656 714681804 723817229 731764555 737543106 741622031 745019555 747326970 747742057
1486.8 747742057 747124195 747043431 746748447 744634211 741228044 738453448 735836685 732059538 726293504
1505.2 726293504 719276965 714118540 709595561 704568684 699545205 694875836 690656722 686736584
1521.5F86736584l117621k882600l220916k838909k930522l525019l062308k820432
1537.8F62338257l342748k288580n96821J26958Q3804k77042j18793K54453q2314q26657
1558.2F55270517J40488P47561o24477k084017l134072l692806l796875n064190o964981
1576.6F30797148o510020o188571p281303p913530q189202q621633r043097r086013
1592.9E67963779r012997q951068q859277q738518q569359q424044q418799q502572
1609.2D98487145q317262q030415q666217r322167p388085o418794p092446o598979
1625.5D36652780n699903n042672m101158l656148l275276j378804J58578P98225J239479
1643.9D15695101K149671L481567L477633M049838O767005O788164N991310O575614
$$ plain form
1521.5 686736584 683618963 680736363 677515447 674676538 671746016 668220997 665158689 662338257
1537.8 662338257 658995509 656706929 656110108 656237066 656320870 656043828 655925035 656179488 656097174 655270517
1558.2 655270517 655411005 656158566 655534089 653450072 650316000 646623194 642826319 637762129 630797148
1576.6 630797148 624287128 618098557 610817254 602903724 594714522 586092889 577049792 567963779
1592.9 567963779 558950782 549999714 541140437 532401919 523832560 515408516 506989717 498487145
1609.2 498487145 490169883 482139468 473473251 464151084 456762999 450344205 443251759 436652780
1625.5 436652780 430952877 425910205 421809047 418152899 414877623 413498819 413657397 414455622 415695101
1643.9 415695101 417844772 421326339 424803972 428853810 435620815 442408979 448400289 454975903
1660.2D54975903P827520Q660764Q162737Q830428J0511845J0159433J0566414J1920750
1676.5E31615794J1154175J0008692J0784924J4266908J3970018J1637688J1562764
1690.8F15000963J0727525J0929584J1661113J1800051J3786077J2028277R615183
1705.1F95548773R534120Q577586P021367N656064N143284N976141O156087M956305
1721.4G48569727M356861M332304L737450L193617L113627L881574M518687L814519
1737.7G79518366L843129M245519L778041L319799L519178L858626L745794L190696
1754H09019148K991915K753377J953125J911461K435446J887381Q33214P02560J636028
1772.4H26123655K124309J451254J224816J594603J303137P42256J074970J256823
$$ plain form
1660.2 454975903 462803423 471464187 479626924 488457352 498969197 509128630 519695044 531615794
1676.5 531615794 542769969 552778661 563563585 577830493 591800511 603438199 615000963
1690.8 615000963 625728488 636658072 648319185 660119236 673905313 685933590 695548773
1705.1 695548773 705082893 713660479 720681846 726337910 731481194 737457335 743613422 748569727
1721.4 748569727 752926588 757258892 760996342 764189959 767303586 771185160 775703847 779518366
1737.7 779518366 783361495 787607014 791385055 794704854 798224032 802082658 805828452 809019148
1754 809019148 812011063 814764440 816717565 818629026 821064472 822951853 823785067 824487627 826123655
1772.4 826123655 828247964 829699218 830924034 832518637 833821774 834564030 835639000 836895823
1788.7H36895823M11749K90513J431168J624405N89073K16961J113712J380444M61221
1807H44415069J7583Q08299J161336L61503R5486Q23617P54774k25484j76609P26879
1827.4H48762453O49571J78993N13673R23633M95017k19107j35243M46856N00441J37985
1847.8H52254272N13970R47118K54333l43025L04759Q26180P9811n32508q5295L12686
1868.2H54532301O4075J62185Q11994P40409k37167l87550M80771M66407m81487m18901
1888.6H55733037O87301N96404m49538k31266O51658K90930m98772p4684O01589N0128
1909H57356787n85556L0279N14805k49445o48499K21133O78301o1392m98295K12669
1929.4H56970787N03659l42369n91159K36988K71738o99937n98312M75705L88145n45442
$$ plain form
1788.7 836895823 837307572 837598085 839029253 840653658 841242731 841459692 842573404 843953848 844415069
1807 844415069 844432652 845240951 846402287 846763790 846859276 847682893 848437667 848212183 848035574 848762453
1827.4 848762453 849412024 849591017 850104690 851028323 851523340 851304233 851168990 851615846 852116287 852254272
1847.8 852254272 852768242 853715360 853969693 853626668 853931427 854757607 854837418 854304910 854219615 854532301
1868.2 854532301 854596376 854758561 855570555 856310964 856073797 855686247 856167018 856633425 856151938 855733037
1888.6 855733037 856420338 857016742 856567204 856335938 856987596 857278526 856779754 856705070 857306659 857356787
1909 857356787 856771231 856801510 857316315 857066870 856418371 856639504 857317805 857256413 856758118 856970787
1929.4 856970787 857474446 857132077 856540918 856777906 857049644 856349707 855751395 856227100 856615245 856069803
1949.8H56069803m28140L89338J37150p18832m36247L55602l5048p83860k48254N08428
1970.2H54809940l7134o79910j44422L46959k90931p24911j8835L58879m18007p95365
1990.6H52406263K1279L68774m06265n90861J90377K25723o02007o16371J64687P7486
2011H51239085p08222n64695J98245P749o79254l72410K45273j58608p17700k33709
2031.4H48255754K70843k69592p36356j76906K49743l27170o59763j5080K92062l51250
2051.8H46532285n85794M4524J83046m46617n05984J46508J68324m30525l57508K31862
2072.2H44980121R4831m67599k56300K88248L1293m57526j36017K75492j12652m61936
2092.6H43777955o915L35277q7679l42309J04606L04341j55389l09408J43230K53797
$$ plain form
1949.8 856069803 855641663 856031001 856168151 855449319 855013072 855368674 855333626 854549766 854301512 854809940
1970.2 854809940 854772806 854092896 853948474 854295433 854004502 853279591 853260756 853619635 853201628 852406263
1990.6 852406263 852427542 852796316 852390051 851799190 851989567 852215290 851613283 850996912 851161599 851239085
2011 851239085 850530863 849966168 850164413 850172162 849492908 849120498 849365771 849207163 848489463 848255754
2031.4 848255754 848526597 848257005 847520649 847343743 847593486 847266316 846606553 846591473 846883535 846532285
2051.8 846532285 845946491 845991015 846174061 845727444 845221460 845367968 845536292 845105767 844748259 844980121
2072.2 844980121 845074952 844607353 844351053 844639301 844670594 844213068 844077051 844352543 844239891 843777955
2092.6 843777955 843771040 844106317 844018638 843676329 843780935 844085276 843929887 843620479 843763709 844017506
2113H44017506j92821k35856K45690K74539j83463j30593L40223K37226j91748m1306
2133.4H44139397L36766J38998j96039L8564L36945P5936j85430J07527L43978L7611
2153.8H45174253j19090K49684L35276r6858j77145K51353L24130m5657l2127L21388
2174.2H46185207K45154r3639J8537L03865J27554j31071Q0705L16203Q5115j37508
2194.6H47000122P5579K41816J907j30534J22130J83523j17004j35303J87278J76310
2215H47605824j23083p9990K03491J12354k00331p5280K16484L8802k15232j2875K07842
2237.4H47678006K980j89245J9014J44720j34945k44617M4286J13189j61648j77800
2257.8H47093940Q0168O8188j68264j04845J84477J19149j54078k2530K60770J06573
$$ plain form
2113 844017506 843824685 843588829 843834519 844109058 843925595 843795002 844135225 844372451 844180703 844139397
2133.4 844139397 844476163 844615161 844419122 844457686 844794631 844870567 844685137 844792664 845136642 845174253
2153.8 845174253 845055163 845304847 845640123 845543265 845366120 845617473 845941603 845895946 845863819 846185207
2174.2 846185207 846430361 846336722 846355259 846659124 846786678 846655607 846736312 847052515 847137630 847000122
2194.6 847000122 847075701 847317517 847319424 847188890 847311020 847494543 847377539 847242236 847429514 847605824
2215 847605824 847482741 847402751 847606242 847718596 847518265 847442985 847659469 847698271 847483039 847470164 847678006
2237.4 847678006 847680986 847491741 847510755 847655475 847520530 847275913 847320199 847433388 847271740 847093940
2257.8 847093940 847174108 847242296 847074032 846969187 847153664 847272813 847118735 847096205 847356975 847463548
2278.2H47463548j30832O4790K81632Q1301r8527J25051K34246q8155j97351J64449
2298.6H47900152K66850o4254j03175K08378J95562j01327l3916K85328J84119j83404
2319H48554313q6129K73765J39772j46746P8976L50177P7904j69456J15096K86281
2339.4H49473953p9810j70470L98696O10232J67251j56999K7001K00391j55926k68221
2359.8H50046098K46585L42011m5121J28329N65589L13759q6248K18153O09994L64005
2380.2H52703154N1677K57612M35352Q2195j70708J86682L93092K385j75715K02358
2400.6H53968084L23534j09255k08676K39193K71201j89662j77920K38121J13249l97802
2421H54070067l70264M2379L5227j66715J22011M82679J66475k85625q1957K32518
$$ plain form
2278.2 847463548 847332716 847397506 847679138 847760439 847661912 847786963 848021209 847933054 847735703 847900152
2298.6 847900152 848167002 848102748 847999573 848207951 848403513 848302186 848268270 848553598 848737717 848554313
2319 848554313 848468184 848741949 848881721 848734975 848813951 849164128 849242032 849072576 849187672 849473953
2339.4 849473953 849394143 849223673 849622369 850232601 850399852 850242853 850269854 850470245 850314319 850046098
2359.8 850046098 850292683 850634694 850589573 850717902 851283491 851597250 851511002 851729155 852339149 852703154
2380.2 852703154 852754831 853012443 853447795 853529990 853359282 853545964 853939056 853941441 853765726 853968084
2400.6 853968084 854291618 854182363 853973687 854212880 854484081 854294419 854116499 854354620 854467869 854070067
2421 854070067 853699803 853742182 853777409 853610694 853732705 854215384 854381859 854096234 854014277 854246795
2441.3H54246795l0339k71678O9559K73168j56164l81768O7175K55227k10941l50595
2461.7H53510439J00732J84238k45154k73108J41084J04308l12269k05457K09928K2828
2482.1H53237569m39584k50161J97411j1086l87013j04905K34723r7692m10974p1227
2502.5H51897061J68919k07483l77655P9870K37286k56419m20630K2292J12951l06487
2522.9H50949705k86520J71125Q8573m15683l44992J21117L1888l61681j90079J67906
2543.3H49931359q5115m48525j78874J68205j31071m50790r6798J97530k06471m96745
2563.7H48202705j38223M6075l32416m54604k8253O7413m06146n14746j03235r1493
2584.1H46247077n14746m58657k1399j28686n74529m68075p7546k65062o80208m45068
$$ plain form
2441.3 854246795 854216456 853944778 854014337 854287505 854131341 853749573 853816748 854071975 853861034 853510439
2461.7 853510439 853611171 853795409 853550255 853277147 853418231 853522539 853210270 853004813 853214741 853237569
2482.1 853237569 852797985 852547824 852745235 852734149 852347136 852242231 852476954 852379262 851968288 851897061
2502.5 851897061 852065980 851858497 851480842 851560712 851797998 851541579 851120949 851143241 851256192 850949705
2522.9 850949705 850663185 850834310 850922883 850507200 850162208 850283325 850315213 849953532 849763453 849931359
2543.3 849931359 849846244 849397719 849218845 849387050 849255979 848805189 848708391 848905921 848699450 848202705
2563.7 848202705 848064482 848110557 847778141 847323537 847295284 847362697 846956551 846441805 846338570 846247077
2584.1 846247077 845732331 845273674 845252275 845123589 844549060 844080985 844003439 843738377 843058169 842613101
2604.5H42613101m5776l04401o50943m12166j80483m96864o82473k79486q6546n15163
2624.9H38958800p28548l74555k58744o02901o20186k03848j81735o37710o62982k39790
2645.3H34447801l13878p02262n09500q4043k56538o69301n43713k18332l95835o67572
2665.7H30086827l90291p9572l71099p07209m51684k02298n14865p01308l32296j66297
2686.1H26169908n54919p14719l92139l47436o70671o39916k66909k95997o99282p16030
2706.5H20871890m06862m72188p60615o20246k97546m42386p40885n99206l93390o22035
2726.9H15516531q36372n33283k37822m95613p64370n55575l90768o21497p01011m07576
2747.3H09972644l27587o34492p51614n26011n20170p94411p43746m21644m95374q51095
$$ plain form
2604.5 842613101 842567325 842262924 841611981 841199815 841019332 840522468 839839995 839560509 839473963 838958800
2624.9 838958800 838230252 837855697 837596953 836994052 836373866 836170018 835988283 835350573 834687591 834447801
2645.3 834447801 834133923 833431661 832922161 832838118 832581580 831912279 831368566 831150234 830754399 830086827
2665.7 830086827 829696536 829616964 829245865 828538656 828086972 827884674 827369809 826668501 826336205 826169908
2686.1 826169908 825614989 824900270 824508131 824160695 823490024 822850108 822583199 822287202 821587920 820871890
2706.5 820871890 820465028 819992840 819232225 818611979 818314433 817872047 817131162 816531956 816138566 815516531
2726.9 815516531 814680159 814146876 813909054 813413441 812649071 812093496 811702728 811081231 810380220 809972644
2747.3 809972644 809645057 809010565 808258951 807732940 807212770 806418359 805674613 805252969 804757595 803906500
2767.7H03906500q41915o06895p01189r35972q22424o18220p73251j000225r02474
2786G96703935p64847r41038j125396r79423q44121j052499j260877j155853j065016
2804.4G87514865j219630j265347j113176j156092j390219j446843j346528j411379
2820.7G77165651j609862j638352j555860j698018j986742k112925k238154k660096
2837G61665642l242671l758311m382670n302012n927861n462408m106403k635121j396835
2855.4G25451350m81367j10567l88324j018286j652121k229869k589047k445341k012610
2873.7G12523818j736522j646399j572371j543939j719177k046525k245188k264619
2890.1F97749078k344548k511740k613962k698839k845764k946615l008187l269136
$$ plain form
2767.7 803906500 803064585 802457690 801756501 800820529 799998105 799379885 798606634 797606409 796703935
2786 796703935 795939088 794998050 793872654 792893231 792049110 790996611 789735734 788579881 787514865
2804.4 787514865 786295235 785029888 783916712 782760620 781370401 779923558 778577030 777165651
2820.7 777165651 775555789 773917437 772361577 770663559 768676817 766563892 764325738 761665642
2837 761665642 758422971 754664660 750281990 744979978 739052117 733589709 729483306 726848185 725451350
2855.4 725451350 724969983 724859416 724471092 723452806 721800685 719570816 716981769 714536428 712523818
2873.7 712523818 710787296 709140897 707568526 706024587 704305410 702258885 700013697 697749078
2890.1 697749078 695404530 692892790 690278828 687579989 684734225 681787610 678779423 675510287
2906.4F75510287l780007m409313n058229n528629n584717n130589m273593l221751
2922.7F38523459k115011j005947k4736O75380J231849J849771K466797K907396L085255
2941F47594213K982855K574563J882315J122773N49495J65343J0908J70290N14090
2959.4F57566845R10044J252294J492917J637399J643360J546502J369000J106560
2975.7F68524921R43959R16540P98405O43909O11782N66959M09245J62364j74940m61757
2996.1F72941387o80507r17732j075208j184106j303554j337647j290977j335144j556516
3014.5F62259996j778185j850784j857162j911938k050221k166808k150416k132356
3030.8F46362126k164722k201199k300620k394736k416432k451956k579272k722800
$$ plain form
2906.4 675510287 671730280 667320967 662262738 656734109 651149392 646018803 641745210 638523459
2922.7 638523459 636408448 635402501 635377765 636053145 637284994 639134765 641601562 644508958 647594213
2941 647594213 650577068 653151631 655033946 656156719 656706214 656871557 656882465 657052755 657566845
2959.4 657566845 658476889 659729183 661222100 662859499 664502859 666049361 667418361 668524921
2975.7 668524921 669468880 670385420 671183825 671827734 672439516 673006475 673415720 673578084 673403144 672941387
2996.1 672941387 672260880 671343148 670267940 669083834 667780280 666442633 665151656 663816512 662259996
3014.5 662259996 660481811 658631027 656773865 654861927 652811706 650644898 648494482 646362126
3030.8 646362126 644197404 641996205 639695585 637300849 634884417 632432461 629853189 627130389
3047.1F27130389k695083k598048k709448k870262k834856k733886k700687k682030
3063.4F05306089k600133k538980k660155k798438k698541k500057k479136k652228
3079.7E84378421k778172k782285k834261k866149k800226k831936k939880k894223
3096E61651289k777993k881229l134728l193140l019213k950788l154874l257155l106952
3114.4E34175217l100753l301620l496170l620982l624082l522873l415883l440678
3130.7E06652176l626644l720075l577411l500998l722817l906161l847271l795355
3147D76955444l787816l768891l846943m006237m080594m009276l917277l967136m088194
3165.4D41483080m105091m041522l999293m013568l998816l915787l911376m012078
$$ plain form
3047.1 627130389 624435306 621837258 619127810 616257548 613422692 610688806 607988119 605306089
3063.4 605306089 602705956 600166976 597506821 594708383 592009842 589509785 587030649 584378421
3079.7 584378421 581600249 578817964 575983703 573117554 570317328 567485392 564545512 561651289
3096 561651289 558873296 555992067 552857339 549664199 546644986 543694198 540539324 537282169 534175217
3114.4 534175217 531074464 527772844 524276674 520655692 517031610 513508737 510092854 506652176
3130.7 506652176 503025532 499305457 495728046 492227048 488504231 484598070 480750799 476955444
3147 476955444 473167628 469398737 465551794 461545557 457464963 453455687 449538410 445571274 441483080
3165.4 441483080 437377989 433336467 429337174 425323606 421324790 417409003 413497627 409485549
3181.7D09485549m006148l895133l885299l924966l884435l837347l857821l870160
3198C78324240l792226l678560l637850l613472l530890l476411l509820l507077l381104
3216.4C46196830l278523l268898l243893l156394l105760l106594l009230k850294
3232.7C21177244k864688k968073k880574k685219k606243k615451k571166k529085
3249B99456745k546966k487123k339601k285928k336472k358824k331376k277106k182871
3267.4B78310478k077729k099693k243578k328545k294838k213151k160906k159089
3283.7B60732949k164245k118051k044111k053410k144158k186388k166793k131655
3300B43724138k061770j959517j971186k147615k265736k226666k123266k041772k012164
$$ plain form
3181.7 409485549 405479401 401584268 397698969 393774003 389889568 386052221 382194400 378324240
3198 378324240 374532014 370853454 367215604 363602132 360071242 356594831 353085011 349577934 346196830
3216.4 346196830 342918307 339649409 336405516 333249122 330143362 327036768 324027538 321177244
3232.7 321177244 318312556 315344483 312463909 309778690 307172447 304556996 301985830 299456745
3249 299456745 296909779 294422656 292083055 289797127 287460655 285101831 282770455 280493349 278310478
3267.4 278310478 276232749 274133056 271889478 269560933 267266095 265052944 262892038 260732949
3283.7 260732949 258568704 256450653 254406542 252353132 250208974 248022586 245855793 243724138
3300 243724138 241662368 239702851 237731665 235584050 233318314 231091648 228968382 226926610 224914446
3318.4B24914446j974672j931607j935497j978785j997665j948922j874596j747743
3334.7B09524959j603678j623481j760975j790493j724646j629129j480400j475364
3351A96436793j619816j640499j522302j351923j211167j177191j081869r38148j028910
3369.3A84864968j264468j236155r20013p22930p15524o73473n37634l92586k07677
3387.7A78194508L0309j0073l22148k98575J79946M65960J68800j94788l5673L16754
3408.1A78495020M52697M48480L90113L95029N44489O47053O78316Q54611J091480
3426.5A83997288J207441J188964J302987J498431J314804R75237J036718J347229
3442.8A93869099J572862J734138J797423J817256J891538K027706K187341K265170
$$ plain form
3318.4 224914446 222939774 221008167 219072670 217093885 215096220 213147298 211272702 209524959
3334.7 209524959 207921281 206297800 204536825 202746332 201021686 199392557 197912157 196436793
3351 196436793 194816977 193176478 191654176 190302253 189091086 187913895 186832026 185893878 184864968
3369.3 184864968 183600500 182364345 181444332 180721402 180005878 179332405 178794771 178402185 178194508
3387.7 178194508 178224817 178214744 177892596 177594021 177773967 178239927 178408727 178213939 178178266 178495020
3408.1 178495020 178947717 179396197 179786310 180181339 180725828 181372881 182051197 182905808 183997288
3426.5 183997288 185204729 186393693 187696680 189195111 190509915 191485152 192521870 193869099
3442.8 193869099 195441961 197176099 198973522 200790778 202682316 204710022 206897363 209162533
3459.1B09162533K196178K293319K704188K862409K464443K029434K144650K531558
3475.4B28388712K808019K875299K704948K662450K881810K994478K963245L056570
3491.7B51335531L233791L356188L307134L269136L394366L370374L196150L310979
3508B77773649L686100L960073L931880L742307L754467L982246M243851M209846M022419
3526.4C13306838M157812M451722M606098M732728M787027M691333M772186M992962
3542.7C50498706N138606N079776M963040N073905N305499N405516N477488N667328
3559C92609864N732060N514771N472481O214172O812006O512046O262004O470859O698191
3577.4D48298454O823093O956875O904602O811589P136464P515073P344246P337451
$$ plain form
3459.1 209162533 211358711 213652030 216356218 219218627 221683070 223712504 225857154 228388712
3475.4 228388712 231196731 234072030 236776978 239439428 242321238 245315716 248278961 251335531
3491.7 251335531 254569322 257925510 261232644 264501780 267896146 271266520 274462670 277773649
3508 277773649 281459749 285419822 289351702 293094009 296848476 300830722 305074573 309284419 313306838
3526.4 313306838 317464650 321916372 326522470 331255198 336042225 340733558 345505744 350498706
3542.7 350498706 355637312 360717088 365680128 370754033 376059532 381465048 386942536 392609864
3559 392609864 398341924 403856695 409329176 415543348 422355354 428867400 435129404 441600263 448298454
3577.4 448298454 455121547 462078422 468983024 475794613 482931077 490446150 497790396 505127847
3593.7E05127847P682085P858038P885158P863879P586480P319450P674992Q057773
3610E67055702P977903P857561P643998P846177Q467316Q126199P156909O569147P262647
3628.4F35963559Q354187P797480P188380O972968O752253O639182O223023N361259
3644.7F91252291M843235N705595O799281O062031N137324N366504N378485M612625
3661G35157371L978073L523767K922833K797663L309548K974332K607762L258527L481507
3679.4G64011383L150404K716779K181649J912654K117574K425134K461016K229572
3695.7G83206165J730382J188517J216411J686156J543880P56383L41296R97066J781404
3714G94447660J566291J027584P87795O66976N69999P32660R33350N27501r6560J27435
$$ plain form
3593.7 505127847 512809932 520667970 528553128 536417007 544003487 551322937 558997929 567055702
3610 567055702 575033605 582891166 590535164 598381341 606848657 614974856 622131765 628700912 635963559
3628.4 635963559 644317746 652115226 659303606 666276574 673028827 679668009 685891032 691252291
3644.7 691252291 696095526 701801121 708600402 714662433 719799757 725166261 730544746 735157371
3661 735157371 739135444 742659211 745582044 748379707 751689255 754663587 757271349 760529876 764011383
3679.4 764011383 767161787 769878566 772060215 773972869 776090443 778515577 780976593 783206165
3695.7 783206165 784936547 786125064 787341475 789027631 790571511 791327894 791669190 792666256 794447660
3714 794447660 796013951 797041535 797829330 798496306 799066305 799798965 800732315 801259816 801163256 801290691
3734.4H01290691J140177J465857O61195l35455l05057N31077M00603M38273J386285
3752.8H06673646J437604P17223M44293P09891O57499L69489L29972L78191N29945
3771.1H12247753O69956M93527J90556J18911L58105M79162L60190L04878L98636L99828
3791.5H16021502K9683l35693k15650j37329k8729M23491M60803N48542P37309L40939
3811.9H17844868k61188l96669j92821k53439K45691Q94963O13273K09510O3300l1114
3832.3H18736374j61051l82305k55227L15905O33299P06554N68270n0544j042009j407385
3852.7H17661881K85566J485408P96854l0279k09928M0949p1228l69727N2809N04494
3873.1H20146799M43101K48611q0109j12116J6093N1677K76387P9155j68741L03090
$$ plain form
3734.4 801290691 802430868 803896725 804557920 804222465 803917408 804448485 804849088 805287361 806673646
3752.8 806673646 808111250 808828473 809272766 809982657 810640156 811009645 811339617 811717808 812247753
3771.1 812247753 812917709 813411236 813601792 813720703 814078808 814557970 814918160 815223038 815621674 816021502
3791.5 816021502 816051185 815715492 815499842 815362513 815333784 815757275 816218078 816766620 817503929 817844868
3811.9 817844868 817583680 817187011 816994190 816740751 816986442 817881405 818494678 818704188 818767488 818736374
3832.3 818736374 818575323 818193018 817937791 818253696 818886995 819593549 820161819 820111275 819069266 817661881
3852.7 817661881 817947447 819432855 820229709 820199430 819989502 820030451 819959223 819589496 819642305 820146799
3873.1 820146799 820589900 820838511 820758402 820646286 820662379 820714056 820990443 821069598 820900857 821203947
3893.5H21203947L94464l08812p94590n22494J79112O96421P17938M89056J75833k06470
3913.9H22024405l69787q4937J67251j7107r1195J90258J95742j15335o4314K91586
3934.3H22126567K73049k3067j03473N2452J08063o3837l2901K21788J53006j8120
3954.7H22693527J10745J98066N4837j7763R1553J45436K3007k2233J36257K52187
3975.1H23665619J69754L8385O0141J21057M0591J19R0719J22368O5506M4584J05560
3997.5H24524403
$$ plain form
3893.5 821203947 821598411 821289599 820495009 819972515 820151627 820848048 821565986 822055042 822230875 822024405
3913.9 822024405 821654618 821569681 821736932 821719825 821628630 821818888 822014630 821899295 821834981 822126567
3934.3 822126567 822399616 822376549 822273076 822325528 822433591 822369754 822336853 822558641 822711647 822693527
3954.7 822693527 822804272 823002338 823057175 823039412 823130965 823276401 823299408 823277175 823413432 823665619
3975.1 823665619 823835373 823873758 823933899 824054956 824095547 824095666 824186385 824308753 824374259 824418843 824524403
3997.5 824524403
##END=$$ End of the data block
