##TITLE=$$ Begin of the data block
##JCAMP-DX=5.00 $$ ACD/SpecManager v 10.08
##SPECTROMETER/DATA SYSTEM=Alpha
##DATE=14 Apr 2014 11:23:48
##DATA TYPE=INFRARED SPECTRUM
##DATA CLASS=XYDATA
##ORIGIN=
##OWNER=
##NPOINTS=1765
##FIRSTX=399.75695801
##LASTX=3997.56933594
##MAXX=3997.56933594
##MINX=399.75695801
##MAXY=0.85749769
##MINY=0.17765571
##XFACTOR=1.0000000000
##YFACTOR=1.000000000000000e-9
##FIRSTY=0.59550267
##DELTAX=2.03957629
##XUNITS=1/CM
##YUNITS=ARBITRARY UNITS
##XYDATA=(X++(Y..Y))
399.8 595502675 592688084 590088069 590251863 590203822 587206304 584374428 584240854 583592772 580723584
418.1 580723584 579931855 581354022 580429792 578199267 578254223 578867972 576927781 574612141 574643552
436.5 574643552 574827611 573270440 572540164 573948681 574087322 572047710 571392536 572477579 571850419
454.8 571850419 569576800 569092751 569643438 568144858 566048622 565790474 565339327 562841177 560835958
473.2 560835958 560811639 560179412 558054507 556958079 557332814 556645870 554740787 553977251 554110944
491.5 554110944 552759349 550489068 549629569 549387038 547580123 545466423 545112789 544897676 543030143
509.9 543030143 541195691 540699065 539687872 537202954 535214186 534402788 532801330 529986560 528114319
528.3 528114319 527402401 525751531 523213625 521942079 521844566 520854473 519159794 518508136 518201709
546.6 518201709 516493499 514382064 513623416 513125956 511213899 508988976 507756174 506209612 503318489
565 503318489 500502348 498557240 495908856 492038429 488900095 487148494 484904677 481648773 479200274
583.3 479200274 477646858 475022882 471509457 468869925 466666400 463405907 459768414 457152814
599.6 457152814 454732835 451301605 448417097 447805464 447982848 446957052 445839435 446635693 448971093
618 448971093 451713860 455475897 460554153 465116769 468374014 472027332 476705134 480591893 483146816
636.3 483146816 485998333 488850266 489476413 489025056 491282344 495635360 497765064 496888161 495995075
654.7 495995075 497524917 501939595 508391917 515418053 520695269 523668766 526959300 531327128
671 531327128 534580946 536324978 538684785 542678416 545663357 546797454 548836350 552178144 553927481
689.4 553927481 554085016 555595577 558150411 558830202 558422565 560026944 562790275 563829124 564409912
707.7 564409912 567326605 570857346 572319210 573711991 577452898 581207573 582784653 584789276
724 584789276 588946462 592267632 593290925 595161438 598905027 601218045 601475775 603215218 606768370
742.4 606768370 608654022 609016776 611351192 615072191 616672575 617112041 619857550 623551190 624853134
760.8 624853134 625560641 628844500 632519424 633513570 634246588 637235999 639484882 638679862 638029039
779.1 638029039 639466286 639650583 637384653 636615992 638755262 640464246 641385138 645250022 652024865
797.5 652024865 657678366 662156284 668857515 676575422 681228518 684040248 688740492 693497002
813.8 693497002 694802821 694940925 697021663 698156476 695358872 691759527 690054893 687238395 681529939
832.1 681529939 676571906 674032748 670513809 665050209 661070585 659217417 656481862 653321207
848.5 653321207 653875411 658543766 663913965 669981718 679488182 690879822 700088263 707887292
864.8 707887292 717351615 726578236 732107103 736031592 741621375 746374190 747377396 747615039 749603093
883.1 749603093 750070930 747173309 744771302 744714141 743660450 740980923 740716696 743380666 744864881
901.5 744864881 744773924 746631861 749688923 749946773 748085141 747465670 746700943 742603540 737250507
919.8 737250507 734260261 732265472 729103565 727275372 728974342 731251538 731572568 732322335 735050261
938.2 735050261 736767471 736109078 736135364 737669170 737345278 734473646 732045174 729951859 725007653
956.6 725007653 717525661 710306883 702397227 690895081 676636934 661982477 646182299 628267467
972.9 628267467 610810637 596391618 583959460 571973264 561388969 552869380 544877410 536672115
989.2 536672115 529793382 524963081 520723164 516418040 513302088 511590123 509521663 506171763
1005.5 506171763 502165198 497301489 490478784 482138574 474020779 466545254 458958209 451612294
1021.8 451612294 445505828 440215677 434732348 429367393 424899608 420972228 416954041 413305938
1038.1 413305938 410607994 408227742 405439198 402611345 400100231 397508770 394944847 393619329
1054.5 393619329 394287795 396324128 398868620 401535928 403504103 403376669 400661230 396285236 391218662
1072.8 391218662 385770857 380442291 375908375 371970534 367749870 362845957 357328326 351042956
1089.1 351042956 344014257 337296873 332353979 329686224 328925610 329741716 331791669 334237516 336282283
1107.5 336282283 337838352 338977724 339149654 337545842 333686262 327351481 319543481 313707411
1123.8 313707411 312929094 315958291 319003820 319860905 319194973 319330931 321745247 326032847 331045985
1142.2 331045985 335789502 339542150 342251360 344547689 346929252 349465162 352461696 356636435
1158.5 356636435 362376153 369609118 378459096 389146060 401133806 413313031 425155640 436760396
1174.8 436760396 447800100 457659215 466418058 474363744 480857342 484954447 486718208 486723930 485137761
1193.1 485137761 482539028 480613947 480844319 483279377 487339258 492727906 498711586 503863215
1209.5 503863215 507523477 510320604 512713730 514415562 515572667 516994417 518868089 520648062
1225.8 520648062 522392213 524737597 527580261 530257881 532882690 536031902 539359689 542054892
1242.1 542054892 544293225 546609938 548523307 549434602 549939334 550827503 551870763 552844644 554565430
1260.4 554565430 557632208 561427593 565500379 570429742 576440811 582639098 588560045 594916403
1276.8 594916403 601855993 608446002 614569247 621193826 628371060 635043979 641061008 647197306
1293.1 647197306 653169453 657949507 661822438 665805399 669554472 672152400 674160302 676525712
1309.4 676525712 678589225 679540634 680224717 681529343 682816029 683522105 684451699 686051190 687282801
1327.8 687282801 687557399 687758505 688138902 687735379 686580300 686098039 686511278 686549187 686122596 686247528
1348.1 686247528 686689734 686302364 685310125 684698164 684020519 682179749 679741144 677997053 676296949
1366.5 676296949 673633575 670713305 668040991 664744079 660072625 652977288 641287148 627440035
1382.8 627440035 621375918 628360689 639984727 646700859 648546815 648515940 647889853 646098256 643378198
1401.2 643378198 640643477 637944281 634979725 631936193 629535794 627746761 625723124 623513341
1417.5 623513341 622311711 622059524 621512711 620897233 620811224 620856225 620736063 620781660 621672094 623627841
1437.9 623627841 625618815 627668738 630192876 632740498 635307968 638718128 642875552 646998882
1454.2 646998882 652203918 660511494 669127703 676191986 683092356 690936089 698798299 706237733
1470.5 706237733 714580059 723710656 731678843 737483919 741566241 744958282 747253180 747621596
1486.8 747621596 746950924 746842146 746529937 744431198 741087615 738342941 735693097 731879413 726113379
1505.2 726113379 719144881 714026392 709524035 704507172 699457705 694773793 690594971 686723113
1521.5 686723113 683614075 680710435 677505434 674702466 671769440 668261945 665257633 662470579
1537.8 662470579 659127474 656818748 656213403 656357110 656454623 656194985 656097531 656340659 656228244 655395389
1558.2 655395389 655559599 656324267 655708194 653621376 650475144 646791041 642998576 637905717 630925536
1576.6 630925536 624422431 618225753 610938728 603018582 594810963 586186647 577161014 568075597
1592.9 568075597 559027255 550030768 541132748 532371402 523796260 515367329 506948173 498464465
1609.2 498464465 490173072 482127577 473414987 464083612 456704766 450259417 443127453 436513484
1625.5 436513484 430806577 425748587 421638578 417979240 414694309 413322210 413507313 414323807 415563375
1643.9 415563375 417718321 421243548 424765766 428830087 435624838 442480773 448532373 455116838
1660.2 455116838 462918192 471587598 479765385 488575727 499083608 509270191 519848943 531773448
1676.5 531773448 542941332 552949846 563691020 577912748 591891766 603527546 615051627
1690.8 615051627 625726223 636601448 648218036 659989715 673802435 685884297 695533752
1705.1 695533752 705100894 713693619 720700204 726322293 731414557 737355649 743548214 748563170
1721.4 748563170 752933800 757247686 760969520 764153719 767262995 771128774 775638998 779489279
1737.7 779489279 783368587 787616670 791382253 794686258 798190594 802060306 805858254 809103489
1754 809103489 812103748 814803660 816695273 818598747 821059346 822960973 823806882 824513793 826107740
1772.4 826107740 828192234 829671025 830944836 832539022 833811581 834550023 835635662 836893320
1788.7 836893320 837313533 837612689 839023054 840619206 841189027 841404080 842546821 843957484 844417334
1807 844417334 844433427 845254898 846416891 846776485 846874297 847689807 848426938 848195612 848043978 848790050
1827.4 848790050 849416018 849576712 850116134 851069272 851557016 851290524 851107836 851543367 852052212 852193296
1847.8 852193296 852702439 853641152 853897750 853574097 853902996 854738057 854807615 854265153 854178548 854494095
1868.2 854494095 854571700 854755223 855565667 856275380 856019735 855633497 856111050 856599569 856184661 855807662
1888.6 855807662 856456757 857002199 856554210 856341779 856986344 857242882 856727302 856672585 857276380 857311666
1909 857311666 856754184 856832206 857342720 857047737 856380880 856618762 857319951 857281506 856798351 857009530
1929.4 857009530 857497692 857135355 856545985 856804132 857077897 856367469 855774045 856245339 856609762 856072903
1949.8 856072903 855689526 856094122 856199801 855445564 855004191 855370045 855330288 854540944 854310095 854814947
1970.2 854814947 854715645 853984773 853869915 854277074 854004502 853276670 853270352 853635311 853207588 852408469
1990.6 852408469 852423191 852775693 852360845 851746798 851887822 852086008 851508856 850935698 851106763 851176322
2011 851176322 850489378 849938273 850109577 850100100 849446774 849098146 849341214 849177420 848470211 848247707
2031.4 848247707 848503947 848213971 847496033 847356737 847598314 847252548 846632540 846648157 846893013 846489489
2051.8 846489489 845893502 845921934 846077204 845633686 845161855 845321000 845472157 845037460 844693840 844934940
2072.2 844934940 845028937 844566226 844313979 844594061 844640553 844213128 844068348 844312012 844188571 843758643
2092.6 843758643 843804598 844133914 843982995 843621433 843754947 844071686 843912184 843608737 843765080 844013572
2113 844013572 843805432 843568563 843823493 844109356 843937755 843818903 844145000 844345391 844141304 844119728
2133.4 844119728 844474554 844599307 844361484 844377518 844729006 844815254 844639122 844786465 845159054 845188856
2153.8 845188856 845051646 845277429 845599651 845538318 845435023 845720708 846012235 845948637 845942855 846271157
2174.2 846271157 846491754 846384108 846398652 846693039 846817851 846696973 846791565 847118080 847191453 847021341
2194.6 847021341 847093105 847345591 847331882 847203672 847362101 847569525 847455204 847318053 847492993 847648501
2215 847648501 847499549 847413182 847651124 847798288 847612202 847525835 847712815 847744644 847541451 847540081 847763896
2237.4 847763896 847778499 847571194 847552717 847690940 847581267 847342849 847364783 847462952 847306848 847151220
2257.8 847151220 847258925 847323418 847122252 847007573 847206950 847340047 847205162 847194791 847443342 847538173
2278.2 847538173 847446799 847579539 847849369 847837210 847672939 847804666 848073959 848008811 847816408 847983420
2298.6 847983420 848274171 848231494 848111391 848290086 848476291 848374844 848331690 848600209 848793030 848653495
2319 848653495 848585308 848830581 848935902 848768532 848858654 849236846 849315822 849151552 849300265 849587977
2339.4 849587977 849463463 849250197 849628091 850226164 850395977 850268483 850311816 850478649 850330353 850113153
2359.8 850113153 850308716 850594997 850630403 850861073 851426005 851671457 851531923 851716459 852310777 852691174
2380.2 852691174 852788687 853110373 853580058 853648365 853460073 853646457 854041219 854033232 853848755 854047894
2400.6 854047894 854349732 854221821 854019940 854265094 854516983 854285657 854079604 854317367 854449332 854095161
2421 854095161 853782773 853881180 853946388 853761971 853844702 854295731 854442835 854150832 854074955 854331434 854332387
2443.4 854332387 854060054 854105711 854360521 854198456 853831530 853911340 854148567 853913784 853592455 853755772
2463.8 853755772 853947699 853654802 853365839 853529274 853616893 853267193 853059530 853285551 853320658 852899909
2484.2 852899909 852674961 852858365 852803349 852415800 852346718 852589369 852469146 852039695 851971745 852151692
2504.6 852151692 851931274 851527393 851605117 851872683 851659238 851263940 851284742 851385593 851067424 850775063
2525 850775063 850958705 851072609 850656867 850269735 850341201 850359976 850009024 849822760 850000441 849938154
2545.4 849938154 849512160 849348426 849522173 849392116 848953366 848861217 849031985 848807752 848321497 848192155
2565.8 848192155 848225534 847876370 847449720 847472250 847545922 847108305 846574426 846475184 846371830 845831037
2586.2 845831037 845385611 845412374 845310986 844728529 844250560 844152093 843859851 843207240 842798054 842723370
2606.6 842723370 842370510 841708124 841317415 841147363 840635240 839939117 839657545 839576483 839080989 838378787
2626.9 838378787 838010490 837732255 837103963 836491942 836317062 836130977 835478783 834814489 834570587 834269047
2647.3 834269047 833588183 833074391 832981765 832730532 832063854 831533372 831341207 830946088 830255866 829859376
2667.7 829859376 829768956 829366148 828652203 828212142 828002453 827473760 826752007 826385558 826202273 825670481
2688.1 825670481 825000584 824644685 824328542 823683739 823050916 822758198 822397113 821657121 820970118 820608377
2708.5 820608377 820147991 819380999 818753541 818438053 817965925 817184091 816552639 816169202 815587580 814779937
2728.9 814779937 814247131 814006448 813510656 812751472 812211454 811822176 811209798 810542226 810141325 809766829
2749.3 809766829 809100628 808371305 807836175 807252705 806432247 805719137 805315197 804813266 803986609 803204417
2769.7 803204417 802623212 801884353 800901592 800077319 799500346 798747599 797713578 796783388 796020627
2788.1 796020627 795063794 793920875 792963445 792135417 791077912 789837778 788710773 787649751 786435664
2806.4 786435664 785187006 784073591 782915175 781535149 780092418 778764486 777377844 775744319
2822.7 775744319 774048150 772465110 770785153 768814206 766686678 764433563 761795700 758592248
2839.1 758592248 754822195 750387788 745054901 739096522 733600676 729522407 726954818 725605428
2855.4 725605428 725167990 725087225 724661291 723563254 721882582 719706237 717183292 714749753 712717593
2873.7 712717593 710985899 709352911 707750797 706153214 704409182 702390313 700200498 697942793
2890.1 697942793 695552349 693019211 690402806 687678099 684830666 681929410 678954422 675672829
2906.4 675672829 671869874 667469084 662425041 656890273 651293874 646149516 641880989 638677001
2922.7 638677001 636566162 635564089 635542691 636215329 637439847 639275312 641737461 644672275 647795498
2941 647795498 650780678 653334796 655215979 656349957 656914532 657099426 657094836 657234609 657740116 658639550
2961.4 658639550 659893274 661382377 662978411 664629281 666265249 667679965 668754399 669663072
2977.8 669663072 670563638 671360075 671996593 672614694 673233390 673691690 673818469 673572361 673135817 672514260
2998.1 672514260 671589434 670500278 669327378 668035626 666704416 665409088 664065480 662512362
3014.5 662512362 660737634 658896685 657058895 655124068 653031647 650856495 648693264 646556258
3030.8 646556258 644433916 642262101 639950335 637550652 635147452 632697761 630092204 627335072
3047.1 627335072 624615788 622006953 619329274 616524458 613721311 610975385 608257949 605577886
3063.4 605577886 602995872 600461900 597806633 595041633 592352808 589813232 587302148 584666133
3079.7 584666133 581933200 579173565 576348126 573489964 570664585 567793787 564821064 561903596
3096 561903596 559133649 556277514 553161383 549978256 546936154 543933034 540759981 537542641 534500718
3114.4 534500718 531446338 528145254 524640203 521044075 517443240 513887942 510403574 506944418
3130.7 506944418 503362358 499669582 496058464 492493272 488752544 484871387 481046468 477270424
3147 477270424 473475158 469683915 465821207 461791158 457678109 453627855 449690670 445750058 441701651
3165.4 441701651 437637806 433637321 429633617 425601244 421641231 417760372 413818121 409758329
3181.7 409758329 405707359 401761740 397862911 393975854 390137881 386321425 382431179 378515631
3198 378515631 374727368 371067524 367432982 363787770 360183120 356683671 353249341 349812180 346421540
3216.4 346421540 343106240 339823276 336582035 333414495 330291927 327199489 324205369 321338832
3232.7 321338832 318476051 315546244 312678248 309942275 307278216 304670006 302114516 299565613
3249 299565613 297025442 294545859 292175710 289891362 287590027 285236537 282903433 280627191 278400421
3267.4 278400421 276258886 274133056 271909565 269620776 267336458 265133739 263030022 260895610
3283.7 260895610 258702844 256563604 254479855 252390385 250279546 248132303 245938256 243750349
3300 243750349 241668761 239726737 237776279 235653073 233402908 231166407 228998125 226890072 224865347
3318.4 224865347 222928926 221026495 219120070 217156261 215131462 213175952 211345717 209617272
3334.7 209617272 207982972 206345722 204620078 202859282 201104715 199415818 197905153 196447939
3351 196447939 194864109 193239242 191718996 190339535 189061165 187866792 186834171 185929626 184916481
3369.3 184916481 183680221 182472795 181542411 180794463 180086225 179389223 178796262 178394094 178222492
3387.7 178222492 178307712 178340569 178013265 177655712 177761838 178182840 178332433 178121358 178089380 178444609
3408.1 178444609 178919569 179340601 179697677 180101499 180691406 181398809 182127699 182994753 184065536
3426.5 184065536 185267821 186478227 187757134 189183131 190454379 191420481 192477882 193895683
3442.8 193895683 195539370 197308078 199097872 200870976 202733681 204733133 206878677 209127247
3459.1 209127247 211319983 213598371 216295183 219177440 221666917 223713219 225856274 228365168
3475.4 228365168 231163815 234056145 236782998 239463076 242348015 245310158 248233914 251266539
3491.7 251266539 254477650 257840782 261202574 264515579 267893910 271239251 274481893 277844638
3508 277844638 281489074 285404533 289343357 293071598 296807230 300802529 305055946 309262812 313290924
3526.4 313290924 317455828 321910679 326529145 331288338 336094946 340759575 345512331 350583285
3542.7 350583285 355801910 360826761 365672261 370695770 376039445 381500274 386960238 392563045
3559 392563045 398275107 403804153 409298301 415554583 422392815 428891122 435148001 441658050 448427171
3577.4 448427171 455323815 462303251 469156414 475868106 482940406 490500748 497910529 505251229
3593.7 505251229 512893915 520715654 528594792 536504626 544166565 551526129 559206128 567272067
3610 567272067 575251520 583127618 590789437 598600864 607094824 615306556 622449338 628929675 636157095
3628.4 636157095 644583523 652458668 659666359 666630328 673349798 679960728 686183870 691496909
3644.7 691496909 696287870 702034175 708855093 714899123 720051646 725428700 730744243 735275507
3661 735275507 739271402 742874682 745803773 748530626 751800776 754787862 757451713 760818005 764395297
3679.4 764395297 767588258 770271540 772368610 774199367 776260376 778696477 781232595 783536911
3695.7 783536911 785293043 786480725 787739217 789443731 790868938 791438282 791674793 792704225 794565260
3714 794565260 796170235 797199607 797979414 798652828 799255729 800005198 800904453 801367223 801208675 801322162
3734.4 801322162 802511573 804025650 804682016 804329395 804077804 804722071 805184245 805584192 806923211
3752.8 806923211 808341086 809033275 809489369 810246766 810898721 811201274 811518908 811962187 812529624
3771.1 812529624 813185394 813647926 813813090 813929617 814299643 814774930 815139115 815468550 815846920 816166818
3791.5 816166818 816124141 815777421 815623939 815576732 815580904 815974414 816431105 817022562 817775190 818073571
3811.9 818073571 817779183 817403078 817229569 816955149 817208707 818153143 818753779 818863332 818821132 818774223
3832.3 818774223 818675816 818347752 818122566 818454146 819098234 819816411 820400178 820381522 819342792 817793667
3852.7 817793667 817895949 819380283 820246279 820274591 820123076 820167661 820025206 819599509 819661140 820177794
3873.1 820177794 820599973 820847988 820833981 820787907 820793152 820826113 821143031 821263492 821079850 821329415
3893.5 821329415 821679771 821338534 820548177 820112467 820341527 821037710 821797729 822288036 822417080 822167695
3913.9 822167695 821734130 821595430 821773291 821818471 821780860 821967602 822103620 821923673 821889520 822298765
3934.3 822298765 822632492 822584569 822458565 822473466 822484970 822352052 822329938 822590113 822804987 822865784
3954.7 822865784 823018134 823228776 823286533 823259056 823307574 823390186 823434412 823487937 823629081 823827565 823931396
3977.1 823931396 823927522 824006319 824174702 824238360 824243784 824349344 824482024 824560881 824635208 824744582
3997.5 824744582
##END=$$ End of the data block
