##TITLE=$$ Begin of the data block
##JCAMP-DX=5.00 $$ ACD/SpecManager v 10.08
##SPECTROMETER/DATA SYSTEM=Alpha
##DATE=14 Apr 2014 11:23:48
##DATA TYPE=INFRARED SPECTRUM
##DATA CLASS=XYDATA
##ORIGIN=
##OWNER=
##NPOINTS=1765
##FIRSTX=399.75695801
##LASTX=3997.56933594
##MAXX=3997.56933594
##MINX=399.75695801
##MAXY=0.85761541
##MINY=0.17813796
##XFACTOR=1.0000000000
##YFACTOR=1.000000000000000e-9
##FIRSTY=0.59284574
##DELTAX=2.03957629
##XUNITS=1/CM
##YUNITS=ARBITRARY UNITS
##XYDATA=(X++(Y..Y))
$$ plain form
399.8 592845738 590766370 588235378 588536322 588540494 585258067 582525373 582912743 582448483 579387367
418.1 579387367 578649163 580141485 578933954 576445103 576378286 576940060 575326920 573485315 573533118
436.5 573533118 573447824 571764171 571092308 572548330 572686017 570639789 569887578 570941448 570469201
454.8 570469201 568456650 568144500 568590760 566978037 564852774 564533174 564199865 561945558 560059667
473.2 560059667 560019493 559286535 557123601 556130528 556613147 555896401 553910613 553222060 553555429 552326798
493.6 552326798 550018549 549043715 548701406 546908319 545014262 544864476 544502735 542265892 540304422
511.9 540304422 539998055 539092958 536517024 534614146 533991575 532345891 529433250 527531981 526789784
530.3 526789784 525123596 522526622 521195531 521012187 519861698 518122435 517637074 517554283 516009808
$$ packed form
399.8E92845738k079368k530992L00944M172l282427k732694L87370m64260l061116
418.1E79387367p38204J492322j207531k488851o6817N61774j613140j841605M7803
436.5E73533118q5294j683653o71863J456022J37687k046228p52211J053870m72247
454.8E70469201k012551l12150M46260j612723k125263l19600l33309k254307j885891
473.2E60059667m0174p32958k162934r93073M82619p16746j985788o88553L33369j228631
493.6E52326798k308249r74834l42309j793087j894057j49786l61741k236843j961470
511.9E40304422l06367r05097k575934j902878o22571j645684k912641j901269p42197
530.3E26789784j666188k596974j331091j83344j150489j739263m85361q2791j544475
$$ plain form
548.6 516009808 514109015 513571024 513031781 510831773 508434117 507271349 505739272 502641022 499621481
567 499621481 497632116 495128810 491575986 488615990 486731887 484365880 481209874 478835583 477167457
585.4 477167457 474425375 470848888 468211532 466129482 462946057 459300190 456686229 454252928
601.7 454252928 450771362 447852045 447320491 447621673 446646780 445515960 446201295 448452175 451294541
620 451294541 455167323 460200876 464670628 467902571 471667916 476552367 480534852 483068973 485886931
638.4 485886931 488690495 489267796 488821208 491139978 495555967 497702718 496753216 495763183 497309715
656.7 497309715 501840234 508389711 515477419 520804584 523784161 526978791 531226516 534465253
673.1 534465253 536286831 538686931 542671442 545692086 546856940 548852563 552166998 554003477
$$ packed form
548.6E16009808j900793n37991n39243k200008k397656j162768j532077l098250l019541
567D99621481j989365k503306l552824k959996j884103k366007l156006k374291j668126
585.4D77167457k742082l576487k637356k082050l183425l645867k613961k433301
601.7D54252928l481566k919317n31554L01182r74893j130820O85335K250880K842366
620D51294541L872782N033553M469752L231943L765345M884451L982485K534121K817958
638.4D85886931K803564N77301m46588K318770M415989K146751r49502r90033J546532
656.7D97309715M530519O549477P087708N327165K979577L194630M247725L238737
673.1E34465253J821578K400100L984511L020644J164854J995623L314435J836479
$$ plain form
689.4 554003477 554337919 555985689 558556020 559173882 558705211 560286164 563015997 564005375 564588606
707.7 564588606 567550123 571154237 572712302 574131608 577794373 581482232 583055496 585059524
724 585059524 589205265 592482090 593447566 595311701 599044323 601307511 601588011 603427410 607062638
742.4 607062638 608991385 609366477 611728489 615436852 616932452 617337048 620168686 623901606 625145018
760.8 625145018 625852287 629187882 632785141 633639157 634338677 637361288 639643848 638895273 638256550
779.1 638256550 639595330 639682055 637425959 636737585 638898492 640545368 641469181 645447910 652293801
797.5 652293801 657908678 662354469 669018030 676636338 681257248 684143841 688911498 693702459
813.8 693702459 695010245 695060194 697017908 698090911 695339203 691858053 690189600 687337577 681656837
$$ packed form
689.4E54003477L34442J647770K570331O17862m68671J580953K729833R89378N83231
707.7E64588606K961517L604114J558065J419306L662765L687859J573264K004028
724E85059524M145741L276825R65476J864135L732622K263188K80500J839399L635228
742.4F07062638J928747L75092K362012L708363J495600M04596K831638L732920J243412
760.8F25145018P07269L335595L597259Q54016O99520L022611K282560p48575o38723
779.1F38256550J338780Q6725k256096o88374K160907J646876R23813L978729O845891
797.5F52293801N614877M445791O663561P618308M620910K886593M767657M790961
813.8F93702459J307786M9949J957714J073003k751708l481150j668453k852023n680740
$$ plain form
832.1 681656837 676787555 674302578 670721829 665158451 661216378 659460604 656721056 653546870
848.5 653546870 654144406 658816338 664100528 670070350 679533780 690890491 700057685 707858026
864.8 707858026 717345655 726529598 731985748 735947192 741652429 746437848 747357905 747505426 749485373
883.1 749485373 750007868 747142076 744708478 744602084 743550956 740914464 740632951 743199408 744656742
901.5 744656742 744666696 746614993 749686658 749906242 748002231 747362554 746573210 742475331 737167954
919.8 737167954 734230518 732239664 729030490 727166474 728852749 731112242 731416702 732145607 734825969
938.2 734825969 736522794 735921562 735996068 737506986 737164438 734320402 731907070 729784191 724801958
956.6 724801958 717286050 710050464 702155948 690657437 676416516 661851287 646143675 628248811
$$ packed form
832.1F81656837m869282k484977l580749n563378l942073j755774k739548l174186
848.5F53546870N97536M671932N284190N969822R463430J1356711R167194P800341
864.8G07858026R487629R183943N456150L961444N705237M785419R20057J47521J979947
883.1G49485373N22495k865792k433598j06394j051128k636492k81513K566457J457334
901.5G44656742R954J948297L071665K19584j904011o39677p89344m097879n307377
919.8G37167954k937436j990854l209174j864016J686275K259493L04460P28905K680362
938.2G34825969J696825o01232P4506J510918l42548k844036k413332k122879m982233
956.6G24801958p515908p235586p894516j1498511j4240921j4565229j5707612j7894864
$$ plain form
972.9 628248811 610793173 596411169 584005833 572004557 561396420 552876413 544887304 536655605
989.2 536655605 529715359 524794161 520503223 516226232 513113081 511330724 509192288 505807757
1005.5 505807757 501784980 496893525 490049511 481748044 473699778 466257155 458687514 451376885
1021.8 451376885 445278823 439973563 434491575 429150522 424753487 420920670 416952103 413305998
1038.1 413305998 410615563 408274829 405512780 402667880 400149584 397607386 395114750 393809408
1054.5 393809408 394453675 396467060 398962647 401565969 403503478 403358698 400629342 396279454 391273171
1072.8 391273171 385869741 380549788 376009315 372067779 367842525 362959623 357494295 351225168
1089.1 351225168 344179034 337470949 332562208 329931766 329189926 329985291 332015425 334490091 336586237
$$ packed form
972.9F28248811j7455638j4382004j2405336j2001276j0608137q520007p989109q231699
989.2E36655605o940246m921198m290938m276991l113151j782357k138436l384531
1005.5E05807757m022777m891455o844014q301467q048266p442623p569641p310629
1021.8D51376885o098062n305260n481988n341053m397035l832817l968567l646105
1038.1D13305998k690435k340734k762049k844900k518296k542198k492636j305342
1054.5C93809408O44267K013385K495587K603322J937509j44780k729356m349888n006283
1072.8C91273171n403430n319953m540473l941536m225254m882902n465328o269127
1089.1C51225168p046134o708085m908741k630442p41840P95365K030134K474666K096146
$$ plain form
1107.5 336586237 338169515 339304179 339446694 337779254 333858848 327518582 319712281 313836008
1123.8 313836008 313005239 315995604 319047689 319976479 319376081 319528282 321927339 326171935 331157148
1142.2 331157148 335895330 339605153 342255384 344551802 346992314 349596769 352641702 356819183
1158.5 356819183 362517416 369713455 378555864 389259815 401267171 413422108 425219297 436809391
1174.8 436809391 447838515 457681686 466420203 474308789 480744809 484826654 486596763 486627966
1191.1 486627966 485086620 482519597 480593413 480805397 483232111 487304986 492710769 498689950
1207.4 498689950 503821194 507460773 510240495 512624085 514321864 515492260 516949058 518830597
1223.7 518830597 520566344 522269249 524651349 527585745 530307889 532921314 536058486 539374828
$$ packed form
1107.5C36586237J583278J134664J42515j667440l920406o340266p806301n876273
1123.8C13836008q30769K990365L052085R28790o00398J52201K399057M244596M985213
1142.2C31157148M738182L709823K650231K296418K440512K604455L044933M177481
1158.5C56819183N698233P196039Q842409J0703951J2007356J2154937J1797189J1590094
1174.8D36809391J1029124R843171Q738517P888586O436020M081845J770109L1203
1191.1D86627966j541346k567023j926184K11984K426714M072875N405783N979181
1207.4D98689950N131244L639579K779722K383590J697779J170396J456798J881539
1223.7E18830597J735747J702905K382100K934396K722144K613425L137172L316342
$$ plain form
1240.1 539374828 542071462 544356048 546733975 548683584 549592793 550063610 550926685 551961660 552928507
1258.4 552928507 554649234 557715058 561475515 565484107 570368171 576348066 582498848 588377059
1274.7 588377059 594706237 601607203 608167291 614302874 620955467 628141642 634811938 640836537
1291 640836537 646977723 652946055 657739758 661650479 665670037 669429183 672030210 674058914 676436782
1309.4 676436782 678492785 679448426 680160820 681504130 682817042 683521807 684450150 686061263 687289834
1327.8 687289834 687551379 687748849 688119888 687700152 686561286 686122477 686539233 686542451 686101973 686243474
1348.1 686243474 686703742 686343193 685402930 684826136 684145153 682301164 679877758 678145885 676437974
1366.5 676437974 673756182 670833409 668163419 664840341 660128176 652988136 641266644 627447188
$$ packed form
1240.1E39374828K696634K284586K377927J949609R09209M70817Q63075J034975R66847
1258.4E52928507J720727L065824L760457M008592M884064N979895O150782N878211
1274.7E88377059O329178O900966O560088O135583O652593P186175O670296O024599
1291F40836537O141186N968332M793703L910721M019558L759146K601027K028704K377868
1309.4F76436782K056003R55641P12394J343310J312912P04765R28343J611113J228571
1327.8F87289834K61545J97470L71039m19736j138866m38809M16756L218m40478J41501
1348.1F86243474M60268l60549r40263n76794o80983j843989k423406j731873j707911
1366.5F76437974k681792k922773k669990l323078m712165p140040j1721492j3819456
$$ plain form
1382.8 627447188 621439874 628455043 640076101 646756411 648571968 648544073 647926390 646159351 643482089
1401.2 643482089 640774965 638068497 635062277 631994128 629600406 627793431 625729442 623507917
1417.5 623507917 622315824 622047246 621498406 620943189 620933235 621019065 620902240 620953381 621869862 623807073
1437.9 623807073 625731766 627733290 630211174 632694781 635244608 638698041 642889082 647018373
1454.2 647018373 652234912 660549641 669141114 676183403 683083534 690929592 698784411 706224442
1470.5 706224442 714580119 723711073 731660903 737455010 741548836 744956195 747263134 747643888
1486.8 747643888 746958792 746833146 746539772 744439304 741036892 738242447 735593557 731808901 726073980
1505.2 726073980 719118953 714012861 709512234 704497516 699479401 694806576 690616310 686772764
$$ packed form
1382.8F27447188o007314P015169J1621058O680310J815557k7895o17683j767039k677262
1401.2F43482089k707124k706468l006220l068149k393722j806975k063989k221525
1417.5F23507917j192093k68578n48840n55217r954Q5830j16825N1141R16481J937211
1437.9F23807073J924693K001524K477884K483607K549827L453433M191041M129291
1454.2F47018373N216539Q314729Q591473P042289O900131P846058P854819P440031
1470.5G06224442Q355677R130954P949830N794107M093826L407359K306939L80754
1486.8G47643888o85096j25646k93374k100468l402412k794445k648890l784656n734921
1505.2G26073980o955027n106092m500627n014718n018115m672825m190266l843546
$$ plain form
1521.5 686772764 683698237 680808961 677635133 674881697 671977222 668438792 665398061 662631869
1537.8 662631869 659336984 657065451 656497955 656672776 656787276 656530082 656421721 656657100 656540990
1556.2 656540990 655697703 655870080 656646550 656027317 653937340 650773764 647056282 643267930 638211548
1574.5 638211548 631266117 624788046 618596315 611290216 603349328 595116794 586448491 577397823
1590.9 577397823 568318009 559255123 550232291 541332722 532566071 523973584 515518188 507038534
1607.2 507038534 498494685 490185529 482161850 473485380 464147002 456733376 450271726 443120390
1623.5 443120390 436479717 430769831 425731152 421625316 417941511 414638311 413268089 413446307
1639.8 413446307 414285630 415593982 417772800 421256304 424794704 428939521 435764521 442576468
$$ packed form
1521.5F86772764l074527k889276l173828k753436k904475l538430l040731k766192
1537.8F62631869l294885k271533n67496J74821J14500k57194j08361K35379j16110
1556.2F56540990q43287J72377P76470o19233k089977l163576l717482l788352n056382
1574.5F38211548o945431o478071o191731p306099p940888q232534q668303r050668
1590.9E77397823r079814r062886r022832q899569q766651q592487q455396q479654
1607.2E07038534q543849q309156q023679q676470r338378p413626o461650p151336
1623.5D43120390o640673n709886n038679m105836l683805l303200j370222J78218
1639.8D13446307Q39323J308352K178818L483504L538400M144817O825000O811947
$$ plain form
1656.1 442576468 448598564 455217719 463098168 471802980 479993790 488842875 499376178 509581506
1672.4 509581506 520175219 532063246 543200552 553231418 564013362 578252614 592236519
1686.7 592236519 603886843 615393877 626029313 636894524 648521066 660288393 674061418
1701 674061418 686106563 695748568 705304265 713881314 720900357 726556063 731661737 737587035
1717.3 737587035 743758857 748767614 753156126 757485569 761196196 764361203 767466545 771362126
1733.6 771362126 775896490 779716909 783560991 787809253 791600704 794923007 798412025 802254260
1749.9 802254260 806030452 809260547 812263012 814984441 816892207 818784773 821218550 823091149
1766.3 823091149 823927164 824655890 826280236 828394651 829897344 831167698 832737923 833995402 834735334
$$ packed form
1656.1D42576468O022096O619155P880449Q704812Q190810Q849085J0533303J0205328
1672.4E09581506J0593713J1888027J1137306J0030866J0781944J4239252J3983905
1686.7E92236519J1650324J1507034J0635436J0865211J1626542J1767327J3773025
1701F74061418J2045145R642005R555697Q577049P019043N655706N105674N925298
1717.3G37587035O171822N008757M388512M329443L710627L165007L105342L895581
1733.6G71362126M534364L820419L844082M248262L791451L322303L489018L842235
1749.9H02254260L776192L230095L002465K721429J907766J892566K433777J872599
1766.3H23091149Q36015P28726J624346K114415J502693J270354J570225J257479P39932
$$ plain form
1784.6 834735334 835831702 837079585 837454081 837736905 839194775 840825975 841387510 841590703 842740715
1803 842740715 844160020 844626129 844650984 845466435 846605003 846948266 847047329 847859383 848573029 848323047
1823.4 848323047 848171949 848914027 849529088 849708319 850282729 851230621 851669371 851392448 851268470 851746976
1843.8 851746976 852251410 852407038 852942705 853878856 854112983 853779674 854121447 854947209 854993224 854478776
1864.2 854478776 854441643 854747951 854765773 854918063 855742633 856468737 856209874 855840802 856360495 856838405
1884.6 856838405 856367290 855974615 856635809 857157350 856698453 856542945 857236028 857493222 856974781 856924117
1904.9 856924117 857506514 857485414 856898248 856995463 857518792 857225478 856570780 856818736 857499063 857417047
1925.3 857417047 856927037 857151389 857615411 857244194 856703579 857000709 857262731 856521368 855918169 856395125
$$ packed form
1784.6H34735334J096368J247883L74496K82824J457870J631200N61535K03193J150012
1803H42740715J419305M66109K4855Q15451J138568L43263R9063Q12054P13646k49982
1823.4H48323047j51098P42078O15061J79231N74410R47892M38750k76923j23978M78506
1843.8H51746976N04434J55628N35667R36151K34127l33309L41773Q25762M6015n14448
1864.2H54478776l7133L06308J7822J52290Q24570P26104k58863l69072N19693M77910
1884.6H56838405m71115l92675O61194N21541m58897j55508O93083K57194n18441n0664
1904.9H56924117N82397k1100n87166R7215N23329k93314o54698K47956O80327q2016
1925.3H57417047m90010K24352M64022l71217n40615K97130K62022p41363o03199M76956
$$ plain form
1945.7 856395125 856746674 856209278 855854034 856268883 856365263 855623722 855219424 855593443 855516374 854705811
1966.1 854705811 854493678 855015457 854919374 854208887 854117334 854508340 854207754 853486896 853492320 853828073
1986.5 853828073 853356540 852561712 852625966 852998734 852577567 851990044 852164030 852339387 851704597 851116836
2006.9 851116836 851308644 851377785 850699246 850199401 850406408 850365043 849665105 849312246 849566042 849397361
2027.3 849397361 848677397 848446488 848712683 848444939 847736120 847579718 847806633 847463071 846835494 846836567
2047.7 846836567 847071111 846670151 846095085 846117020 846231937 845799088 845386803 845559418 845671594 845209837
2068.1 845209837 844889581 845173836 845266521 844766021 844505250 844791591 844808519 844360471 844236135 844493628
2088.5 844493628 844373584 843958974 844003081 844318449 844178021 843829393 843959451 844265342 844098866 843802989
$$ packed form
1945.7H56395125L51549n37396l55244M14849R6380p41541m04298L74019p7069q10563
1966.1H54705811k12133N21779r6083p10487r1553L91006l00586p20858N424L35753
1986.5H53828073m71533p94828O4254L72768m21167n87523J73986J75357o34790n87761
2006.9H51116836J91808O9141o78539m99845K07007m1365o99938l52859K53796j68681
2027.3H49397361p19964k30909K66195k67744p08819j56402K26915l43562o27577J073
2047.7H46836567K34544m00960n75066K1935J14917m32849m12285J72615J12176m61757
2068.1H45209837l20256K84255R2685n00500k60771K86341J6928m48048j24336K57493
2088.5H44493628j20044m14610M4107L15368j40428l48628J30058L05891j66476k95877
$$ plain form
2108.9 843802989 843963444 844203234 843997657 843778431 844029665 844286621 844117284 844029903 844358981 844538093
2129.3 844538093 844327152 844324589 844694674 844803631 844576001 844639838 844988942 845039308 844869494 845039129
2149.7 845039129 845405400 845425248 845292330 845529735 845860720 845780432 845649362 845936179 846257389 846212626
2170.1 846212626 846187949 846491158 846704662 846603394 846634150 846943796 847071588 846939623 847018242 847331345
2190.5 847331345 847410083 847280800 847382724 847617090 847571075 847424805 847583413 847799897 847697854 847574055
2210.9 847574055 847752333 847907305 847787440 847738147 847947598 848031282 847834885 847783566 847974360 847972631
2231.3 847972631 847766638 847802043 848039687 848023653 847808659 847813725 847938418 847788692 847536385 847579896
2251.7 847579896 847700775 847539842 847382963 847523332 847624063 847439885 847327769 847514570 847632647 847491682
$$ packed form
2108.9H43802989J60455K39790k05577k19226K51234K56956j69337q7381L29078J79112
2129.3H44538093k10941k563L70085J08957k27630O3837L49104N0366j69814J69635
2149.7H45039129L66271J9848j32918K37405L30985q0288j31070K86817L21210m4763
2170.1H46212626k4677L03209K13504j01268L0756L09646J27792j31965P8619L13103
2190.5H47331345P8738j29283J01924K34366m6015j46270J58608K16484j02043j23799
2210.9H47574055J78278J54972j19865m9293K09451Q3684j96397n1319J90794j729
2231.3H47972631k05993L5405K37644j6034k14994N066J24693j49726k52307M3511
2251.7H47579896J20879j60933j56879J40369J00731j84178j12116J86801J18077j40965
$$ plain form
2272.1 847491682 847479641 847723722 847810090 847693086 847795546 848086298 848139286 848018527 848143637 848389030
2292.5 848389030 848324001 848155558 848314345 848536074 848426759 848279119 848450959 848663628 848628581 848644197
2312.9 848644197 848910332 849036813 848842442 848798454 849109411 849281430 849165261 849236131 849542081 849607885
2333.3 849607885 849479795 849591434 849796832 849676013 849523902 849927902 850526094 850692749 850601733 850735664
2353.6 850735664 850936651 850756049 850548208 850788116 851047754 850968480 851133525 851741791 852055371 851954520
2374 851954520 852152884 852722824 853058279 853138864 853460550 853918731 853981555 853810251 854010046 854392231
2394.4 854392231 854370475 854209304 854447424 854747474 854601562 854404390 854643822 854887486 854687572 854529083
2414.8 854529083 854785264 854886711 854478896 854134917 854207814 854236841 854060054 854199529 854683578 854824364
$$ packed form
2272.1H47491682j2041K44081Q6368j17004J02460K90752N2988j20759J25110K45393
2292.5H48389030o5029j68443J58787K21729j09315j47640J71840K12669l5047J5616
2312.9H48644197K66135J26481j94371m3988L10957J72019j16169P0870L05950O5804
2333.3H49607885j28090J11639K05398j20819j52111M04000N98192J66655r1016J33931
2353.6H50735664K00987j80602k07841K39908K59638p9274J65045O08266L13580j00851
2374H51954520J98364N69940L35455Q0585L21686M58181O2824j71304J99795L82185
2394.4H54392231k1756j61171K38120L00050j45912j97172K39432K43664j99914j58489
2414.8H54529083K56181J01447m07815l43979P2897K9027j76787J39475M84049J40786
$$ plain form
2435.2 854824364 854513466 854414165 854636550 854606986 854373753 854494870 854760647 854557335 854158044 854234934
2455.6 854234934 854491413 854288816 853972435 854093790 854254246 853979468 853728771 853908658 853980958 853610992
2476 853610992 853411973 853646398 853667617 853258014 853065073 853267670 853224754 852840483 852765858 852992654
2496.4 852992654 852857113 852449477 852399051 852553308 852326334 851952612 852049589 852302790 852064371 851674318
2516.8 851674318 851703525 851761103 851389349 851096094 851299584 851414263 850996017 850629985 850750744 850798666
2537.2 850798666 850446105 850264966 850436747 850339234 849885166 849730492 849917293 849768341 849304795 849225640
2557.6 849225640 849435270 849231541 848744392 848603845 848638892 848297715 847847819 847836256 847901046 847481072
2578 847481072 846971571 846876383 846762180 846225977 845802844 845837891 845711827 845119834 844666898 844566464
$$ packed form
2435.2H54824364l10898r9301K22385k9564k33233J21117K65777k03312l99291P6890
2455.6H54234934K56479k02597l16381J21355J60456k74778k50697J79887P2300l69966
2476H53610992j99019K34425K1219m09603j92941K02597m2916l84271p4625K26796
2496.4H52992654j35541m07636n0426J54257k26974l73722R6977K53201k38419l90053
2516.8H51674318K9207N7578l71754k93255K03490J14679m18246l66032J20759M7922
2537.2H50798666l52561j81139J71781r7513m54068j54674J86801j48952m63546p9155
2557.6H49225640K09630k03729m87149j40547L5047l41177m49896j1563O4790m19974
2578H47481072n09501r5188j14203n36203m23133L5047j26064n91993m52936j00434
$$ plain form
2598.4 844566464 844223738 843524098 843122482 843089402 842775226 842131436 841721416 841519773 841009378 840352178
2618.8 840352178 840095103 839996755 839482248 838788688 838433444 838158965 837551415 836962104 836773038 836548924
2639.2 836548924 835876882 835225523 834991813 834681630 834012449 833551824 833516002 833265245 832558870 832011580
2659.6 832011580 831815004 831394315 830679417 830285192 830199838 829785049 829069495 828654885 828469515 827945769
2680 827945769 827250540 826929867 826741397 826167703 825480461 825111032 824753702 824065268 823427618 823183000
2700.4 823183000 822876930 822147310 821439326 821045518 820549548 819791317 819224834 818942249 818462014 817698896
2720.8 817698896 817097366 816701889 816085041 815266728 814742446 814503849 814021349 813279688 812733412 812313259
2741.2 812313259 811661482 810980141 810603321 810273886 809634387 808886051 808333814 807778299 806980431 806255937
$$ packed form
2598.4H44566464l42726o99640m01616l3080l14176o43790m10020k01643n10395o57200
2618.8H40352178k57075r8348n14507o93560l55244k74479o07550n89311j89066k24114
2639.2H36548924o72042o51359k33710l10183o69181m60625l5822k50757p06375n47290
2659.6H32011580j96576m20689p14898l94225q5354m14789p15554m14610j85370n23746
2680H27945769o95229l20673j88470n73694o87242l69429l57330o88434o37650k44618
2700.4H23183000l06070p29620p07984l93808m95970p58231n66483k82585m80235p63118
2720.8H17698896o01530l95477o16848q18313n24282k38597m82500p41661n46276m20153
2741.2H12313259o51777o81341l76820l29435o39499p48336n52237n55515p97868p24494
$$ plain form
2761.6 806255937 805833459 805316567 804486394 803701997 803101897 802339733 801350296 800533652 799966872 799232304
2782 799232304 798230410 797327042 796566308 795604229 794476986 793535829 792701662 791641891 790429413
2800.3 790429413 789341807 788283408 787033796 785762846 784658134 783491731 782080173 780630708
2816.6 780630708 779293716 777885973 776255548 774576724 773020983 771371543 769423246 767325580
2832.9 767325580 765094399 762421727 759150028 755365551 750969291 745669246 739749491 734281123
2849.3 734281123 730157077 727519035 726142347 725695372 725601435 725190938 724145472 722485065 720263243
2867.6 720263243 717700958 715273142 713256419 711525440 709885120 708294809 706716597 704972446
2883.9 704972446 702958047 700795710 698566735 696169138 693598807 690964043 688255787 685429931
$$ packed form
2761.6H06255937m22478n16892q30173p84397o00100p62164r89437q16644n66780p34568
2782G99232304j001894r03368p60734r62079j127243r41157q34167j059771j212478
2800.3G90429413j087606j058399j249612j270950j104712j166403j411558j449465
2816.6G80630708j336992j407743j630425j678824j555741j649440j948297k097666
2832.9G67325580k231181k672672l271699l784477m396260n300045n919755n468368
2849.3G34281123m124046k638042j376688m46975r3937m10497j045466j660407k221822
2867.6G20263243k562285k427816k016723j730979j640320j590311j578212j744151
2883.9G04972446k014399k162337k228975k397597k570331k634764k708256k825856
$$ plain form
2900.2 685429931 682517171 679506958 676219285 672451913 668102086 663097978 657551527 651908696
2916.6 651908696 646739781 642468691 639287710 637209713 636224329 636218429 636899531 638135910 640004158
2934.9 640004158 642473936 645364821 648458898 651465297 654034555 655886948 656975210 657520056
2951.2 657520056 657725155 657756031 657905996 658420026 659362197 660637438 662097692 663686991 665343225
2969.6 665343225 666911006 668252349 669328690 670259356 671149909 671927750 672582686 673215091 673803926
2987.9 673803926 674238384 674400151 674209774 673765481 673100471 672142744 671043694 669917524 668665886
3006.3 668665886 667317331 666017890 664696395 663142264 661362529 659530044 657682121 655733466
3022.6 655733466 653643191 651468635 649313867 647207379 645108759 642932296 640603304 638188004
$$ packed form
2900.2F85429931k912760l010213l287673l767372m349827n004108n546451n642831
2916.6F51908696n168915m271090l180981k077997r85384n900O81102J236379J868248
2934.9F40004158K469778K890885L094077L006399K569258J852393J088262N44846
2951.2F57520056K05099L0876J49965N14030R42171J275241J460254J589299J656234
2969.6F65343225J567781J341343J076341R30666Q90553P77841O54936O32405N88835
2987.9F73803926M34458J61767j90377m44293o65010r57727j099050j126170j251638
3006.3F68665886j348555j299441j321495j554131j779735j832485j847923j948655
3022.6F55733466k090275k174556k154768k106488k098620k176463k328992k415300
$$ plain form
3038.9 638188004 635781825 633353472 630780160 628032267 625311017 622720182 620052516 617225528
3055.3 617225528 614391983 611659348 609005094 606361151 603769839 601237655 598591864 595797181
3071.6 595797181 593089879 590599358 588133216 585498393 582762003 580010772 577174187 574283123
3087.9 574283123 571453929 568593323 565614104 562690973 559912980 557066917 554000676 550849974
3104.2 550849974 547812462 544833183 541681290 538435280 535333931 532250285 528955221 525441945
3120.5 525441945 521810055 518206894 514714301 511276007 507770777 504106164 500376046 496777713
3136.8 496777713 493244618 489512920 485620558 481795400 478038639 474272043 470502108 466652185
3153.2 466652185 462614685 458492935 454470366 450556368 446584433 442480952 438371658 434331238
$$ packed form
3038.9F38188004k406179k428353k573312k747893k721250k590835k667666k826988
3055.3F17225528k833545k732635k654254k643943k591312k532184k645791k794683
3071.6E95797181k707302k490521k466142k634823k736390k751231k836585k891064
3087.9E74283123k829194k860606k979219k923131k777993k846063l066241l150702
3104.2E50849974l037512k979279l151893l246010l101349l083646l295064l513276
3120.5E25441945l631890l603161l492593l438294l505230l664613l730118l598333
3136.8D96777713l533095l731698l892362l825158l756761l766596l769935l849923
3153.2D66652185m037500m121750m022569l913998l971935m103481m109294m040420
$$ plain form
3169.5 434331238 430328399 426328480 422343314 418407589 414466351 410446346 406436890 402505189
3185.8 402505189 398566157 394630939 390789151 386986881 383118778 379219949 375414431 371735066
3202.1 371735066 368093461 364466608 360920072 357452124 353959680 350426823 346985161 343672246
3218.4 343672246 340422928 337209940 334036171 330876052 327737898 324729115 321886092 319038063
3234.7 319038063 316100329 313226730 310489863 307829529 305227816 302670509 300107539 297569364
3251.1 297569364 295118690 292754650 290436566 288096011 285737216 283423692 281138241 278883427
3267.4 278883427 276738524 274645746 272465676 270172387 267859966 265645802 263506860 261352509
3283.7 261352509 259196162 257086426 255019397 252931952 250791609 248639658 246481121 244331867
$$ packed form
3169.5D34331238m002839l999919l985166l935725l941238m020005m009456l931701
3185.8D02505189l939032l935218l841788l802270l868103l898829l805518l679365
3202.1C71735066l641605l626853l546536l467948l492444l532857l441662l312915
3218.4C43672246l249318l212988l173769l160119l138154l008783k843023k848029
3234.7C19038063k937734k873599k736867k660334k601713k557307k562970k538175
3251.1B97569364k450674k364040k318084k340555k358795k313524k285451k254814
3267.4B78883427k144903k092778k180070k293289k312421k214164k138942k154351
3283.7B61352509k156347k109736k067029k087445k140343k151951k158537k149254
$$ plain form
3300 244331867 242275685 240334317 238334388 236131743 233861446 231672809 229543597 227442384 225423396
3318.4 225423396 223506480 221599191 219635725 217625916 215629160 213705808 211845100 210088536
3334.7 210088536 208454549 206777200 204981521 203214899 201520264 199891686 198413670 196932420
3351 196932420 195282698 193638444 192190617 190910876 189667776 188428551 187309429 186346427 185335129
3369.3 185335129 184100941 182874396 181939721 181193218 180484772 179791763 179205880 178852499 178734317
3387.7 178734317 178788945 178763181 178435966 178137958 178307667 178742409 178899288 178711072 178673699 179004744
3408.1 179004744 179482549 179954857 180354238 180725500 181244165 181917250 182649001 183490545 184522033
3426.5 184522033 185747281 187027156 188363433 189808011 191060752 192002416 193016082 194373444
$$ packed form
3300B44331867k056182j941368j999929k202645k270297k188637k129212k101213k018988
3318.4B25423396j916916j907289j963466k009809j996756j923352j860708j756564
3334.7B10088536j633987j677349j795679j766622j694635j628578j478016j481250
3351A96932420j649722j644254j447827j279741j243100j239225j119122r63002j011298
3369.3A85335129j234188j226545r34675p46503p08446o93009n85883l53381j18182
3387.7A78734317N4628k5764l27215k98008J69709M34742J56879j88216l7373L31045
3408.1A79004744M77805M72308L99381L71262N18665O73085P31751Q41544J031488
3426.5A84522033J225248J279875J336277J444578J252741R41664J013666J357362
$$ plain form
3442.8 194373444 196029082 197849348 199644208 201425657 203322753 205343857 207488284 209742799
3459.1 209742799 211963668 214234635 216864914 219675884 222136021 224163041 226267010 228779346
3475.4 228779346 231629327 234555900 237302139 240011752 242945746 245967627 248907134 251877487
3491.7 251877487 255018026 258376330 261751413 265038937 268403918 271775335 275013149 278368682
3508 278368682 282079101 286043137 289944977 293626368 297343880 301331550 305596679 309828937 313880891
3526.4 313880891 318068296 322530985 327125907 331849247 336644769 341295719 346011221 351070195
3542.7 351070195 356318623 361380875 366245240 371253580 376556098 381989568 387475312 393160075
3559 393160075 398928791 404447228 409922957 416173428 422984987 429456592 435708910 442217201 448991835
$$ packed form
3442.8A94373444J655638J820266J794860J781449J897096K021104K144427K254515
3459.1B09742799K220869K270967K630279K810970K460137K027020K103969K512336
3475.4B28779346K849981K926573K746239K709613K933994L021881K939507K970353
3491.7B51877487L140539L358304L375083L287524L364981L371417L237814L355533
3508B78368682L710419L964036L901840L681391L717512L987670M265129M232258M051954
3526.4C13880891M187405M462689M594922M723340M795522M650950M715502N058974
3542.7C51070195N248428N062252M864365N008340N302518N433470N485744N684763
3559C93160075N768716N518437N475729O250471O811559O471605O252318O508291O774634
$$ plain form
3577.4 448991835 455885500 462852776 469727755 476529837 483707696 491284221 498682857 506038785
3593.7 506038785 513677001 521463275 529306054 537196279 544846237 552189052 559862018 567948937
3610 567948937 575998127 583956003 591637850 599451303 607928991 616111100 623328626 629955769 637212694
3628.4 637212694 645490885 653262973 660471916 667449176 674189866 680821061 687030673 692355394
3644.7 692355394 697208703 702996314 709808826 715813756 720922470 726292849 731646776 736211240
3661 736211240 740181983 743729591 746629477 749361515 752692401 755762517 758417130 761668086 765138924
3679.4 765138924 768291712 770991862 773137569 775019407 777090430 779494643 781988323 784251213
3695.7 784251213 785987258 787187338 788467944 790190756 791641116 792248249 792515516 793489575 795241356
$$ packed form
3577.4D48991835O893665O967276O874979O802082P177859P576525P398636P355928
3593.7E06038785P638216P786274P842779P890225P649958P342815P672966Q086919
3610E67948937Q049190P957876P681847P813453Q477688Q182109P217526O627143P256925
3628.4F37212694Q278191P772088P208943O977260O740690O631195O209612N324721
3644.7F92355394M853309N787611O812512O004930N108714N370379N353927M564464
3661G36211240L970743L547608K899886K732038L330886L070116K654613L250956L470838
3679.4G65138924L152788K700150K145707J881838K071023K404213K493680K262890
3695.7G84251213J736045J200080J280606J722812J450360O07133K67267R74059J751781
$$ plain form
3714 795241356 796843648 797953725 798743963 799374580 799998462 800787687 801663458 802093863 801970899 802154005
3734.4 802154005 803315699 804741442 805394650 805102885 804903805 805554032 805969536 806301653 807617068
3752.8 807617068 809088826 809819579 810239971 810953140 811603665 811929584 812234819 812615991 813142121
3771.1 813142121 813801587 814286172 814468682 814567804 814932466 815463185 815838993 816097200 816446662 816812575
3791.5 816812575 816838801 816578865 816470981 816370249 816312909 816714108 817171812 817677081 818313122 818601072
3811.9 818601072 818390667 818054140 817865729 817613482 817884684 818776667 819313705 819423258 819434285 819405913
3832.3 819405913 819311202 819021940 818801522 819115758 819713771 820366859 820948720 820944786 819898188 818425119
3852.7 818425119 818679690 820201576 821026206 821004927 820769906 820728242 820615768 820301116 820367634 820812702
$$ packed form
3714G95241356J602292J110077P90238O30617O23882P89225Q75771M30405j22964J83106
3734.4H02154005J161694J425743O53208k91765j99080O50227M15504L32117J315415
3752.8H07617068J471758P30753M20392P13169O50525L25919L05235L81172N26130
3771.1H13142121O59466M84585J82510R9122L64662N30719L75808K58207L49462L65913
3791.5H16812575K6226k59936j07884j00732n7340M01199M57704N05269O36041K87950
3811.9H18601072k10405l36527j88411k52247K71202Q91983N37038J09553J1027k8372
3832.3H19405913r4711k89262k20418L14236N98013O53088N81861l934j046598j473069
3852.7H18425119K54571J521886Q24630k1279k35021m1664j12474l14652O6518M45068
$$ plain form
3873.1 820812702 821252286 821561456 821524560 821414888 821410596 821434259 821691632 821779430 821652651 821965516
3893.5 821965516 822319150 822001100 821276665 820849001 821005702 821623385 822364151 822904706 823083997 822857082
3913.9 822857082 822436094 822306871 822527885 822603106 822542489 822737336 822911739 822718620 822600961 822907388
3934.3 822907388 823227823 823277652 823220313 823250473 823319733 823221266 823124588 823270023 823416710 823462605 823629439
3956.7 823629439 823852539 823918223 823902369 823961437 824064612 824085653 824075758 824217379 824465573 824605227 824615896
3979.2 824615896 824677229 824796081 824841321 824895442 825032771 825141072 825183690 825233042 825329244
3997.5 825329244
$$ packed form
3873.1H20812702M39584L09170l6896j09672m292K3663K57373Q7798j26779L12865
3893.5H21965516L53634l18050p24435m27664J56701O17683P40766N40555J79291k26915
3913.9H22857082m20988j29223K21014P5221o0617J94847J74403j93119j17659L06427
3934.3H22907388L20435M9829n7339L0160O9260r8467r6678J45435J46687M5895J66834
3956.7H23629439K23100O5684j5854N9068J03175K1041r895J41621K48194J39654J0669
3979.2H24615896O1333J18852M5240N4121J37329J08301M2618M9352R6202
3997.5H25329244
##END=$$ End of the data block
