##TITLE=$$ Begin of the data block
##JCAMP-DX=5.00 $$ ACD/SpecManager v 10.08
##SPECTROMETER/DATA SYSTEM=Alpha
##DATE=14 Apr 2014 11:23:48
##DATA TYPE=INFRARED SPECTRUM
##DATA CLASS=XYDATA
##ORIGIN=
##OWNER=
##NPOINTS=1765
##FIRSTX=399.75695801
##LASTX=3997.56933594
##MAXX=3997.56933594
##MINX=399.75695801
##MAXY=0.85785109
##MINY=0.17822568
##XFACTOR=1.0000000000
##YFACTOR=1.000000000000000e-9
##FIRSTY=0.59614879
##DELTAX=2.03957629
##XUNITS=1/CM
##YUNITS=ARBITRARY UNITS
##XYDATA=(X++(Y..Y))
$$ plain form
399.8 596148789 593739271 590818107 590385497 589741826 586485147 584135830 584616184 584027052 581144691
418.1 581144691 580537736 581791580 580503345 578138769 578346670 579296768 577499747 575065970 575052261
436.5 575052261 575084865 573198974 572280049 573512316 573366821 571273506 570761740 571844399 571197629
454.8 571197629 569245815 569104016 569470048 567666709 565526128 565285563 564877510 562466085 560637653
473.2 560637653 560893536 560242891 557781100 556566834 557007670 556261778 554354727 553748488 554169059
491.5 554169059 553105414 550842345 549700081 549073458 547088444 545074701 544843018 544678152 542734027
509.9 542734027 540748119 540203035 539276719 536960900 535133362 534378886 532773256 529914737 527940691
528.3 527940691 527136505 525472522 523060024 521972537 521888196 520691156 518799126 518162310 518025756
$$ packed form
399.8E96148789k409518k921164m32610o43671l256679k349317M80354n89132k882361
418.1E81144691o06955J253844j288235k364576K07901R50098j797021k433777j3709
436.5E75052261L2604j885891r18925J232267j45495k093315n11766J082659o46770
454.8E71197629j951814j41799L66032j803339k140581k40565m08053k411425j828432
473.2E60637653K55883o50645k461791j214266M40836p45892j907051o06239M20571
491.5E54169059j063645k263069j142264o26623j985014k013743k31683j64866j944125
509.9E42734027j985908n45084r26316k315819j827538p54476j605630k858519j974046
528.3E27940691q04186j663983k412498j087487q4341j197040j892030o36816j36554
$$ plain form
546.6 518025756 516480863 514515817 513882816 513391018 511380136 509098232 507879972 506203055 503004670
565 503004670 500004053 498139143 495713174 492081642 489149213 487491190 485248238 482061386 479652852
583.3 479652852 477909476 475064993 471554458 469096541 467075258 463797539 460030109 457412601
599.6 457412601 454997748 451453090 448494256 447943121 448271722 447351754 446220577 446980387 449346453
618 449346453 452216119 456119716 461189866 465648472 468900561 472643018 477334052 481124938 483609617
636.3 483609617 486429125 489246875 489890873 489554435 491931558 496284276 498350084 497423947 496531963
654.7 496531963 498090595 502523303 509087086 516242743 521522284 524533212 527933598 532222748
671 532222748 535345197 537069798 539532781 543629169 546648145 547800303 549822569 553103328 554827213
$$ packed form
546.6E18025756j544893j965046o33001m91798k010882k281904j218260j676917l198385
565E03004670l000617j864910k425969l631532k932429j658023k242952l186852k408534
583.3D79652852j743376k844483l510535k457917k021283l277719l767430k617508
599.6D57412601k414853l544658k958834n51135L28601r19968j131177P59810K366066
618D49346453K869666L903597N070150M458606L252089L742457M691034L790886K484679
636.3D83609617K819508K817750O43998l36438K377123M352718K065808r26137q91984
654.7D96531963J558632M432708O563783P155657N279541L010928L400386M289150
671E32222748L122449J724601K462983M096388L018976J152158K022266L280759J723885
$$ plain form
689.4 554827213 555043221 556676865 559317291 559987426 559569180 561175823 563819587 564719737 565381944
707.7 565381944 568449974 571989298 573459983 574928224 578665674 582337618 583850384 585830569
724 585830569 590014100 593359053 594363749 596281707 600083351 602318823 602498829 604253292 607801855
742.4 607801855 609666884 610074580 612472534 616146624 617615581 618029177 620828748 624446332 625633478
760.8 625633478 626428723 629809558 633335233 634166121 634917498 637973011 640243113 639480293 638883173
779.1 638883173 640267372 640353143 638108850 637464821 639675617 641369343 642272949 646167696 653006792
797.5 653006792 658693552 663157940 669792056 677405536 682041466 684932172 689638734 694288611
813.8 694288611 695489347 695545495 697507918 698528886 695764244 692343712 690774202 687937915 682196915
$$ packed form
689.4E54827213K16008J633644K640426O70135m18246J606643K643764R00150O62207
707.7E65381944L068030L539324J470685J468241L737450L671944J512766J980185
724E85830569M183531L344953J004696J917958L801644K235472J80006J754463L548563
742.4F07801855J865029M07696K397954L674090J468957M13596K799571L617584J187146
760.8F25633478P95245L380835L525675Q30888P51377L055513K270102p62820n97120
779.1F38883173J384199Q5771k244293o44029K210796J693726R03606L894747O839096
797.5F53006792N686760M464388O634116P613480M635930K890706M706562M649877
813.8F94288611J200736N6148J962423J020968k764642l420532j569510k836287n741000
$$ plain form
832.1 682196915 677310467 674800992 671207666 665733218 661910772 660213947 657518446 654469430
848.5 654469430 655185640 659808695 664984167 670956612 680437863 691677868 700651586 708350360
864.8 708350360 717837512 727004409 732439995 736441731 742154300 746830225 747668982 747878730 749896824
883.1 749896824 750319541 747418821 745094359 745020926 743868530 741149604 740870774 743484199 744971931
901.5 744971931 744960010 746839583 749825954 750037372 748249650 747731447 746948779 742806673 737525880
919.8 737525880 734612584 732551873 729272127 727400541 729062259 731222272 731437922 732147157 734788060
938.2 734788060 736385286 735749006 735923886 737541258 737204194 734346747 731981814 729868114 724811137
956.6 724811137 717278183 710070550 702123940 690569699 676371515 661874950 646175325 628284276
$$ packed form
832.1F82196915m886448k509475l593326n474448l822446j696825k695501l049016
848.5F54469430P16210M623055N175472N972445R481251J1240005Q973718P698774
864.8G08350360R487152R166897N435586M001736N712569M675925Q38757K09748K018094
883.1G49896824M22717k900720k324462p3433j152396k718926k78830K613425J487732
901.5G44971931j1921J879573K986371K11418j787722n18203p82668m142106n280793
919.8G37525880k913296k060711l279746j871586J661718K160013K15650P09235K640903
938.2G34788060J597226o36280J74880J617372l37064k857447k364933k113700n056977
956.6G24811137p532954p207633p946610j1554241j4198184j4496565j5699625j7891049
$$ plain form
972.9 628284276 610897720 596587479 584192336 572175980 561571598 553048670 545022309 536748052
989.2 536748052 529785812 524838030 520484567 516162932 513038695 511177063 508911788 505468011
1005.5 505468011 501446784 496575654 489762485 481499434 473484784 466065735 458545774 451313436
1021.8 451313436 445287734 440043539 434626430 429347247 424981833 421161979 417238712 413672090
1038.1 413672090 411039621 408731669 405996770 403173327 400698185 398175597 395637363 394318014
1054.5 394318014 394979835 396946311 399389625 401988089 403879046 403643161 400892109 396589398 391596705
1072.8 391596705 386167765 380842447 376318842 372393906 368166566 363270402 357822567 351597041
1089.1 351597041 344586015 337920129 333069056 330471665 329747766 330575198 332609594 335054338 337135524
$$ packed form
972.9F28284276j7386556j4310241j2395143j2016356j0604382q522928q026361q274257
989.2E36748052o962240m947782m353463m321635l124237j861632k265275l443777
1005.5E05468011m021227m871130o813169q263051q014650p419049p519961p232338
1021.8D51313436o025702n244195n417109n279183m365414l819854l923267l566622
1038.1D13672090k632469k307952k734899k823443k475142k522588k538234j319349
1054.5C94318014O61821J966476K443314K598464J890957k35885k751052m302711m992693
1072.8C91596705n428940n325318m523605l924936m227340m896164n447835o225526
1089.1C51597041p011026o665886m851073k597391p23899Q27432K034396K444744K081186
$$ plain form
1107.5 337135524 338715255 339822650 339933813 338274062 334361911 327986270 320140302 314247668
1123.8 314247668 313381851 316292912 319286019 320235103 319714695 319938779 322359741 326610476 331602573
1142.2 331602573 336329788 340036184 342718661 345040172 347448170 349998325 353037179 357259244
1158.5 357259244 362985343 370156020 378971368 389663547 401607931 413692743 425491512 437081307
1174.8 437081307 448071063 457868725 466571957 474460632 480905622 485001475 486804307 486818373
1191.1 486818373 485208839 482620776 480751157 481027484 483477801 487556517 492967427 498943686
1207.4 498943686 504054904 507680714 510478497 512872934 514552474 515697896 517123818 518974185
1223.7 518974185 520694017 522417247 524833739 527755201 530441403 533047318 536203682 539572597
$$ packed form
1107.5C37135524J579731J107395J11163j659751l912151o375641p845968n892634
1123.8C14247668q65817K911061K993107R49084n20408K24084K420962M250735M992097
1142.2C31602573M727215L706396K682477K321511K407998K550155L038854M222065
1158.5C57259244N726099P170677Q815348J0692179J1944384J2084812J1798769J1589795
1174.8D37081307J0989756R797662Q703232P888675O444990M095853J802832J4066
1191.1D86818373j609534k588063j869619K76327K450317M078716N410910N976259
1207.4D98943686N111218L625810K797783K394437J679540J145422J425922J850367
1223.7E18974185J719832J723230K416492K921462K686202K605915L156364L368915
$$ plain form
1240.1 539572597 542328060 544634998 547028065 549004555 549947917 550470471 551357448 552355945 553274572
1258.4 553274572 554984748 558052063 561772406 565721869 570548475 576449454 582541645 588416398
1274.7 588416398 594745576 601615369 608126402 614237845 620907545 628090978 634733021 640781462
1291 640781462 646994114 653010011 657816947 661734283 665748298 669481456 672077060 674161732 676607668
1309.4 676607668 678673327 679611921 680346608 681731224 683053613 683752775 684692562 686315596 687534094
1327.8 687534094 687784195 688005865 688404918 687967479 686798871 686354756 686762214 686749816 686338067 686526418
1348.1 686526418 686969757 686546028 685602784 685111225 684488475 682639122 680227280 678517222 676787972
1366.5 676787972 674085081 671177089 668503225 665143490 660411060 653268933 641536474 627689719
$$ packed form
1240.1E39572597K755463K306938K393067J976490R43362N22554Q86977R98497R18627
1258.4E53274572J710176L067315L720343L949463M826606N900979O092191N874753
1274.7E88416398O329178O869793O511033O111443O669700P183433O642043O048441
1291F40781462O212652O015897M806936L917336M014015L733158K595604K084672K445936
1309.4F76607668K065659R38594P34687J384616J322389O99162R39787J623034J218498
1327.8F87534094K50101K21670L99053m37439j168608m44115M07458j2398m11749J88351
1348.1F86526418M43339m23729r43244m91559o22750j849353k411842j710058j729250
1366.5F76787972k702891k907992k673864l359735m732430p142127j1732459j3846755
$$ plain form
1382.8 627689719 621653020 628670692 640320718 647011876 648820460 648799896 648188651 646385312 643667758
1401.2 643667758 640951395 638246477 635249734 632209897 629857004 628070951 625996113 623765469
1417.5 623765469 622581124 622312188 621751189 621207178 621229351 621312201 621174574 621230960 622147799 624059260
1437.9 624059260 625965059 627953947 630409300 632885158 635440528 638890207 643059850 647152841
1454.2 647152841 652353346 660684943 669281065 676300049 683187664 691062689 698932409 706343472
1470.5 706343472 714688361 723862469 731822252 737587929 741694510 745140493 747421741 747739136
1486.8 747739136 747057676 746968865 746657014 744529247 741158307 738409817 735745072 731899619 726127386
1505.2 726127386 719207525 714145124 709677219 704705715 699715793 695042849 690860212 687062800
$$ packed form
1382.8F27689719o036699P017672J1650026O691158J808584k0564o11245j803339k717554
1401.2F43667758k716363k704918k996743l039837k352893j786053k074838k230644
1417.5F23765469j184345k68936n60999n44011K2173Q2850j37627N6386R16839J911461
1437.9F24059260J905799J988888K455353K475858K555370L449679M169643M092991
1454.2F47152841N200505Q331597Q596122P018984O887615P875025P869720P411063
1470.5G06343472Q344889R174108P959783N765677M106581L445983K281248L17395
1486.8G47739136o81460q8811l11851k127767l370940k748490k664745l845453n772233
1505.2G26127386o919861n062401m467905m971504m989922m672944m182637l797412
$$ plain form
1521.5 687062800 684030652 681146026 677967489 675213814 672297716 668763041 665752590 662994981
1537.8 662994981 659710288 657493651 656975806 657173634 657287300 657035470 656959534 657211542 657062590
1556.2 657062590 656146944 656282604 657090962 656495988 654408395 651258111 647558272 643755198 638674676
1574.5 638674676 631735682 625275791 619101226 611814499 603863478 595580041 586859226 577786863
1590.9 577786863 568707108 559636295 550576329 541628420 532827973 524211586 515754580 507308841
1607.2 507308841 498780191 490422666 482323170 473598480 464274526 456886888 450413585 443235755
1623.5 443235755 436569482 430817932 425728410 421592623 417909324 414622962 413264096 413465708
1639.8 413465708 414328128 415633798 417846769 421412408 424976259 429104894 435928881 442747414
$$ packed form
1521.5F87062800l032148k884626l178537k753675k916098l534675l010451k757609
1537.8F62994981l284693k216637n17845J97828J13666k51830p5936K52008j48952
1556.2F57062590r15646J35660Q08358n94974k087593l150284l699839l803074n080522
1574.5F38674676o938994o459891o174565p286727p951021q283437q720815r072363
1590.9E77786863r079755r070813r059966q947909q800447q616387q457006q445739
1607.2E07308841q528650q357525q099496q724690r323954p387638o473303p177830
1623.5D43235755o666273n751550n089522m135787l683299l286362j358866K01612
1639.8D13465708Q62420J305670K212971L565639L563851M128635O823987O818533
$$ plain form
1656.1 442747414 448791176 455457091 463392645 472153991 480394572 489266127 499802172 510003746
1672.4 510003746 520597041 532499433 543637037 553654730 564435124 578662097 592594802
1686.7 592594802 604193032 615680456 626317561 637179971 648809612 660592735 674357951
1701 674357951 686362863 695974767 705541790 714132309 721137583 726782203 731889844 737821579
1717.3 737821579 743997097 749029636 753460467 757810712 761527836 764716089 767852902 771746397
1733.6 771746397 776252866 780090392 783976018 788217604 791979194 795318425 798824012 802607238
1749.9 802607238 806322157 809556901 812580407 815296829 817204177 819133878 821582794 823423982
1766.3 823423982 824242711 824996352 826634526 828722894 830212772 831493616 833058357 834288180 835011721
$$ packed form
1656.1D42747414O043762O665915P935554Q761346Q240581Q871555J0536045J0201574
1672.4E10003746J0593295J1902392J1137604J0017693J0780394J4226973J3932705
1686.7E92594802J1598230J1487424J0637105J0862410J1629641J1783123J3765216
1701F74357951J2004912R611904R567023Q590519P005274N644620N107641N931735
1717.3G37821579O175518N032539M430831M350245L717124L188253L136813L893495
1733.6G71746397M506469L837526L885626M241586L761590L339231L505587L783226
1749.9H02607238L714919L234744L023506K716422J907348J929701K448916J841188
1766.3H23423982Q18729P53641J638174K088368J489878J280844J564741J229823P23541
$$ plain form
1784.6 835011721 836107194 837349594 837720871 838029563 839513242 841126561 841670394 841891885 843045652
1803 843045652 844431877 844873250 844917834 845772266 846901596 847217441 847343981 848188102 848885238 848632872
1823.4 848632872 848540485 849319279 849897504 850039661 850613415 851555228 851973236 851701319 851608574 852074862
1843.8 852074862 852515697 852650166 853206813 854128301 854328752 854019046 854412556 855237782 855237901 854692221
1864.2 854692221 854641497 854916692 854930937 855152369 856047332 856780052 856509507 856153250 856648326 857041597
1884.6 857041597 856525302 856171608 856863558 857361972 856885314 856740534 857436299 857661784 857136607 857142627
1904.9 857142627 857755542 857701361 857101083 857235372 857766509 857440591 856793582 857060194 857714415 857602417
1925.3 857602417 857124209 857387006 857851088 857445061 856899142 857202709 857447386 856718421 856175721 856675684
$$ packed form
1784.6H35011721J095473J242400L71277L08692J483679J613319N43833K21491J153767
1803H43045652J386225M41373M4584Q54432J129330L15845J26540Q44121O97136k52366
1823.4H48632872r2387P78794N78225J42157N73754R41813M18008k71917r2745M66288
1843.8H52074862M40835J34469N56647R21488K00451l09706L93510Q25226J19n45680
1864.2H54692221n0724K75195J4245K21432Q94963P32720k70545l56257M95076L93271
1884.6H57041597n16295l53694O91950M98414m76658j44780O95765K25485n25177O020
1904.9H57142627O12915n4181o00278J34289N31137l25918o47009K66612O54221j11998
1925.3H57602417m78208K62797M64082m06027n45919L03567K44677p28965n42700M99963
$$ plain form
1945.7 856675684 856987596 856419861 856083572 856508613 856568217 855817497 855459034 855840266 855716288 854900837
1966.1 854900837 854724526 855237603 855111063 854412079 854356766 854741991 854402244 853690267 853720367 854015529
1986.5 854015529 853504598 852740049 852840662 853210568 852778256 852204442 852387011 852525651 851877630 851340055
2006.9 851340055 851558983 851593196 850886405 850401282 850615025 850543022 849837124 849528372 849797726 849589229
2027.3 849589229 848854899 848654211 848904431 848581493 847874522 847756922 847974479 847608626 847028673 847090662
2047.7 847090662 847305238 846844554 846268356 846344352 846493423 846043766 845613539 845804334 845921159 845445454
2068.1 845445454 845123827 845379174 845417440 844923973 844733238 845059574 845062792 844594717 844468653 844717264
2088.5 844717264 844566643 844128370 844176948 844512045 844385564 844050527 844195247 844488084 844293952 844011962
$$ packed form
1945.7H56675684L11912n67735l36289M25041N9604p50720l58463L81232j23978q15451
1966.1H54900837j76311N13077j26540o98984n5313L85225l39747p11977L0100K95162
1986.5H54015529n10931p64549J00613L69906m32312n73814J82569J38640o48021n37575
2006.9H51340055K18928L4213p06791m85123K13743p2003p05898l08752K69354k08497
2027.3H49589229p34330k00688K50220l22938p06971j17600K17557l65853n79953O1989
2047.7H47090662K14576m60684n76198P5996J49071m49657m30227J90795J16825m75705
2068.1H45445454l21627K55347L8266m93467j90735L26336L218m68075j26064K48611
2088.5H44717264j50621m38273M8578L35097j26481l35037J44720K92837j94132k81990
$$ plain form
2108.9 844011962 844217598 844464540 844223499 843994796 844268322 844524264 844338477 844247997 844578147 844752192
2129.3 844752192 844539702 844541848 844900370 845001996 844792247 844868898 845222652 845271647 845093548 845252216
2149.7 845252216 845599294 845601976 845478714 845732212 846043587 845935524 845795453 846073449 846373260 846319139
2170.1 846319139 846336007 846690834 846915007 846822977 846885502 847210169 847331405 847194612 847270012 847566009
2190.5 847566009 847617865 847485244 847605526 847846687 847797036 847665310 847842455 848056495 847947896 847826898
2210.9 847826898 848010242 848156214 848016143 847958744 848178267 848276556 848085284 848037243 848243713 848250151
2231.3 848250151 848024428 848033667 848262489 848248780 848037839 848064721 848205149 848042130 847795665 847872376
2251.7 847872376 848018706 847859502 847685754 847820163 847923338 847725511 847616851 847826719 847917497 847729743
$$ packed form
2108.9H44011962K05636K46942k41041k28703K73526K55942j85787r0480L30150J74045
2129.3H44752192k12490K146L58522J01626k09749P6651L53754M8995j78099J58668
2149.7H45252216L47078K682j23262K53498L11375j08063j40071K77996K99811n4121
2170.1H46319139J6868L54827K24173r2030O2525L24667J21236j36793P5400K95997
2190.5H47566009N1856j32621J20282K41161m9651j31726J77145K14040j08599j20998
2210.9H47826898J83344J45972j40071n7399K19523R8289j91272m8041K06470O438
2231.3H48250151k25723R239K28822j3709k10941K6882J40428j63019k46465P6711
2251.7H47872376J46330j59204j73748J34409J03175j97827j08660K09868R0778j87754
$$ plain form
2272.1 847729743 847722173 847972810 848044574 847941160 848066509 848340869 848372161 848286927 848461628 848687232
2292.5 848687232 848544657 848330498 848530054 848800600 848694503 848574877 848796487 848998725 848909318 848908544
2312.9 848908544 849211097 849365056 849176466 849145770 849408627 849474490 849325776 849444151 849772453 849799633
2333.3 849799633 849650323 849806368 850042582 849863768 849663079 850116551 850763321 850919366 850772023 850824773
2353.6 850824773 850998938 850850046 850641131 850838900 851072967 851033211 851249635 851868331 852168858 852090180
2374 852090180 852379382 853007257 853314817 853367209 853694439 854151368 854197085 854028583 854256749 854639888
2394.4 854639888 854594946 854431689 854681611 854985833 854835033 854652882 854906917 855108202 854864061 854711354
2414.8 854711354 854980230 855087996 854699612 854378164 854442298 854427695 854217708 854355693 854853570 855004430
$$ packed form
2272.1H47729743p570K50637P1764j03414J25349K74360L1292q5234J74701K25604
2292.5H48687232j42575k14159J99556K70546j06097j19626K21610K02238q9407p74
2312.9H48908544L02553J53959j88590l0696K62857O5863j48714J18375L28302K7180
2333.3H49799633j49310J56045K36214j78814k00689M53472O46770J56045j47343N2750
2353.6H50824773J74165j48892k08915J97769K34067l9756K16424O18696L00527p8678
2374H52090180K89202O27875L07560N2392L27230M56929M5717j68502K28166L83139
2394.4H54639888m4942j63257K49922L04222j50800j82151K54035K01285k44141j52707
2414.8H54711354K68876J07766l88384l21448O4134j4603k09987J37985M97877J50860
$$ plain form
2435.2 855004430 854708612 854629457 854848742 854805827 854570985 854692101 854943395 854733229 854367912 854469299
2455.6 854469299 854687154 854432702 854127586 854290605 854431391 854110599 853868008 854067147 854131222 853767574
2476 853767574 853599191 853847742 853843153 853416145 853239655 853412271 853288889 852885246 852864206 853128016
2496.4 853128016 852979302 852554321 852533042 852721989 852486193 852114499 852217257 852413714 852118552 851737797
2516.8 851737797 851798594 851882815 851530135 851238012 851432800 851521671 851092339 850763559 850881755 850857675
2537.2 850857675 850477815 850352883 850563407 850421309 849913895 849766016 849973023 849838197 849428892 849395156
2557.6 849395156 849561393 849278569 848771989 848665416 848695815 848320901 847894728 847930253 847984135 847512305
2578 847512305 846988380 846925974 846820772 846252263 845820844 845881164 845766902 845177710 844729125 844619215
$$ packed form
2435.2H55004430k95818p9155K19285m2915k34842J21116K51294k10166l65317J01387
2455.6H54469299K17855k54452l05116J63019J40786l20792k42591J99139O4075l63648
2476H53767574j68383K48551m589m27008j76490J72616j23382m03643k1040K63810
2496.4H53128016j48714m24981k1279J88947k35796l71694J02758J96457k95162l80755
2516.8H51737797O0797Q4221l52680k92123J94788Q8871m29332l28780J18196k4080
2537.2H50857675l79860j24932K10524j42098n07414j47879K07007j34826m09305l3736
2557.6H49395156J66237k82824n06580j06573L0399l74914m26173L5525N3882m71830
2578H47512305n23925o2406j05202n68509m31419O0320j14262n89192m48585j09910
$$ plain form
2598.4 844619215 844279647 843627930 843281627 843229294 842826247 842156231 841815531 841650546 841098070 840405166
2618.8 840405166 840145409 840027153 839496493 838834465 838521659 838244379 837599814 836988926 836793959 836569130
2639.2 836569130 835923493 835305810 835066080 834720612 834047496 833619952 833577096 833266973 832535505 832015932
2659.6 832015932 831831157 831407309 830740869 830395758 830277503 829819918 829128981 828741670 828516424 827947319
2680 827947319 827263594 826960802 826761127 826180398 825511456 825156748 824799240 824141264 823561668 823335826
2700.4 823335826 822980165 822186291 821471632 821104944 820617855 819866419 819311440 819026351 818531692 817768633
2720.8 817768633 817183971 816778719 816130519 815314591 814824879 814580739 814039886 813267291 812741339 812340498
2741.2 812340498 811687648 811018229 810671926 810348392 809688449 808954000 808434427 807853401 807027340 806332350
$$ packed form
2598.4H44619215l39568o51717l46303n2333m03047o70016l40700j64985n52476o92904
2618.8H40405166k59757j18256n30660o62028l12806k77280o44565o10888j94967k24829
2639.2H36569130o45637o17683k39730l45468o73116m27544m2856l10123p31468n19573
2659.6H32015932j84775m23848o66440l45111j18255m57585o90937l87311k25246n69105
2680H27947319o83725l02792j99675n80729o68942l54708l57508o57976n79596k25842
2700.4H23335826l55661p93874p14659l66688m87089p51436n54979k85089m94659p63059
2720.8H17768633n84662m05252o48200q15928m89712k44140n40853p72595n25952m00841
2741.2H12340498o52850o69419l46303l23534o59943p34449n19573n81026q26061o94990
$$ plain form
2761.6 806332350 805942893 805435419 804591060 803772688 803147376 802389145 801438570 800665557 800082922 799273670
2782 799273670 798240602 797388196 796672285 795701504 794539630 793575108 792736232 791656852 790416837
2800.3 790416837 789328396 788274884 787017703 785755694 784672439 783517897 782113910 780676901
2816.6 780676901 779354632 777937531 776286602 774618566 773093343 771466613 769537389 767438948
2832.9 767438948 765164614 762447178 759160042 755368531 750959337 745663285 739768922 734315217
2849.3 734315217 730207682 727602065 726230741 725751102 725639164 725247800 724216580 722556114 720352590
2867.6 720352590 717817783 715397477 713364542 711616337 709994614 708438396 706855118 705085695
2883.9 705085695 703049898 700859189 698620319 696227014 693652630 691038370 688353419 685495615
$$ packed form
2761.6H06332350l89457n07474q44359q18372o25312p58231r50575p73013n82635q09252
2782G99273670j033068q52406p15911r70781j161874r64522q38876j079380j240015
2800.3G90416837j088441j053512j257181j262009j083255j154542j403987j437009
2816.6G80676901j322269j417101j650929j668036j525223j626730j929224k098441
2832.9G67438948k274334k717436l287136l791511m409194n296052n894363n453705
2849.3G34315217m107535k605617j371324m79639j11938l91364j031220j660466k203524
2867.6G20352590k534807k420306k032935j748205j621723j556218j583278j769423
2883.9G05085695k035797k190709k238870k393305k574384k614260k684951k857804
$$ plain form
2900.2 685495615 682538450 679545820 676326752 672597587 668210626 663155198 657602847 651953042
2916.6 651953042 646772861 642548740 639439821 637413919 636457682 636444986 637097657 638304532 640146792
2934.9 640146792 642597437 645470321 648553729 651576102 654169083 656028748 657119870 657679975
2951.2 657679975 657909274 657960415 658119619 658628881 659545600 660785019 662250221 663873434 665544033
2969.6 665544033 667131841 668509364 669609845 670558274 671487689 672300100 672959507 673583746 674156010
2987.9 674156010 674584150 674743354 674541950 674112201 673477292 672565401 671514452 670352161 669028461
3006.3 669028461 667685509 666441202 665164709 663630724 661854088 660014689 658140123 656152129
3022.6 656152129 654037893 651883006 649773359 647673607 645564735 643412828 641108513 638700366
$$ packed form
2900.2F85495615k957165k992630l219068l729165m386961n055428n552351n649805
2916.6F51953042n180181m224121l108919k025902r56237j2696O52671J206875J842260
2934.9F40146792K450645K872884L083408L022373K592981J859665J091122N60105
2951.2F57679975K29299N1141J59204N09262R16719J239419J465202J623213J670599
2969.6F65544033J587808J377523J100481R48429R29415Q12411O59407O24239N72264
2987.9F74156010M28140J59204k01404m29749o34909r11891j050949j162291j323700
3006.3F69028461j342952j244307j276493j533985j776636j839399j874566j987994
3022.6F56152129k114236k154887k109647k099752k108872k151907k304315k408147
$$ plain form
3038.9 638700366 636306703 633881450 631292522 628555834 625863791 623242021 620502591 617662728
3055.3 617662728 614873350 612123430 609378517 606711149 604188025 601687551 599021077 596241593
3071.6 596241593 593542576 590999365 588494718 585843503 583087683 580328703 577483475 574617445
3087.9 574617445 571859360 569042325 566057146 563106954 560296118 557419598 554317296 551153243
3104.2 551153243 548137665 545157969 542001486 538801551 535735309 532607615 529241979 525698841
3120.5 525698841 522086561 518505096 514969528 511488378 508027613 504428685 500722528 497127801
3136.8 497127801 493595660 489866793 485993594 482185185 478395641 474569827 470764607 466909736
3153.2 466909736 462897360 458796501 454756558 450835615 446875095 442736596 438568085 434526861
$$ packed form
3038.9F38700366k393663k425253k588928k736688k692043k621770k739430k839863
3055.3F17662728k789378k749920k744913k667368k523124k500474k666474k779484
3071.6E96241593k699017k543211k504647k651215k755820k758980k845228k866030
3087.9E74617445k758085k817035k985179k950192k810836k876520l102302l164053
3104.2E51153243l015578k979696l156483l199935l066242l127694l365636l543138
3120.5E25698841l612280l581465l535568l481150l460765l598928l706157l594727
3136.8D97127801l532141l728867l873199l808409l789544l825814l805220l854871
3153.2D66909736m012376m100859m039943l920943l960520m138499m168511m041224
$$ plain form
3169.5 434526861 430573314 426611036 422654718 418733150 414763093 410702080 406646788 402681559
3185.8 402681559 398766607 394871622 391036034 387206674 383305758 379408389 375633746 371985018
3202.1 371985018 368348986 364694148 361106366 357595026 354091406 350601524 347195566 343862116
3218.4 343862116 340554029 337312996 334172219 331034243 327872515 324846357 322029740 319216669
3234.7 319216669 316256493 313326061 310579419 307942688 305336505 302780241 300256878 297733784
3251.1 297733784 295258552 292879969 290540934 288161069 285780817 283495933 281306267 279110938
3267.4 279110938 276914179 274754286 272558391 270301640 268035024 265808433 263619423 261421025
3283.7 261421025 259221077 257087916 255043477 252983838 250828415 248652115 246504217 244358599
$$ packed form
3169.5D34526861l953547l962278l956318l921568l970057m061013m055292l965229
3185.8D02681559l914952l894985l835588l829360l900916l897369l774643l648728
3202.1C71985018l636032l654838l587782l511340l503620l489882l405958l333450
3218.4C43862116l308087l241033l140777l137976l161728l026158k816617k813071
3234.7C19216669k960176k930432k746642k636731k606183k556264k523363k523094
3251.1B97733784k475232k378583k339035k379865k380252k284884k189666k195329
3267.4B79110938k196759k159893k195895k256751k266616k226591k189010k198398
3283.7B61421025k199948k133161k044439k059639k155423k176300k147898k145618
$$ plain form
3300 244358599 242266476 240302771 238359094 236254871 234005153 231750324 229576513 227484271 225458786
3318.4 225458786 223489776 221559048 219639629 217670545 215664551 213730276 211899534 210167050
3334.7 210167050 208509207 206797928 204999149 203235731 201536685 199918076 198435679 196924165
3351 196924165 195246890 193577826 192115486 190848291 189636528 188435122 187358603 186404333 185349837
3369.3 185349837 184090897 182872996 181941748 181195647 180462137 179742336 179165632 178787678 178616315
3387.7 178616315 178677037 178718969 178481013 178225681 178361818 178757355 178897262 178717747 178703651 179026350
3408.1 179026350 179498672 179980040 180361450 180714905 181238085 181909323 182627454 183475494 184521496
3426.5 184521496 185717002 186961278 188319102 189820543 191136912 192112818 193126723 194482580
$$ packed form
3300B44358599k092123j963705j943677k104223k249718k254829k173811k092242k025485
3318.4B25458786j969010j930728j919419j969084k005994j934275j830742j732484
3334.7B10167050j657843j711279j798779j763418j699046j618609j482397j511514
3351A96924165j677275j669064j462340j267195j211763j201406j076519r54270j054496
3369.3A85349837j258940j217901r31248p46101p33510p19801n76704l77954j71363
3387.7A78616315O0722M1932k37956k55332J36137L95537J39907j79515j4096L22699
3408.1A79026350M72322M81368L81410L53455N23180O71238P18131Q48040J046002
3426.5A84521496J195506J244276J357824J501441J316369R75906J013905J355857
$$ plain form
3442.8 194482580 196102038 197876930 199705690 201533780 203389138 205353260 207518473 209805071
3459.1 209805071 212001726 214269191 216920599 219707280 222151920 224209815 226339921 228849873
3475.4 228849873 231697679 234623358 237344071 240024745 242942333 245931715 248830214 251832306
3491.7 251832306 255074888 258488804 261832982 265076309 268429369 271800429 275044233 278393745
3508 278393745 282078356 286047488 289991587 293696582 297394514 301368058 305647820 309880435 313936591
3526.4 313936591 318177253 322666943 327226788 331937522 336755902 341439873 346176922 351220071
3542.7 351220071 356467545 361576140 366486877 371524602 376818597 382216662 387727380 393453926
3559 393453926 399183273 404632479 410080671 416342109 423191041 429693043 435936213 442456931 449288845
$$ packed form
3442.8A94482580J619458J774892J828760J828090J855358J964122K165213K286598
3459.1B09805071K196655K267465K651408K786681K444640K057895K130106K509952
3475.4B28849873K847806K925679K720713K680674K917588K989382K898499L002092
3491.7B51832306L242582L413916L344178L243327L353060L371060L243804L349512
3508B78393745L684611L969132L944099L704995L697932L973544M279762M232615M056156
3526.4C13936591M240662M489690M559845M710734M818380M683971M737049N043149
3542.7C51220071N247474N108595M910737N037725N293995N398065N510718N726546
3559C93453926N729347N449206N448192O261438O848932O502002O243170O520718O831914
$$ plain form
3577.4 449288845 456213027 463178158 470033735 476786524 483957887 491602898 499038965 506388307
3593.7 506388307 514037430 521853268 529702365 537569463 545227468 552661419 560439587 568541646
3610 568541646 576533377 584438682 592122853 599969566 608483613 616677403 623812377 630301476 637554228
3628.4 637554228 646003425 653878808 661063790 668010592 674756885 681362629 687529504 692833483
3644.7 692833483 697634459 703332603 710135937 716234982 721401393 726741970 732057571 736591756
3661 736591756 740543008 744088888 746999621 749757111 753071427 756079495 758690119 761966646 765509844
3679.4 765509844 768676698 771334112 773451746 775314093 777387142 779829562 782346368 784612000
3695.7 784612000 786369085 787593901 788842320 790525496 791995406 792641103 792939842 793959260 795753300
$$ packed form
3577.4D49288845O924182O965131O855577O752789P171363P645011P436067P349342
3593.7E06388307P649123P815838P849097P867098P658005P433951P778168Q102059
3610E68541646P991731P905305P684171P846713Q514047Q193790P134974O489099P252752
3628.4F37554228Q449197P875383P184982O946802O746293O605744O166875N303979
3644.7F92833483M800976N698144O803334O099045N166411N340577N315601M534185
3661G36591756L951252L545880K910733K757490L314316L008068K610624L276527L543198
3679.4G65509844L166854K657414K117634J862347K073049K442420K516806K265632
3695.7G84612000J757085J224816J248419J683176J469910O45697K98739J019418J794040
$$ plain form
3714 795753300 797343671 798423886 799231350 799876153 800451398 801183462 802055418 802498341 802363098 802512348
3734.4 802512348 803657889 805103779 805734992 805390358 805217981 805951476 806406498 806730747 807982564
3752.8 807982564 809343934 810026050 810510814 811305046 811961710 812253773 812544346 812943637 813525975
3771.1 813525975 814238250 814749479 814934433 815025151 815375805 815831721 816122472 816398740 816847801 817296326
3791.5 817296326 817318380 816956401 816730082 816564202 816526234 817037702 817570627 818095684 818783998 819110394
3811.9 819110394 818859279 818441093 818215847 817976534 818270206 819205940 819823921 820023656 820069015 819983363
3832.3 819983363 819754124 819338441 819143534 819574237 820231378 820899606 821474731 821431935 820322454 818781614
3852.7 818781614 818971455 820473492 821341157 821376979 821174920 821166575 821070194 820738673 820827723 821331263
$$ packed form
3714G95753300J590371J080215Q07464O44803N75245P32064Q71956M42923j35243J49250
3734.4H02512348J145541J445890O31213l44634j72377P33495M55022L24249J251817
3752.8H07982564J361370O82116M84764P94232O56664K92063K90573L99291N82338
3771.1H13525975P12275N11229J84954R0718L50654M55916K90751K76268M49061M48525
3791.5H17296326K2054l61979k26319j65880l7968N11468N32925N25057O88314L26396
3811.9H19110394k51115m18186k25246k39313K93672R35734O17981J99735M5359q5652
3832.3H19983363k29239m15683j94907M30703O57141O68228N75125m2796j109481j540840
3852.7H18781614J89841J502037Q67665L5822k02059q345r6381l31521Q9050N03540
$$ plain form
3873.1 821331263 821831763 822197437 822136045 821906149 821815073 821856558 822164237 822248399 822110116 822489321
3893.5 822489321 822920740 822592437 821790159 821314573 821479440 822093129 822789073 823306620 823511541 823302090
3913.9 823302090 822911620 822825968 823017657 823071659 823051870 823230684 823348939 823151231 823051453 823365748
3934.3 823365748 823697150 823755741 823698521 823696434 823722064 823643804 823601604 823783278 823973060 824042022 824168146
3956.7 824168146 824337482 824394345 824421048 824516296 824584782 824578524 824599564 824756861 824986219 825097680 825119317
3979.2 825119317 825235248 825392663 825428486 825435877 825559258 825686336 825715482 825754762 825865984
3997.5 825865984
$$ packed form
3873.1H21331263N00500L65674o1392k29896r1076M1485L07679Q4162j38283L79205
3893.5H22489321M31419l28303q02278m75586J64867O13689O95944N17547K04921k09451
3913.9H23302090l90470q5652J91689N4002j9789J78814J18255j97708r9778L14295
3934.3H23365748L31402N8591n7220k087K5630p8260m2200J81674J89782O8962J26124
3956.7H24168146J69336N6863K6703R5248O8486o258K1040J57297K29358J11461K1637
3979.2H25119317J15931J57415L5823P391J23381J27078K9146L9280J11222
3997.5H25865984
##END=$$ End of the data block
