##TITLE=$$ Begin of the data block
##JCAMP-DX=5.00 $$ ACD/SpecManager v 10.08
##SPECTROMETER/DATA SYSTEM=Alpha
##DATE=14 Apr 2014 11:23:48
##DATA TYPE=INFRARED SPECTRUM
##DATA CLASS=XYDATA
##ORIGIN=
##OWNER=
##NPOINTS=1765
##FIRSTX=399.75695801
##LASTX=3997.56933594
##MAXX=3997.56933594
##MINX=399.75695801
##MAXY=0.84232408
##MINY=0.24407639
##XFACTOR=1.0000000000
##YFACTOR=1.000000000000000e-9
##FIRSTY=0.55061775
##DELTAX=2.03957629
##XUNITS=1/CM
##YUNITS=ARBITRARY UNITS
##XYDATA=(X++(Y..Y))
$$ plain form
399.8 550617754 548898220 548137665 547343552 546287954 545843422 545091212 543827116 543198884 542530060
418.1 542530060 541675448 542192817 542802453 542321146 542216897 542816520 542872608 542427182 541740716 540716827
438.5 540716827 540358543 540817440 540687144 540305793 540545106 540449619 540115178 540396214 540158153 539248705
458.9 539248705 539051116 538713813 537710369 537185669 536815524 535854638 535102725 534539223 533413053
477.3 533413053 532546163 532343030 531905234 531605005 531822801 531341076 530282438 529819131 529279947 528331459
497.7 528331459 527920663 527471125 526415527 525795400 525396585 524331748 523263693 522468388 521272779
516 521272779 520123363 519401431 518327653 517151833 516333938 514983594 513296843 512395561 511743426
534.4 511743426 510829031 510307550 509731591 508666694 508003116 507551730 506431460 505275726 504512668
$$ packed form
399.8E50617754j719534p60555p94113j055598m44532p52210j264096o28232o68824
418.1E42530060q54612N17369O09636m81307j04249N99623N6088m45426o86466j023889
438.5E40716827l58284M58897j30296l81351K39313r5487l34441K81036k38061r09448
458.9E39248705j97589l37303j003444n24700l70145r60886p51913n63502j126170
477.3E33413053q66890k03133m37796l00229K17796m81725j058638m63307n39184r48488
497.7E28331459m10796m49538j055598o20127l98815j064837j068055p95305j195609
516E21272779j149416p21932j073778j175820q17895j350344j686751r01282o52135
534.4E11743426r14395n21481n75959j064897o63578m51386j120270j155734p63058
$$ plain form
552.7 504512668 503364980 502096474 501215041 499980450 498360813 496938765 495247543 493232071 491571426
571.1 491571426 489810258 487740070 486276388 485101849 483512610 482260346 481475174 480506241 479799896
589.4 479799896 479589850 479047567 478196800 477353334 475755185 473296225 470761657 468229383 465732008
607.8 465732008 463920593 462663233 461635888 461617231 462960392 465001255 467724860 471302956 474996239
626.1 474996239 478655875 482599854 486355931 489739299 493195355 496348023 498845547 501224279
642.5 501224279 503508270 505587280 508061767 510764360 512708604 514245987 516574025 519826055
658.8 519826055 523423314 527034760 530025601 532679319 536512136 540168881 543118775 546367228
675.1 546367228 549734592 552667081 555430412 558183014 560503423 562532961 564669669 566599011
$$ packed form
552.7E04512668j147688j268506q81433j234591j619637j422048j691222k015472j660645
571.1D91571426j761168k070188j463682j174539j589239j252264p85172r68933p06345
589.4D79799896k10046n42283q50767q43466j598149k458960k534568k532274k497375
607.8D65732008j811415j257360j027345j8657J343161K040863K723605L578096L693283
626.1D74996239L659636L943979L756077L383368L456056L152668K497524K378732
642.5E01224279K283991K079010K474487K702593J944244J537383K328038L252030
658.8E19826055L597259L611446K990841K653718L832817L656745K949894L248453
675.1E46367228L367364K932489K763331K752602K320409K029538K136708J929342
$$ plain form
691.4 566599011 568085790 569498599 570795596 571892619 573240280 574902475 576612234 578612089
707.7 578612089 581042290 583517730 585999429 588682115 591367841 594005466 596850455 599683344
724 599683344 602281988 604911447 607584119 609906614 611959040 614082694 616126478 618085563 620171368
742.4 620171368 622265518 624324262 626510441 628614366 630454242 632347822 634379804 636192024
758.7 636192024 637815952 639474094 640922785 642226398 643633842 644722521 645228863 645544529 645596266
777.1 645596266 645046055 644253016 643518806 642782807 642465472 643060923 644432545 646694839 650253236
795.4 650253236 654840052 660017610 665693581 671378314 676422298 680884898 684792459 687862992
811.7 687862992 690299809 692245781 693168223 692946911 691869736 689678192 686401486 682657838 678588986
$$ packed form
691.4E66599011J486779J412809J296997J097023J347661J662195J709759J999855
707.7E78612089K430201K475440K481699K682686K685726K637625K844989K832889
724E99683344K598644K629459K672672K322495K052426K123654K043784J959085K085805
742.4F20171368K094150K058744K186179K103925J839876J893580K031982J812220
758.7F36192024J623928J658142J448691J303613J407444J088679N06342L15666N1737
777.1F45596266n50211p93039p34210p35999l17335N95451J371622K262294L558397
795.4F50253236M586816N177558N675971N684733N043984M462600L907561L070533
811.7F87862992K436817J945972R22442k21312j077175k191544l276706l743648m068852
$$ plain form
830.1 678588986 674171686 669883788 665903330 662024915 658487499 655464709 652675152 650418162
846.4 650418162 649518013 650267422 652766228 657378912 663835347 671302259 679511547 688167989 696527541
864.8 696527541 704361022 711574018 717646718 722620130 727035701 730631888 732982695 734427392
881.1 734427392 734920740 734194040 732849538 731231511 729172945 727317810 726338863 726021767 726437986
899.4 726437986 727803588 729389310 730623901 731669068 732103527 731338501 729655921 727114081 723511100
917.8 723511100 719597518 716095448 713032365 710920274 710276842 710531235 711179256 712258518 713200390
936.2 713200390 713567495 713814795 713906229 713374853 712427318 710988164 708372235 704627335 699974298
954.5 699974298 693976879 686649978 678342581 668717146 657608688 645546913 632723153 619326174
$$ packed form
830.1F78588986m417300m287898l980458l878415l537416l022790k789557k256990
846.4F50418162r00149P49409K498806M612684O456435P466912Q209288Q656442Q359552
864.8F96527541P833481P212996O072700M973412M415571L596187K350807J444697
881.1G34427392M93348p26700j344502j618027k058566j855135r78947l17096M16219
899.4G26437986J365602J585722J234591J045167M34459p65026j682580k541840l602981
917.8G23511100l913582l502070l063083k112091o43432K54393O48021J079262R41872
936.2G13200390L67105K47300R1434n31376r47535j439154k615929l744900m653037
954.5F99974298n997419p326901q307397r625435j1108458j2061775j2823760j3396979
$$ plain form
970.8 619326174 606351435 594574928 584077239 574997902 567229569 560169399 553640604 547872066
987.1 547872066 542733312 538184524 534560204 531776428 529460132 527617455 526165605 524603963
1003.5 524603963 522608697 520009875 516487896 512122869 507380426 502430379 497484684 493011534
1019.8 493011534 489024431 485227585 481669396 478384912 475157857 472054482 469240993 466536403
1036.1 466536403 463911980 461582243 459377706 457111895 454965860 452936143 450928777 449274838
1052.4 449274838 448310882 448000431 448375762 449339569 450253069 450531423 449905992 448070794 445078701
1070.8 445078701 441527724 437847227 434262902 431085169 428286970 425494403 422618657 419710785
1087.1 419710785 416652560 413608432 411011100 408958167 407317668 406055421 404977530 403869599
$$ packed form
970.8F19326174j2974739j1776507j0497689r079337p768333p060170o528795n768538
987.1E47872066n138754m548788l624320k783776k316296j842677j451850j561642
1003.5E24603963j995266k598822l521979m365027m742443m950047m945695m473150
1019.8D93011534l987103l796846l558189l284484l227055l103375k813489k704590
1036.1D66536403k624423k329737k204537k265811k146035k029717k007366j653939
1052.4D49274838r63956l10451L75331R63807R13500K78354o25431j835198k992093
1070.8D45078701l550977l680497l584325l177733k798199k792567k875746k907872
1087.1D19710785l058225l044128k597332k052933j640499j262247j077891j107931
$$ plain form
1103.4 403869599 402817905 401826978 400696576 399492502 398321211 396899819 394946784 392452419
1119.7 392452419 389638662 387117088 385393262 384539664 384924233 386502862 388273835 389776677 391352594
1138.1 391352594 393138260 394870490 396368563 397699028 398908913 400087178 401518494 403322160
1154.4 403322160 405412138 407934248 411056966 414775848 419275671 424743235 430954456 437649757
1170.7 437649757 444789559 452173322 459522456 466849089 474108875 481000721 487396628 493218184
1187 493218184 498122483 501950085 504876852 506984830 508489370 509954691 511717677 513785064 516228497
1205.4 516228497 518913865 521364450 523365974 525025129 526323736 527326107 528326035 529381514
1221.7 529381514 530461788 531821430 533537686 535392165 537443578 539824069 542327166 544879436
$$ packed form
1103.4D03869599j051694r90927j130402j204074j171291j421392j953035k494365
1119.7C92452419k813757k521574j723826q53598L84569J578629J770973J502842J575917
1138.1C91352594J785666J732230J498073J330465J209885J178265J431316J803666
1154.4D03322160K089978K522110L122718L718882M499823N467564O211221O695301
1170.7D37649757P139802P383763P349134P326633P259786O891846O395907N821556
1187D93218184M904299L827602K926767K107978J504540J465321J762986K067387K443433
1205.4E16228497K685368K450585K001524J659155J298607J002371R99928J055479
1221.7E29381514J080274J359642J716256J854479K051413K380491K503097K552270
$$ plain form
1238 544879436 547549367 550063610 552219510 554136753 555712819 556785166 557582617 558254182 558751643
1256.4 558751643 559394062 560562611 562216043 564377010 567228675 570579886 574235201 578339159
1272.7 578339159 582766652 587253034 591926277 596827447 601740181 606800556 612185359 617546082
1289 617546082 622673333 627692521 632364750 636474669 640269995 643682837 646440268 648798168 650907218
1307.4 650907218 652531087 653812587 655009627 655930281 656660020 657610714 658668637 659666002 660840750
1325.7 660840750 662035406 662832737 663334787 663593173 663406491 663019776 662797451 662609398 662447870
1344.1 662447870 662530839 662618995 662430406 662113905 661595643 660634100 659471333 658094168 656062543
1362.4 656062543 653676927 651391208 648923993 646342635 643782258 640728533 636889338 631386220
$$ packed form
1238E44879436K669931K514243K155900J917243J576066J072347P97451O71565M97461
1256.4E58751643O42419J168549J653432K160967K851665L351211L655315M103958
1272.7E78339159M427493M486382M673243M901170M912734N060375N384803N360723
1289F17546082N127251N019188M672229M109919L795326L412842K757431K357900K109050
1307.4F50907218J623869J281500J197040R20654P29739R50694J057923R97365J174748
1325.7F60840750J194656P97331N02050K58386j86682l86715k22325j88053j61528
1344.1F62447870Q2969Q8156j88589l16501n18262r61543j162767j377165k031625
1362.4F56062543k385616k285719k467215k581358k560377l053725l839195n503118
$$ plain form
1378.7 631386220 622293830 611614943 606701910 610435128 616430998 619276464 619454265 617965043
1395.1 617965043 615453005 612385094 609000087 605444789 601764560 598256052 595001817 592082322
1411.4 592082322 589659274 587618053 585707664 583897233 582468092 581391871 580624104 580062032 579472482
1429.7 579472482 579160690 579283595 579538405 580084682 581062019 582297683 583839715 585858464 588350177
1448.1 588350177 591322780 594871998 599028468 604571223 611700892 618226588 624166667 630719364
1464.4 630719364 637631536 644088686 650844216 658944607 666863143 673142016 678254962 682421148
1480.7 682421148 685591817 687808394 689133942 689320445 688516021 687355757 685556889 682701349 679482937
1499.1 679482937 676378667 673273504 669196904 663068950 657409370 652937710 648628771 644355953
$$ packed form
1378.7F31386220r092390j0678887m913033L733218N995870K845466J77801j489222
1395.1F17965043k512038l067911l385007l555298l680229l508508l254235k919495
1411.4E92082322k423048k041221j910389j810431j429141j076221p67767n62072n89550
1429.7E79472482l11792J22905K54810N46277R77337J235664J542032K018749K491713
1448.1E88350177K972603L549218M156470N542755P129669O525696N940079O552697
1464.4F30719364O912172O457150O755530Q100391P918536O278873N112946M166186
1480.7F82421148L170669K216577J325548J86503q04424j160264j798868k855540l218412
1499.1F79482937l104270l105163m076600o127954n659580m471660m308939m272818
$$ plain form
1515.4 644355953 640497208 637356460 634170949 631077230 628450215 625802636 623397827 621225774
1531.7 621225774 618944705 617083311 615691304 614065886 612547278 611792147 611620724 611778736 612204432
1550.1 612204432 613048851 614199579 615357578 616244733 616746008 616954863 616827846 616290867 614939332
1568.4 614939332 612719536 610404134 607472539 603006780 598414063 594048798 589037001 583519459
1584.7 583519459 577632427 571331382 564703405 557901740 550862372 543760777 536751151 529650569
1601.1 529650569 522468984 515415907 508390784 501188815 494139284 487551332 480547398 472760022
1617.4 472760022 466456562 461133838 455304980 449758381 444855243 440545022 437382817 435032338
1633.7 435032338 432984322 432101250 432546854 433925360 436135262 439512253 443896651 447993517 452756763
$$ packed form
1515.4F44355953l858745l140748l185511l093719k627015k647579k404809k172053
1531.7F21225774k281069j861394j392007j625418j518608p55131j71423J58012M25696
1550.1F12204432Q44419J150728J157999Q87155N01275K08855j27017n36979j351535
1568.4F14939332k219796k315402k931595m465759m592717m365265n011797n517542
1584.7E83519459n887032o301045o627977o801665p039368p101595p009626p100582
1601.1E29650569p181585p053077p025123p201969p049531o587952p003934p787376
1617.4D72760022o303460n322724n828858n546599m903138m310221l162205k350479
1633.7D35032338k048016q83072M45604J378506K209902L376991M384398M096866M763246
$$ plain form
1652 452756763 459415525 465197623 470289141 476004452 482565880 489502788 496015370 502995968 510943234
1670.4 510943234 518470466 526204884 534708440 542815804 550607502 559208691 569793403 579735458
1686.7 579735458 588274300 597073615 605596423 614879012 625308156 636211395 648813069 659911633
1703 659911633 669433475 679035485 687583506 695147634 702197433 708925188 715684950 721846044 726924598
1721.4 726924598 731562555 736101568 740367651 744411230 748141825 751988411 755866289 759184003
1737.7 759184003 762547016 766075015 769452035 772799313 776121795 779292583 782377899 785184443
1754 785184443 787658215 789962113 792130291 794197142 796101451 797858715 799548745 801132739 802655697
1772.4 802655697 804154992 805492699 806773603 808050036 809223056 810351849 811562955 812743545
$$ packed form
1652D52756763O658762N782098N091518N715311O561428O936908O512582O980598P947266
1670.4E10943234P527232P734418Q503556Q107364P791698Q601189J0584712R942055
1686.7E79735458Q538842Q799315Q522808R282589J0429144J0903239J2601674J1098564
1703F59911633R521842R602010Q548021P564128P049799O727755O759762O161094N078554
1721.4G26924598M637957M539013M266083M043579L730595L846586L877878L317714
1737.7G59184003L363013L527999L377020L347278L322482L170788L085316K806544
1754G85184443K473772K303898K168178K066851J904309J757264J690030J583994J522958
1772.4H02655697J499295J337707J280904J276433J173020J128793J211106J180590
$$ plain form
1788.7 812743545 813768625 814806223 815825880 816719115 817578733 818443477 819253206 820070326 820897043
1807 820897043 821631312 822326005 823036194 823691905 824309886 825000107 825671196 826253295 826861918 827484310
1827.4 827484310 827992737 828501105 829072177 829545736 829992831 830557644 831087947 831433892 831812084 832288742
1847.8 832288742 832710922 833110988 833522797 833880305 834215283 834594071 834932208 835238755 835576534 835860968
1868.2 835860968 836102188 836414456 836714983 836934805 837179840 837445199 837619066 837783039 838037848 838222563
1888.6 838222563 838342428 838567078 838768125 838864923 839013278 839200795 839313269 839441121 839597225 839667678
1909 839667678 839713991 839797974 839846253 839865148 839958012 840033650 840015113 840059400 840137720 840128779 840118766 840117931
1933.5 840117931 840048671 839975834 839924753 839822471 839715958 839667439 839585841 839457273 839358270 839247286 839079976
$$ packed form
1788.7H12743545J025080J037598J019657Q93235Q59618Q64744Q09729Q17120Q26717
1807H20897043P34269O94693P10189O55711O17981O90221O71089N82099O08623O22392
1827.4H27484310N08427N08368N71072M73559M47095N64813N30303L45945L78192M76658
1847.8H32288742M22180M00066M11809L57508L34978L78788L38137L06547L37779K84434
1868.2H35860968K41220L12268L00527K19822K45035K65359J73867J63973K54809J84715
1888.6H38222563J19865K24650K01047R6798J48355J87517J12474J27852J56104P0453
1909H39667678M6313Q3983M8279J8895R2864P5638j8537M4287P8320q941j0013q35
1933.5H40117931o9260p2837n1081j02282j06513m8519q1598j28568r9003j10984j67310
$$ plain form
1955.9 839079976 838900626 838734508 838569403 838434935 838327229 838190079 838029742 837875783 837719619 837551177
1976.3 837551177 837395787 837260783 837141871 837031066 836900115 836733937 836557567 836402893 836241364 836038470
1996.7 836038470 835835457 835670054 835503221 835323811 835142195 834934175 834703088 834513247 834333599 834089458
2017.1 834089458 833840251 833617210 833384275 833160222 832980812 832794011 832578599 832381725 832188964 831987739
2037.5 831987739 831810176 831629813 831402004 831219256 831122875 830996513 830836296 830717087 830585718 830404401
2057.9 830404401 830228806 830098331 830016553 829963028 829893768 829771399 829664230 829612494 829529583 829453826 829470396
2080.3 829470396 829462707 829384387 829346478 829320848 829245448 829188406 829181254 829164624 829144299 829140186 829124928 829135180
2104.8 829135180 829198182 829230666 829217076 829243064 829258680 829213440 829223573 829304874 829337776 829366982 829467118
$$ packed form
1955.9H39079976j79350j66118j65105j34468j07706j37150j60337j53959j56164j68442
1976.3H37551177j55390j35004j18912j10805j30951j66178j76370j54674j61529k02894
1996.7H36038470k03013j65403j66833j79410j81616k08020k31087j89841j79648k44141
2017.1H34089458k49207k23041k32935k24053j79410j86801k15412j96874j92761k01225
2037.5H31987739j77563j80363k27809j82748r6381j26362j60217j19209j31369j81317
2057.9H30404401j75595j30475q1778n3525o9260j22369j07169n1736q2911p5757J6570
2080.3H29470396p689p8320l7909k5630p5400n7042p152j6630k0325m113j5258J0252
2104.8H29135180O3002L2484j3590K5988J5616m5240J0133Q1301L2902K9206J00136
$$ plain form
2127.3 829467118 829542100 829587519 829691291 829780042 829811931 829915464 830055952 830111384 830188513 830352366 830477715
2149.7 830477715 830579162 830735624 830849767 830935895 831117332 831289113 831379175 831527889 831715763 831828117
2170.1 831828117 831955969 832150102 832293034 832402408 832551360 832652748 832729459 832898200 833065867 833162546
2190.5 833162546 833290815 833426535 833485126 833562970 833677053 833713710 833753645 833895802 834018886 834101677
2210.9 834101677 834237635 834291816 834220529 834255338 834368706 834396839 834460676 834591806 834607601 834572613 834615648
2233.3 834615648 834620476 834604025 834678710 834705055 834651828 834701717 834791958 834773779 834761381 834823549 834846973 834847391
2257.8 834847391 834894657 834897935 834851801 834882379 834928215 834908545 834949672 835038006 835051954 835100710 835221589
2280.2 835221589 835282862 835322976 835396469 835431814 835426152 835446775 835460186 835426688 835418940 835432947 835436046 835465491
$$ packed form
2127.3H29467118P4982M5419J03772Q8751L1889J03533J40488N5432P7129J63853J25349
2149.7H30477715J01447J56462J14143Q6128J81437J71781R0062J48714J87874J12354
2170.1H31828117J27852J94133J42932J09374J48952J01388P6711J68741J67667R6679
2190.5H33162546J28269J35720N8591P7844J14083L6657L9935J42157J23084Q2791
2210.9H34101677J35958N4181p1287L4809J13368K8133O3837J31130J5795l4988M3035
2233.3H34615648M828j6451P4685K6345n3227M9889R0241j8179j2398O2168K3424M18
2257.8H34847391M7266L278m6134L0578M5836j9670M1127Q8334J3948M8756J20879
2280.2H35221589O1273M0114P3493L5345n662K0623J3411l3498p748J4007L099K9445
$$ plain form
2304.7 835465491 835470796 835364282 835262001 835326195 835429609 835396767 835293829 835182488 835047603 834982395
2325.1 834982395 834929228 834777474 834616542 834342122 833824575 833392024 833382308 833684623 834159911 834978878
2345.5 834978878 835921884 836424530 836404324 836131752 835792720 835538983 835559309 835742414 835948706 836291075
2365.9 836291075 836754143 837278128 837926924 838583291 839097023 839606345 840163112 840612411 840995908 841361880
2386.3 841361880 841589689 841725230 841911376 842052877 842073560 842124641 842207074 842205703 842201293 842246056 842257798
2408.7 842257798 842275321 842324078 842300773 842237175 842229307 842172563 841997027 841856718 841812849 841806114 841872692
2431.2 841872692 841973662 841975093 841908455 841862679 841807067 841750681 841735661 841684222 841562033 841457725 841357052
2453.6 841357052 841220975 841130972 841083050 840999126 840911627 840825379 840679526 840535820 840458155 840367377 840246081
$$ packed form
2304.7H35465491N305j06514j02281O4194J03414l2842j02938j11341j34885o5208
2325.1H34982395n3167j51754j60932k74420n17547m32551r716L02315M75288Q18967
2345.5H34978878R43006N02646k0206k72572l39032k53737K0326J83105K06292L42369
2365.9H36291075M63068N23985O48796O56367N13732N09322N56767M49299L83497L65972
2386.3H41361880K27809J35541J86146J41501K0683N1081Q2433j371m410M4763J1742
2408.7H42257798J7523M8757k3305o3598p868n6744j75536j40309m3869o735O6578
2431.2H41872692J00970J431o6638m5776n5612n6386j5020n1439j22189j04308j00673
2453.6H41357052j36077r0003m7922q3924q7499q6248j45853j43706p7665r0778j21296
$$ plain form
2476 840246081 840156972 840043128 839860141 839689553 839551926 839400172 839272499 839176893 839040816 838892817
2496.4 838892817 838779807 838652253 838493586 838365912 838266671 838125706 837972820 837846518 837709010 837583184
2516.8 837583184 837493479 837370574 837203383 837053001 836894393 836719155 836579323 836439192 836262643 836117864
2537.2 836117864 836010456 835862100 835692823 835531950 835332572 835142136 835018277 834882438 834699869 834536254
2557.6 834536254 834382474 834183455 833975673 833788276 833591342 833393097 833162010 832844496 832525373 832288504
2578 832288504 832032740 831702352 831399977 831124425 830806911 830486655 830152512 829725742 829274356 828881562
2598.4 828881562 828492045 828086674 827693164 827267885 826805532 826353312 825888991 825402617 824926138 824454546
2618.8 824454546 823966146 823466539 822965801 822458208 821977973 821545660 821099043 820624173 820169449 819715917
$$ packed form
2476H40246081q9109j13844j82987j70588j37627j51754j27673r5606j36077j47999
2496.4H38892817j13010j27554j58667j27674r9241j40965j52886j26302j37508j25826
2516.8H37583184q9705j22905j67191j50382j58608j75238j39832j40131j76549j44779
2537.2H36117864j07408j48356j69277j60873j99378j90436j23859j35839j82569j63615
2557.6H34536254j53780j99019k07782j87397j96934j98245k31087l17514l19123k36869
2578H32288504k55764l30388l02375k75552l17514l20256l34143m26770m51386l92794
2598.4H28881562l89517m05371l93510m25279m62353m52220m64321m86374m76479m71592
2618.8H24454546m88400m99607n00738n07593m80235m32313m46617m74870m54724m53532
$$ plain form
2639.2 819715917 819236934 818766594 818295479 817793667 817312717 816846967 816347420 815881789 815473318 815048516
2659.6 815048516 814616442 814196527 813723028 813223660 812788248 812354445 811862528 811427653 811066329 810618281
2680 810618281 810084999 809588194 809102714 808580637 808078408 807590604 807068586 806562603 806060851 805499792
2700.4 805499792 804935932 804381549 803798437 803258657 802744865 802147985 801505625 800883114 800263762 799661398
2720.8 799661398 799098611 798539996 797954679 797356069 796758771 796175599 795632660 795090735 794484377 793871701
2741.2 793871701 793319821 792787731 792247415 791710258 791146994 790531039 789909363 789299488 788639605 787955344
2761.6 787955344 787311018 786665559 785982311 785269260 784517705 783744872 782981813 782210708 781396806 780563176
2782 780563176 779743969 778910637 778032064 777093589 776091993 775084317 774108946 773103118 772009671
$$ packed form
2639.2H19715917m78983m70340m71115n01812m80950m65750m99547m65631m08471m24802
2659.6H15048516m32074m19915m73499m99368m35412m33803m91917m34875l61324m48048
2680H10618281n33282m96805m85480n22077n02229m87804n22018n05983n01752n61059
2700.4H05499792n63860n54383n83112n39780n13792n96880o42360o22511o19352o02364
2720.8G99661398n62787n58615n85317n98610n97298n83172n42939n41925o06358o12676
2741.2G93871701n51880n32090n40316n37157n63264o15955o21676o09875o59883o84261
2761.6G87955344o44326o45459o83248p13051p51555p72833p63059p71105q13902q33630
2782G80563176q19207q33332q78573r38475j001596j007676r75371j005828j093447
$$ plain form
2800.3 772009671 770891428 769791722 768653154 767481387 766287446 765035152 763743281 762403727
2816.6 762403727 761025727 759662449 758282363 756813824 755242586 753598034 751869023 750018597
2832.9 750018597 748018146 745772183 743107378 739912152 736159384 731824934 727230966 723176181
2849.3 723176181 720255375 718412578 717233241 716299534 715264976 713910341 712154627 709982574
2865.6 709982574 707490981 704903781 702454031 700267553 698347986 696644664 695114613 693684220
2881.9 693684220 692192614 690533996 688778162 686976850 685107946 683196843 681221962 679152846
2898.2 679152846 677061558 674945354 672661662 670128763 667326093 664161384 660573423 656729937
2914.5 656729937 653020263 649807692 647266686 645415962 644134223 643346071 643054068 643104434 643447816
$$ packed form
2800.3G72009671j118243j099706j138568j171767j193941j252294j291871j339554
2816.6G62403727j378000j363278j380086j468539j571238j644552j729011j850426
2832.9G50018597k000451k245963k664805l195226l752768m334450m593968m054785
2849.3G23176181k920806j842797j179337r33707j034558j354635j755714k172053
2865.6G09982574k491593k587200k449750k186478j919567j703322j530051j430393
2881.9F93684220j491606j658618j755834j801312j868904j911103j974881k069116
2898.2F79152846k091288k116204k283692k532899k802670l164709l587961l843486
2914.5F56729937l709674l212571k541006j850724j281739p88152k92003N0366L43382
$$ plain form
2932.9 643447816 644291162 645681083 647466421 649551451 651774943 653844774 655534327 656753361
2949.2 656753361 657534897 657957017 658136010 658280313 658568084 659057319 659654737 660263717 660911143 661588132
2969.6 661588132 662274182 663010001 663788140 664610088 665495455 666378498 667225361 668062329 668837905 669509292
2990 669509292 670019507 670228183 670134246 669801354 669259012 668578148 667770088 666858792 665966153 665135026
3010.4 665135026 664222836 663084924 661731780 660278201 658809841 657292962 655667663 653945088
3026.7 653945088 652194560 650480330 648808360 647063971 645166874 643246353 641377330 639440536
3043 639440536 637353539 635192513 633062243 630951822 628810883 626639843 624450326 622265160 620127797
3061.4 620127797 618055820 616034985 614042461 611995697 609856665 607740641 605752230 603850007
$$ packed form
2932.9F43447816Q43346J389921J785338K085030K223492K069831J689553J219034
2949.2F56753361P81536M22120J78993J44303K87771M89235N97418O08980O47426O76989
2969.6F61588132O86050P35819P78139Q21948Q85367Q83043Q46863Q36968P75576O71387
2990F69509292N10215K08676r3937l32892n42342o80864q08060r11296q92639q31127
3010.4F65135026r12190j137912j353144j453579j468360j516879j625299j722575
3026.7F53945088j750528j714230j671970j744389j897097j920521j869023j936794
3043F39440536k086997k161026k130270k110421k140939k171040k189517k185166k137363
3061.4F20127797k071977k020835j992524k046764k139032k116024j988411j902223
$$ plain form
3077.7 603850007 601867318 599747121 597598910 595461428 593338132 591221273 589045107 586815476
3094 586815476 584603369 582430840 580247521 577964783 575583220 573241532 570948660 568542540 566095948
3112.4 566095948 563781559 561464071 558967471 556294978 553505778 550736845 548096895 545478344
3128.7 545478344 542727590 539885998 537076533 534324586 531574368 528722525 525749683 522777438
3145 522777438 519869268 516996145 514112294 511136949 508030415 504872739 501743793 498636365 495526552
3163.4 495526552 492425829 489344329 486238331 483095378 479983032 476887107 473749906 470618159
3179.7 470618159 467505693 464380205 461283505 458246022 455223262 452173978 449118555 446080238
3196 446080238 443028212 439969242 436958462 433999002 431098700 428242773 425404221 422605336 419840157
$$ packed form
3077.7F03850007j982689k120197k148211k137482k123296k116859k176166k229631
3094E86815476k212107k172529k183319k282738k381563k341688k292872k406120k446592
3112.4E66095948k314389k317488k496600k672493k789200k768933k639950k618551
3128.7E45478344k750754k841592k809465k751947k750218k851843k972842k972245
3145E22777438k908170k873123k883851k975345l106534l157676l128946l107428l109813
3163.4D95526552l100723l081500l105998l142953l112346l095925l137201l131747
3179.7D70618159l112466l125488l096700l037483l022760l049284l055423l038317
3196D46080238l052026l058970l010780k959460k900302k855927k838552k798885k765179
$$ plain form
3214.3 419840157 417101532 414409757 411755741 409089744 406422287 403842717 401380450 399000973
3230.7 399000973 396683395 394345582 391918629 389501482 387213796 385061711 382986248 380921990
3247 380921990 378833920 376779854 374820650 372898430 370951444 369023383 367163211 365340739 363507777
3265.3 363507777 361680835 359907478 358128965 356258631 354326338 352428079 350607395 348788649
3281.6 348788649 346914858 345049709 343227029 341399670 339561552 337708235 335785031 333802015
3298 333802015 331828058 329900891 328050047 326192409 324171722 321999103 319797516 317645520 315533191
3316.3 315533191 313414514 311296761 309220195 307153642 304990619 302758366 300588995 298494369
3332.6 298494369 296435803 294397205 292315841 290147036 287952870 285782784 283682704 281701446
$$ packed form
3214.3D19840157k738625k691775k654016k665997k667457k579570k462267k379477
3230.7C99000973k317578k337813k426953k417147k287686k152085k075463k064258
3247C80921990k088070k054066j959204j922220j946986j928061j860172j822472j832962
3265.3C63507777j826942j773357j778513j870334j932293j898259j820684j818746
3281.6C48788649j873791j865149j822680j827359j838118j853317j923204j983016
3298C33802015j973957j927167j850844j857638k020687k172619k201587k151996k112329
3316.3C15533191k118677k117753k076566k066553k163023k232253k169371k094626
3332.6B98494369k058566k038598k081364k168805k194166k170086k100080j981258
$$ plain form
3348.9 281701446 279702097 277564108 275385976 273293316 271322966 269429684 267572701 265857220
3365.3 265857220 264265150 262515455 260548294 258664042 257051975 255608767 254243404 252945423
3381.6 252945423 251747608 250712425 249911293 249343559 248725653 247850001 247014046 246572047 246378735
3399.9 246378735 245966688 245247260 244681716 244485453 244435236 244362518 244231120 244088501 244076386 244231880
3420.3 244231880 244465664 244828954 245442495 246276006 247127414 248011395 249062091 250041544 250749588
3438.7 250749588 251467079 252518743 253897220 255433142 256950170 258453041 260053694 261782140
3455 261782140 263683677 265743613 267734766 269720495 272050917 274603367 276856750 278651565 280483186
3473.4 280483186 282698333 285194218 287698567 289967507 292192936 294687778 297295272 299818188
$$ packed form
3348.9B81701446j999349k137989k178132k092660j970350j893282j856983j715481
3365.3B65857220j592070j749695j967161j884252j612067j443208j365363j297981
3381.6B52945423j197815j035183q01132n67734o17906q75652q35955m41999j93312
3399.9B46378735m12047p19428n65544j96263n0217p2718j31398j42619j2115J55494
3420.3B44231880K33784L63290O13541Q33511Q51408Q83981J050696R79453P08044
3438.7B50749588P17491J051664J378477J535922J517028J502871J600653J728446
3455B61782140J901537K059936J991153J985729K330422K552450K253383J794815J831621
3473.4B80483186K215147K495885K504349K268940K225429K494842K607494K522916
$$ plain form
3489.7 299818188 302413732 305158675 307990581 310827255 313678920 316589028 319376767 321999699
3506 321999699 324796766 327925682 331226408 334462166 337535173 340670407 344022810 347558886 351051092
3524.4 351051092 354360133 357738107 361369342 365185261 369136751 373119056 377023578 381052762
3540.7 381052762 385308325 389589787 393714160 397802830 402079850 406563938 411094278 415632963
3557 415632963 420337975 425214469 430023074 434775978 440062940 445782572 451222390 456537724 462124139
3575.3 462124139 467918962 473875135 480017394 486145973 492184401 498490155 505076408 511388838
3591.7 511388838 517662406 524318099 531177163 538067043 544997215 551789403 558369040 565228045
3608 565228045 572387457 579437792 586465657 593288183 600071549 607310832 614327848 620698094 626699388
$$ packed form
3489.7B99818188K595544K744943K831906K836674K851665K910108K787739K622932
3506C21999699K797067L128916L300726L235758L073007L135234L352403L536076L492206
3524.4C51051092L309041L377974L631235L815919L951490L982305L904522M029184
3540.7C81052762M255563M281462M124373M088670M277020M484088M530340M538685
3557D15632963M705012M876494M808605M752904N286962N719632N439818N315334N586415
3575.3D62124139N794823N956173O142259O128579O038428O305754O586253O312430
3591.7E11388838O273568O655693O859064O889880O930172O792188O579637O859005
3608E65228045P159412P050335P027865O822526O783366P239283P017016O370246O001294
$$ plain form
3626.3 626699388 633273661 640659034 647284389 653288603 659225464 665046215 670858920 676515579
3642.6 676515579 681704521 686633825 692094088 697910488 702773154 706936419 711497724 716062427
3659 716062427 719983459 723568618 726998985 730092525 733088732 736316025 738966644 741113901 743436456
3677.3 743436456 745396256 746764958 747399807 746581554 743559957 738787472 734948099 734160244 736829221
3695.7 736829221 742350578 749408662 756657958 762736440 766953051 769792676 771928370 773870587
3712 773870587 775748372 777262509 778472304 779572964 780592918 781554163 782511652 783452749 784293175
3730.3 784293175 785122454 785964429 786843479 787823141 788524449 788724720 789128602 790064692 790649056 790948689
3750.7 790948689 791593075 792383611 792915165 793288887 793825746 794367313 794758439 795107961 795435429 795816541
$$ packed form
3626.3F26699388O574273P385373O625355O004214N936861N820751N812705N656659
3642.6F76515579N188942M929304N460263N816400M862666M163265M561305M564703
3659G16062427L921032L585159L430367L093540K996207L227293K650619K147257K322555
3677.3G43436456J959800J368702O34849q18253l021597m772485l839373p87855K668977
3695.7G36829221N521357P058084P249296O078482M216611K839625K135694J942217
3712G73870587J877785J514137J209795J100660J019954R61245R57489R41097Q40426
3730.3G84293175Q29279Q41975Q79050R79662P01308K00271M03882R36090N84364K99633
3750.7G90948689O44386P90536N31554L73722N36859N41567L91126L49522L27468L81112
$$ plain form
3771.1 795816541 796266198 796691477 797046363 797358334 797689617 797958612 798185587 798461735 798763156 799070954
3791.5 799070954 799299300 799531043 799873650 799970210 800034046 800435662 800671101 800829530 801184416 801528096
3811.9 801528096 801657677 801763475 802012861 801963747 801959336 802313507 802594185 802738905 802825689 802986026
3832.3 802986026 803205490 803198338 803076386 803158760 803348482 803616345 803968847 804210126 803979993 803296030
3852.7 803296030 803277552 803891778 804224253 804260075 804237008 804357350 804456353 804327011 804269135 804350615 804524899
3875.2 804524899 804678321 804651141 804745257 804881811 804916918 804996908 804916143 804766357 804810345 804878473 804850698
3897.6 804850698 804826498 804787517 804757953 804897070 805052340 805111825 805186808 805228055 805149734 805047929 805078208
3920 805078208 805176854 805207074 805250347 805303633 805257916 805243134 805388868 805560052 805618644 805560768 805508554
$$ packed form
3771.1G95816541M49657M25279L54886L11971L31283K68995K26975K76148L01421L07798
3791.5G99070954K28346K31743L42607R6560O3836M01616K35439J58429L54886L43680
3811.9H01528096J29581J05798K49386m9114m411L54171K80678J44720Q6784J60337
3832.3H02986026K19464p152j21952Q2374J89722K67863L52502K41279k30133o83963
3852.7H03296030j8478O14226L32475L5822k3067J20342R9003j29342n7876Q1480J74284
3875.2H04524899J53422k7180R4116J36554L5107P9990q0765j49786M3988O8128k7775
3897.6H04850698k4200l8981k9564J39117J55270N9485P4983M1247p8321j01805L0279
3920H05078208R8646L0220M3273N3286m5717j4782J45734J71184N8592n7876n2214
$$ plain form
3942.5 805508554 805562258 805630744 805659235 805668414 805647373 805671573 805803597 805946887 806019068 806071222 806120157
3964.9 806120157 806153059 806237340 806359231 806458235 806561112 806645155 806699216 806778491 806859255 806912065 806963980
3987.3 806963980 807050288 807197511 807349861 807406843 807426810
3997.5 807426810
$$ packed form
3942.5H05508554N3704O8486K8491R179k1041K4200J32024J43290P2181N2154M8935
3964.9H06120157L2902Q4281J21891R9004J02877Q4043N4061P9275Q0764N2810N1915
3987.3H06963980Q6308J47223J52350N6982J9967
3997.5H07426810
##END=$$ End of the data block
