##TITLE=$$ Begin of the data block
##JCAMP-DX=5.00 $$ ACD/SpecManager v 10.08
##SPECTROMETER/DATA SYSTEM=Alpha
##DATE=14 Apr 2014 11:23:48
##DATA TYPE=INFRARED SPECTRUM
##DATA CLASS=XYDATA
##ORIGIN=
##OWNER=
##NPOINTS=1765
##FIRSTX=399.75695801
##LASTX=3997.56933594
##MAXX=3997.56933594
##MINX=399.75695801
##MAXY=0.84248734
##MINY=0.24424078
##XFACTOR=1.0000000000
##YFACTOR=1.000000000000000e-9
##FIRSTY=0.54980302
##DELTAX=2.03957629
##XUNITS=1/CM
##YUNITS=ARBITRARY UNITS
##XYDATA=(X++(Y..Y))
399.8E49803019j395524o14047p24673j457811r69350n75304q14617l73661l95417
418.1E42482615p86126K06351L34740m70877j13010J97887m23193l54051j81914o57499
438.5E40234923j72495L58164l82662l41177L72112j63496m64678K76924j61708j064658
458.9E38491249m45366j70231o77466m73261l63708q88943q35777p09414j082063o64174
479.3E32180846p0453n38945n37455J21653k83122p26521l22402o97136j237392n63324
499.7E27325749l92317r62973n89252l95774j044572j015067p94053j311183j301408
518.1E19519150p82549j127243j322627p91669j069248j490176r30011q01265j061082
536.4E10143280m68612k61843q18610o77168n77391j087308q75771o27040j275063
$$ y = [549803019, 548407495, 547793448, 547068775, 545610964, 544641614, 544066310, 543251693, 542878032, 542482615, 541696489, 541902840, 542237580, 541766703, 541653693, 541851580, 541428387, 541074336, 540892422, 540234923, 540062428, 540420592, 540037930, 539696753, 540068865, 539905369, 539440691, 539717615, 539555907, 538491249, 538045883, 537875652, 537198186, 536724925, 536361217, 535472274, 534636497, 533927083, 532845020, 532180846, 532110393, 531571448, 531033993, 531155646, 530872524, 530146003, 529823601, 529126465, 527889073, 527325749, 526933432, 525970459, 525381207, 524985433, 523940861, 522925794, 522131741, 520820558, 519519150, 518736601, 517609358, 516286731, 515495062, 514425814, 512935638, 512005627, 511204362, 510143280, 509674668, 509412825, 508594215, 507917047, 507339656, 506252348, 505376577, 504749537, 503474474]
554.8E03474474j341403q60214j286328j739204j450449j685142k158314j828969j752734
573.1D89371717j955092j393288j121015j514822j187712o94871q90493p44701l17245
591.5D79552478o08921q63970p79271j531482k441018k446622k465725k546877j836598
609.8D64031994j172393r35137o9291J211912J995563K751172L562748L620058L627837
628.2D78624463M008383L839582L366679L379106L185809K577931K364754K247751
644.5E03594458K038539K421319K711952J989066J557172K350330L271401L623724
660.8E23557961L666341L014386K692759L986061L755986K850652L015220L233791
677.1E49773157K971589K848864K809882K377272K093434K122581J836538J425863
$$ y = [503474474, 502133071, 501272857, 499986529, 498247325, 496796876, 495111734, 492953420, 491124451, 489371717, 487416625, 486023337, 484902322, 483387500, 482199788, 481504917, 480614424, 479869723, 479552478, 478943557, 478079587, 477300316, 475768834, 473327816, 470881194, 468415469, 465868592, 464031994, 462859601, 461924464, 461855173, 463067085, 465062648, 467813820, 471376568, 474996626, 478624463, 482632846, 486472428, 489839107, 493218213, 496404022, 498981953, 501346707, 503594458, 505632997, 508054316, 510766268, 512755334, 514312506, 516662836, 519934237, 523557961, 527224302, 530238688, 532931447, 536917508, 540673494, 543524146, 546539366, 549773157, 552744746, 555593610, 558403492, 560780764, 562874198, 564996779, 566833317, 568259180]
693.5E68259180J412689J315832J107634J364588J710475J723528J951158K396106
709.8E81241190K455891K462208K737403K759397K618074K845288K902865K602875
726.1F02625191K562404K601504K324879K157391K205729K038181J894772J992404
742.4F20402455K017856K017975K178967K155721J958251J968801J973212J753449
758.7F36426687J678348J725793J467228J282394J351535J049042N13255K94447k9564
777.1F45759165n53727o79612o41227p55071m14849N23150J366794K304435L609657
795.4F50518715M581035N121409N653739N685747N031049M471481L933966L043592
811.7F88040733K318800J799345Q94487r8884r55701k111614l237843l786147m110515
$$ y = [568259180, 569671869, 570987701, 572095335, 573459923, 575170398, 576893926, 578845084, 581241190, 583697081, 586159289, 588896692, 591656089, 594274163, 597119451, 600022316, 602625191, 605187595, 607789099, 610113978, 612271369, 614477098, 616515279, 618410051, 620402455, 622420311, 624438286, 626617253, 628772974, 630731225, 632700026, 634673238, 636426687, 638105035, 639830828, 641298056, 642580450, 643931985, 644981027, 645494282, 645788729, 645759165, 645205438, 644525826, 643884599, 643129528, 642714679, 643237829, 644604623, 646909058, 650518715, 655099750, 660221159, 665874898, 671560645, 676591694, 681063175, 684997141, 688040733, 690359533, 692158878, 693053365, 692954481, 691998780, 689887166, 686649323, 682863176, 678752661]
830.1F78752661m424215m295528l992259l875613l495574k952457k745390k273440
846.4F50698185r55939O82175K483725M635513O430567P427036Q210242Q698702Q382916
864.8F96693122P797122P197559O089032M980803M420101L578007K352119J484036
881.1G34591901N24760p07806j376092j691282k079963j826287r53436k89321M12822
899.4G26605296J297593J532913J231253J026749M45187p07566j684606k569557l604889
917.8G23572373l945529l541827l075421k093375n85198L05712O40571J019001Q88288
936.2G13184595L62694K82705J29163n37157r81390j456857k617180l757000m688501
954.5F99921072o020964p318973q306682r630144j1083066j2050569j2865007j3420999
$$ y = [678752661, 674328446, 670032918, 666040659, 662165046, 658669472, 655717015, 652971625, 650698185, 649742246, 650424421, 652908146, 657543659, 663974226, 671401262, 679611504, 688310206, 696693122, 704490244, 711687803, 717776835, 722757638, 727177739, 730755746, 733107865, 734591901, 735116661, 734408855, 733032763, 731341481, 729261518, 727435231, 726481795, 726192474, 726605296, 727902889, 729435802, 730667055, 731693804, 732138991, 731431425, 729746819, 727177262, 723572373, 719626844, 716085017, 713009596, 710916221, 710331023, 710636735, 711277306, 712296307, 713184595, 713547289, 713829994, 713959157, 713422000, 712440610, 710983753, 708366573, 704609573, 699921072, 693900108, 686581135, 678274453, 668644309, 657561243, 645510674, 632645667, 619224668]
970.8F19224668j2932837j1713803j0474384r104371p800639p083297o553948n772590
987.1E47788799n108059m497945l591001k815962k366423j832009j428664j569151
1003.5E24579585j991511k604008l549754m365504m703820m909455m956961m517406
1019.8D92981166m000366l771752l501266l243298l245204l139794k849311k709359
1036.1D66520816k576917k297759k194733k249330k146691k064914k061456j667857
1052.4D49261159r07809k35587L97235R29087Q80808K55257o57290j855076l004938
1070.8D45062846l576517l696323l572106l142774k762109k767831k833277k864987
1087.1D19846922l049314l047109k614527k087772j656592j245082j057595j111358
$$ y = [619224668, 606291831, 594578028, 584103644, 574999273, 567198634, 560115337, 553561389, 547788799, 542680740, 538182795, 534591794, 531775832, 529409409, 527577400, 526148736, 524579585, 522588074, 519984066, 516434312, 512068808, 507364988, 502455533, 497498572, 492981166, 488980800, 485209048, 481707782, 478464484, 475219280, 472079486, 469230175, 466520816, 463943899, 461646140, 459451407, 457202077, 455055386, 452990472, 450929016, 449261159, 448353350, 448117763, 448514998, 449444085, 450324893, 450580150, 449922860, 448067784, 445062846, 441486329, 437790006, 434217900, 431075126, 428313017, 425545186, 422711909, 419846922, 416797608, 413750499, 411135972, 409048200, 407391608, 406146526, 405088931, 403977573]
1103.4D03977573j047880r41544j082182j222492j228362j444816j939208k488166
1119.7C92582923k824336k529681j720488q63194L64929J589716J787960J508385J602679
1138.1C91498893J809925J702905J430333J306653J267642J253664J443356J747459
1154.4D03460830K040029K523452L153950L743351M481554N412072O165087O678998
1170.7D37659323P123471P364541P364750P343977P239551O876319O398529N811572
1187D93182033M884601L802329K902031K138794J590132J523972J758099K020001K395332
1205.4E16197324K652228K427995K013683J684010J294792J003265J033426J099109
1221.7E29405832J100302J338184J674354J835763K073884K398491K480626K519727
$$ y = [403977573, 402929693, 401988149, 400905967, 399683475, 398455113, 397010297, 395071089, 392582923, 389758587, 387228906, 385508418, 384645224, 385010153, 386599869, 388387829, 389896214, 391498893, 393308818, 395011723, 396442056, 397748709, 399016351, 400270015, 401713371, 403460830, 405500859, 408024311, 411178261, 414921612, 419403166, 424815238, 430980325, 437659323, 444782794, 452147335, 459512085, 466856062, 474095613, 480971932, 487370461, 493182033, 498066634, 501868963, 504770994, 506909788, 508499920, 510023892, 511781991, 513801992, 516197324, 518849552, 521277547, 523291230, 524975240, 526270032, 527273297, 528306723, 529405832, 530506134, 531844318, 533518672, 535354435, 537428319, 539826810, 542307436, 544827163]
1238E44827163K679408K587557K230644J937687J571834J071215P85828O32584M62889
1256.4E58786809O53685J194894J660824K168715K853811L320276L609717M087627
1272.7E78336358M438520M473686M633486M873216M909277N065620N378068N351305
1289F17459536N146920N055607M681170M111468L810287L414154K749383K352059K113164
1307.4F50893748J655400J317620J190364Q92580P15732R39429J052678J000941J171052
1325.7F60829544J195312Q16583N20587K60890j96100l88383k06173j66774j40309
1344.1F62525177Q6129O4373j96576k76566m71353r53258j190841j427412k059281
1362.4F56100392k371013k280176k467036k581537k596378l066122l792107n479038
$$ y = [544827163, 547506571, 550094128, 552324772, 554262459, 555834293, 556905508, 557691336, 558323920, 558786809, 559440494, 560635388, 562296212, 564464927, 567318738, 570639014, 574248731, 578336358, 582774878, 587248564, 591882050, 596755266, 601664543, 606730163, 612108231, 617459536, 622606456, 627662063, 632343233, 636454701, 640264988, 643679142, 646428525, 648780584, 650893748, 652549148, 653866768, 655057132, 655949712, 656665444, 657604873, 658657551, 659658492, 660829544, 662024856, 662841439, 663362026, 663622916, 663426816, 663038433, 662832260, 662665486, 662525177, 662611306, 662675679, 662479103, 662202537, 661731184, 660777926, 659587085, 658159673, 656100392, 653729379, 651449203, 648982167, 646400630, 643804252, 640738130, 636946023, 631466985]
1378.7F31466985r114206j0699570m916430L732801O005406K858698J59502j520156
1395.1F17973030k511621l050566l378272l564298l666580l462791l242493k952397
1411.4E92144012k448618k031088j887500j811385j429796j055480p61270n90265o31511
1429.7E79497099l42608R1672K27511N95033J065314J266539J501739J956880K479673
1448.1E88338852K987564L523409M099488N503059P173419O591439N936146O523490
1464.4F30676866O942093O504416O763220Q078993P908225O292641N123734M159212
1480.7F82449400L142775K184569J307071J95324p53283j124323j809120k857804l193319
1499.1F79541290l092587l133834m154563o160080n615711m466176m311979m252613
$$ y = [631466985, 622352779, 611653209, 606736779, 610469580, 616474986, 619333684, 619493186, 617973030, 615461409, 612410843, 609032571, 605468273, 601801693, 598338902, 595096409, 592144012, 589695394, 587664306, 585776806, 583965421, 582535625, 581480145, 580718875, 580128610, 579497099, 579154491, 579246163, 579473674, 580068707, 581134021, 582400560, 583902299, 585859179, 588338852, 591326416, 594849825, 598949313, 604452372, 611625791, 618217230, 624153376, 630676866, 637618959, 644123375, 650886595, 658965588, 666873813, 673166454, 678290188, 682449400, 685592175, 687776744, 689083815, 689279139, 688525856, 687401533, 685592413, 682734609, 679541290, 676448703, 673314869, 669160306, 663000226, 657384515, 652918339, 648606360, 644353747]
1515.4F44353747l853142l169656l206372l059328k574026k602279k380669k180398
1531.7F21327877k289891j850546j398921j673281j531541p05362j31785J77443M59909
1550.1F12383902Q87632J143039J081168Q20160N34773K58744j23084n43654j326084
1568.4F15116596k179622k310455k973199m511774m565358m298866m986226n530477
1584.7E83760619n897879o305755o629169o807923p057547p128537p030904p108629
1601.1E29794276p198572p072509p041275p214666p027030o563037p018030p810682
1617.4D72848475o306231n336076n875319n573690m883260m277855l154814k391577
1633.7D35049653k094269q63582M94153J413226K202421L331274M371375M113108M769891
$$ y = [644353747, 640500605, 637330949, 634124577, 631065249, 628491223, 625888944, 623508275, 621327877, 619037986, 617187440, 615788519, 614115238, 612583697, 611878335, 611746550, 611923993, 612383902, 613271534, 614414573, 615495741, 616315901, 616850674, 617109418, 616986334, 616442680, 615116596, 612936974, 610626519, 607653320, 603141546, 598576188, 594277322, 589291096, 583760619, 577862740, 571556985, 564927816, 558119893, 551062346, 543933809, 536902905, 529794276, 522595704, 515523195, 508481920, 501267254, 494240224, 487677187, 480659157, 472848475, 466542244, 461206168, 455330849, 449757159, 444873899, 440596044, 437441230, 435049653, 432955384, 432091802, 432585955, 433999181, 436201602, 439532876, 443904251, 448017359, 452787250]
1652D52787250O676555N801797N115747N746782O564588O912380O493390O965130P946909
1670.4E11010528P547795P750810Q532106Q140922P774472Q531153J0535241R935319
1686.7E79758346Q543134Q824587Q528769R232878J0375679J0885417J2616635J1125266
1703F59890711R534061R633780Q607924P593810P016898O671011O734788O173671N100071
1721.4G26956725M662216M585385M304826M027963L674924L787756L885091L372311
1737.7G59257197L393412L515840L345906L332496L336012L193379L093719K799273
1754G85267234K479136K348006K197325K029300J869916J764894J679957J515508J451194
1772.4H02602470J502991J379549J314283J310050J194060J125038J200497J165807
$$ y = [452787250, 459463805, 465265602, 470381349, 476128131, 482692719, 489605099, 496098489, 503063619, 511010528, 518558323, 526309133, 534841239, 542982161, 550756633, 559287786, 569823027, 579758346, 588301480, 597126067, 605654836, 614887714, 625263393, 636148810, 648765445, 659890711, 669424772, 679058552, 687666476, 695260286, 702277184, 708948195, 715682983, 721856654, 726956725, 731618941, 736204326, 740509152, 744537115, 748212039, 751999795, 755884886, 759257197, 762650609, 766166449, 769512355, 772844851, 776180863, 779374242, 782467961, 785267234, 787746370, 790094376, 792291701, 794321001, 796190917, 797955811, 799635768, 801151276, 802602470, 804105461, 805485010, 806799293, 808109343, 809303403, 810428441, 811628938, 812794745]
1788.7H12794745J001179J014888J016856R13977Q85606Q98600Q47459Q15868Q00490
1807H20989668P32601P05004P17759O80685O42538O75976O19233N30243O01232O39498
1827.4H27534437M97639M99964N94497N02765M66228N61833N00500L21329L81350M65036
1847.8H32325578M22477M48525M37260L41237L25799L81052L39568L06606L15905K37703
1868.2H35881710K29836L45647L34561K39551K47419K62260J93536J85490K28405J44661
1888.6H38293076J23560K36928J97292J04606J37448J42873J01089J69098K10405R2924
1909H39809299K7120P4148N4598K7120J08778R4295J0967M1306K3305m9412r477J6868
1933.5H40228915p2002r2387m5062p3909q5533n0902q5473j30594j21415j40428j81318
$$ y = [812794745, 813795924, 814810812, 815827668, 816741645, 817627251, 818525851, 819373310, 820189178, 820989668, 821722269, 822427273, 823145032, 823825717, 824468255, 825144231, 825763464, 826293707, 826894939, 827534437, 828032076, 828532040, 829126537, 829629302, 830095530, 830657363, 831157863, 831479192, 831860542, 832325578, 832748055, 833196580, 833633840, 833975077, 834300876, 834681928, 835021496, 835328102, 835644007, 835881710, 836111546, 836457193, 836791754, 837031305, 837278724, 837540984, 837734520, 837920010, 838148415, 838293076, 838416636, 838653564, 838850856, 838955462, 839092910, 839235783, 839336872, 839505970, 839716375, 839809299, 839836419, 839910567, 839965165, 839992285, 840101063, 840195358, 840206325, 840247631, 840270936, 840221524, 840212047, 840228915, 840156913, 840064526, 840019464, 839945555, 839860022, 839809120, 839723647, 839593053, 839471638, 839331210, 839149892]
1955.9H39149892j54316j18733j50680j61111j37866j43528j40786j27435j53839j76430
1976.3H37685168j35958j16587j59204j63555j25468j45674j73449j51456j49548j80602
1996.7H36183667j91927j68204j74999j99557k02477k32160k60353j97530j67429k25842
2017.1H34163189k31087k14339k35974k18809j57833j80304k23756j90914j88112k22623
2037.5H32099438j97649j67728k02060j85251j36018j66654j64032q5056j01745j70708
2057.9H30522537j74165j55806r3758j5676m0829j33813j17779l4272n2393p1466j1027
2080.3H29621553k9862q4578l9697k3544o9857o1750k8551k6285J3172M7267k802j7821
2104.8H29297245K7835k623l8564L8445O3598j4543j4842L3260J4662M5777J14679
$$ y = [839149892, 838995576, 838876843, 838726163, 838565052, 838427186, 838283658, 838142872, 838015437, 837861598, 837685168, 837549210, 837432623, 837273419, 837109864, 836984396, 836838722, 836665273, 836513817, 836364269, 836183667, 835991740, 835823536, 835648537, 835448980, 835246503, 835014343, 834753990, 834556460, 834389031, 834163189, 833932102, 833717763, 833481789, 833262980, 833105147, 832924843, 832701087, 832510173, 832322061, 832099438, 831901789, 831734061, 831532001, 831346750, 831210732, 831044078, 830880046, 830794990, 830693245, 830522537, 830348372, 830192566, 830098808, 830083132, 830042303, 829908490, 829790711, 829756439, 829704046, 829632580, 829621553, 829591691, 829507113, 829467416, 829443872, 829374015, 829312265, 829283714, 829257429, 829270601, 829317868, 829315066, 829297245, 829325080, 829322457, 829283893, 829322338, 829385936, 829371393, 829356551, 829389811, 829404473, 829450250, 829564929]
2127.3H29564929P3552N5850J19209Q9049M3154J17600J21296L5285Q2911J55448R8527
2149.7H30556810R1672J64389J22130Q2851J76251J77085J04428J79350K03311R0838
2170.1H31949115J25408K26855J71960J11043J26124P0273N1022J73867K02238J13666
2190.5H33321571J11878J27197P8737R8110J14083R298J3113J34945J13249P9274J38223
2212.9H34339678N4360n4837M7088R9778R179M9949J21176K6584o437O4671K7656l516
2237.4H34775329N5432J5318m1246M3631P3254k683R895K3722m8816k0027O5148K0385
2261.9H34969342j4246M9830M2259p152N2154P5638o735M1902J43111Q4400N0127Q6844
2286.3H35567474L7432k4557o437N066k1160j609K2173J0371J5080j0907q6368o3240
$$ y = [829564929, 829638481, 829694331, 829813540, 829902589, 829945743, 830063343, 830184639, 830219924, 830302835, 830458283, 830556810, 830648482, 830812871, 830935001, 831017852, 831194103, 831371188, 831475616, 831654966, 831858277, 831949115, 832074523, 832301378, 832473338, 832584381, 832710505, 832780778, 832831800, 833005667, 833207905, 833321571, 833433449, 833560646, 833639383, 833737493, 833851576, 833860874, 833873987, 834008932, 834122181, 834201455, 834339678, 834394038, 834339201, 834386289, 834486067, 834495246, 834545195, 834666371, 834692955, 834686518, 834751189, 834778845, 834775329, 834830761, 834846079, 834804833, 834848464, 834921718, 834919035, 834928930, 834952652, 834903836, 834883809, 834948957, 834969342, 834955096, 835004926, 835047185, 835040033, 835092187, 835167825, 835161090, 835202992, 835346103, 835430503, 835480630, 835567474, 835604906, 835580349, 835573912, 835578978, 835557818, 835556209, 835578382, 835588753, 835603833, 835592926, 835506558, 835443318]
2310.8H35443318N2035K8610j13249j33872p5102n6743K384j3590j15156j62661l03686
2333.3H34552288n25296m66823n3168K96593M91321Q54373R60648M67241q2493k78175
2353.6H36216509k42352j58250j7584P3910J72913L78728N14328N72741O41048N76914
2374H38728905M67002N34594N97120M63604L59476L35574K22027J35065J55568R3400
2394.4H42092335J2815R2507J19745K0385K7657O1094j3887k623P5042K265p0810l1233
2418.9H42385292q5652j82509j36853n9604k265J10030J32442l815p3791l8504p7844
2441.3H41966927j11699m3631m9173j13845q5414o4254j02043r0599p5519j04725q1003
2463.8H41045022o2227j38223j56522p8798q9943j49131j31249j36078j70707j36793
$$ y = [835443318, 835495353, 835523963, 835410714, 835276842, 835201740, 835144997, 835147381, 835133791, 835018635, 834855974, 834552288, 834026992, 833560169, 833507001, 833803594, 834294915, 835149288, 836109936, 836577177, 836494684, 836216509, 835974157, 835815907, 835798323, 835872233, 836045146, 836423874, 836938202, 837510943, 838151991, 838728905, 839195907, 839730501, 840327621, 840791225, 841150701, 841486275, 841708302, 841843367, 841998935, 842092335, 842105150, 842197657, 842317402, 842337787, 842365444, 842426538, 842412651, 842410028, 842485070, 842487335, 842416525, 842385292, 842299640, 842117131, 841980278, 841920674, 841918409, 842028439, 842160881, 842157066, 842083275, 842044771, 841966927, 841855228, 841811597, 841762424, 841648579, 841563165, 841498911, 841396868, 841306269, 841230750, 841126025, 841045022, 840982795, 840844572, 840688050, 840609252, 840519309, 840370178, 840238929, 840102851, 839932144, 839795351]
2484.2H39795351r6858j20818j24335j07646j44184j51396j22666j44661j68204j45197
2504.6H38469386j33335j56880j35720r2983j22011j43170j05500j16170j47402j38879
2525H37177336j54257j50442j14143j47462j90079j30176q7142j65344k06589j63973
2545.4H35667729j72913j92344j55747j50204j63972j46449j63912k22326k46226k20657
2565.8H33832979j89245j82390k23338k80500k92539k88725l17157l07917k44022k73466
2586.2H31233680l66211l58045l28958l84271m02391l77595m23611m44412l99470m16041
2606.6H27332675m51445m21524m21822m79341m93228m69089m59730m57585m70698n03957
2626.9H22704256n24879n10454m81606m50551m29630m68731n12183m62771m30524m83751
$$ y = [839795351, 839698493, 839577675, 839453340, 839345694, 839201510, 839050114, 838927448, 838782787, 838614583, 838469386, 838336051, 838179171, 838043451, 837950468, 837828457, 837685287, 837579787, 837463617, 837316215, 837177336, 837023079, 836872637, 836758494, 836611032, 836420953, 836290777, 836203635, 836038291, 835831702, 835667729, 835494816, 835302472, 835146725, 834996521, 834832549, 834686100, 834522188, 834299862, 834053636, 833832979, 833643734, 833461344, 833238006, 832957506, 832664967, 832376242, 832059085, 831751168, 831507146, 831233680, 830867469, 830509424, 830180466, 829796195, 829393804, 829016209, 828592598, 828148186, 827748716, 827332675, 826881230, 826459706, 826037884, 825558543, 825065315, 824596226, 824136496, 823678911, 823208213, 822704256, 822179377, 821668923, 821187317, 820736766, 820307136, 819838405, 819326222, 818863451, 818432927, 817949176]
2647.3H17949176m83632m64201m85778m45366m06921m66704m99964m36604m27663m91619
2667.7H13340724m78745m39405m49241m17709l92079m49002m80950m81963n26905n42045
2688.1H08682680m83513m68373m97401m94838n29468n78343n58079n38587n60522n59092
2708.5H03414464n69522o22929o21020n80669n79238n63740n48900o05523o46949o06060
2728.9G97469914n71966n79477n46634n31375o11663o15001n26905n31435n65588n57661
2749.3G91832209n93961o36398o14822o02365o39021o45995o36518o69301o98805p12335
2769.7G85382688p40886p62164p65980p87675q10027p91013q17478q97229r17911r32396
2790.1G77159929r87589r93192r52781r74118j054704j088798j108408j160801j183867
$$ y = [817949176, 817465544, 817001343, 816515565, 816070199, 815663278, 815196574, 814696610, 814260006, 813832343, 813340724, 812861979, 812422574, 811973333, 811555624, 811163545, 810714543, 810233593, 809751630, 809224725, 808682680, 808199167, 807730794, 807233393, 806738555, 806209087, 805630744, 805072665, 804534078, 803973556, 803414464, 802844942, 802222013, 801600993, 801020324, 800441086, 799877346, 799328446, 798722923, 798075974, 797469914, 796897948, 796318471, 795771837, 795240462, 794628799, 794013798, 793486893, 792955458, 792389870, 791832209, 791238248, 790601850, 789987028, 789384663, 788745642, 788099647, 787463129, 786793828, 786095023, 785382688, 784641802, 783879638, 783113658, 782325983, 781515956, 780724943, 779907465, 779010236, 778092325, 777159929, 776172340, 775179148, 774226367, 773252249, 772197545, 771108747, 770000339, 768839538, 767655671]
2808.5G67655671j210988j267552j280785j304209j376867j384497j365423j465023
2824.8G57000327j610458j665473j716196j857758k015889k224028k641797l202975
2841.1G40065753l779709m356265m603386m061341k898395j788616j156152r73582
2857.4G16448307j068234j336813j730681k155423k480090k587258k466918k229332
2873.7G00393558j938999j667082j510859j468420j514018j623869j708507j768649
2890.1F87193155j876235j949668j966118k049566k129495k145171k268434k517223
2906.4F70291245k792537l157437l612280l876686l704846l179729k518713j864911
2922.7F45584106j301705p72417k55346O1929L19004Q19147J383543J795590K109408
$$ y = [767655671, 766444683, 765177131, 763896346, 762592137, 761215270, 759830773, 758465350, 757000327, 755389869, 753724396, 752008200, 750150442, 748134553, 745910525, 743268728, 740065753, 736286044, 731929779, 727326393, 723265052, 720366657, 718578041, 717421889, 716448307, 715380073, 714043260, 712312579, 710157156, 707677066, 705089808, 702622890, 700393558, 698454559, 696787477, 695276618, 693808198, 692294180, 690670311, 688961804, 687193155, 685316920, 683367252, 681401134, 679351568, 677222073, 675076902, 672808468, 670291245, 667498708, 664341271, 660728991, 656852305, 653147459, 649967730, 647449017, 645584106, 644282401, 643509984, 643254638, 643316567, 643635571, 644454718, 645838261, 647633851, 649743259]
2941F49743259K244949K070308J672447J191258P46191M13120K05934J74820L20554
2959.4F58782840N05090N79476O02662O61791O72757O72877P53701P89344P91312Q89599
2979.8F65701449R26316Q38458P98226P87854P09832N10275J74045j27732l41118n39779
3000.2F69437826o72341p82728q86261q91209q63612r29296j105606j314521j446903
3018.5F60545349j494586j551807j640559j684606j682102j696766j691162j734019
3034.9F47369742j900076j951635j872301j932025k092541k171516k134919k099872
3051.2F31214857k156854k189517k171874k179324k155483k064228j962483j930833
3067.5F14404261k032936k165138k139032j974166j886785k001583k143979k161861
$$ y = [649743259, 651988208, 654058516, 655730963, 656922221, 657668412, 658081532, 658287466, 658462286, 658782840, 659287930, 659867406, 660470068, 661131859, 661804616, 662477493, 663231194, 664020538, 664811850, 665701449, 666627765, 667466223, 668264449, 669052303, 669762135, 670272410, 670446455, 670318723, 669977605, 669437826, 668765485, 667982757, 667096496, 666205287, 665341675, 664412379, 663306773, 661992252, 660545349, 659050763, 657498956, 655858397, 654173791, 652491689, 650794923, 649103761, 647369742, 645469666, 643518031, 641645730, 639713705, 637621164, 635449648, 633314729, 631214857, 629058003, 626868486, 624696612, 622517288, 620361805, 618297577, 616335094, 614404261, 612371325, 610206187, 608067155, 606092989, 604206204, 602204621, 600060642, 597898781]
3083.8E97898781k150893k139270k126754k165436k188564k163708k161801k225101
3100.1E80577254k336383k383232k300918k245903k370834k470136k380729k352535
3116.4E61736584k483428k650380k787948k786040k678037k645671k714276k771080
3132.8E40219724k757788k730190k764702k889812l002465k984941k914250k868235
3149.1E17307341k865314k993584l158748l161907l086567l072381l107697l130019
3165.4D92731124l112435l096521l105819l122717l129453l120959l089785l082156
3181.7D67871279l112436l102779l056914l049075l067464l054738l033012l040970
3198D43353891l058731l036559k981245k911777k840340k818107k836049k797693k706707
$$ y = [597898781, 595747888, 593608618, 591481864, 589316428, 587127864, 584964156, 582802355, 580577254, 578240871, 575857639, 573556721, 571310818, 568939984, 566469848, 564089119, 561736584, 559253156, 556602776, 553814828, 551028788, 548350751, 545705080, 542990804, 540219724, 537461936, 534731746, 531967044, 529077232, 526074767, 523089826, 520175576, 517307341, 514442027, 511448443, 508289695, 505127788, 502041221, 498968840, 495861143, 492731124, 489618689, 486522168, 483416349, 480293632, 477164179, 474043220, 470953435, 467871279, 464758843, 461656064, 458599150, 455550075, 452482611, 449427873, 446394861, 443353891, 440295160, 437258601, 434277356, 431365579, 428525239, 425707132, 422871083, 420073390, 417366683]
3216.4D17366683k655506k637714k641231k641856k574772k492219k447218k408415
3232.7C96867752k414524k431006k355903k243698k156943k074659k026528k050578
3249C79113913k024591j938999j922458j942367j935780j911729j896263j891642j844824
3267.4C61805260j751900j735031j825452j900315j895666j857907j845300j856506
3283.7C47137183j864046j839965j787335j787722j873285j967579k010822j976103
3300C32030326j906484j865179j890182k019852k171726k221286k157926k071292k056121
3318.4C13670278k110243k131343k094448k124458k182395k167522k142549k092928
3334.7B96624392k027064k059162k148539k167374k156943k110153j981050j990378
$$ y = [417366683, 414711177, 412073463, 409432232, 406790376, 404215604, 401723385, 399276167, 396867752, 394453228, 392022222, 389666319, 387422621, 385265678, 383191019, 381164491, 379113913, 377089322, 375150323, 373227865, 371285498, 369349718, 367437989, 365541726, 363650084, 361805260, 360053360, 358318329, 356492877, 354592562, 352696896, 350838989, 348993689, 347137183, 345273137, 343433172, 341645837, 339858115, 337984830, 336017251, 334006429, 332030326, 330123842, 328258663, 326368481, 324348629, 322176903, 319955617, 317797691, 315726399, 313670278, 311560035, 309428692, 307334244, 305209786, 303027391, 300859869, 298717320, 296624392, 294597328, 292538166, 290389627, 288222253, 286065310, 283955157, 281974107, 279983729]
3351B79983729k153933k197921k065182j914680j892209j899540j763970j633763j718223
3369.3B62744308j922817j913517j646757j441390j343190j287699j232952j072258
3385.7B50883728p95692n44771n89818q69304q71897m52518j62647m13641p52643n63517
3406.1B44867280j83672q7559j16855j32382j06036M3854K01493K60607L72052O13645
3426.5B45732427Q41722Q51139Q81329J046404R37641O96451Q06152J125187J312971
3444.8B54231423J381159J433790J548618J659095J746237J909852K079189K032817
3461.1B68022180J972973K256811K513498K247959J808494J844258K174735K441316
3477.4B85282224K515763K344758K314925K544433K592385K495229K583235K744407
$$ y = [279983729, 277829796, 275631875, 273566693, 271652013, 269759804, 267860264, 266096294, 264462531, 262744308, 260821491, 258907974, 257261217, 255819827, 254476637, 253188938, 251955986, 250883728, 250088036, 249543265, 248953447, 248084143, 247212246, 246759728, 246597081, 246183440, 245430797, 244867280, 244683608, 244596049, 244479194, 244346812, 244240776, 244284630, 244486123, 244746730, 245118782, 245732427, 246574149, 247425288, 248306617, 249353021, 250290662, 250987113, 251793265, 252918452, 254231423, 255612582, 257046372, 258594990, 260254085, 262000322, 263910174, 265989363, 268022180, 269995153, 272251964, 274765462, 277013421, 278821915, 280666173, 282840908, 285282224, 287797987, 290142745, 292457670, 295002103, 297594488, 300089717, 302672952, 305417359]
3493.8C05417359K840161K813697K828151K915263K796829K628773K750516L080458
3510.1C28071207L338337L275186L050625L071725L307909L593057L586621L307223
3526.4C54601890L327042L609329L803492L984034M027814L874242L994942M291653
3542.7C85514438M349470M165262M058123M196227M433184M545719M581600M723162
3559D20567185M860699M790187M762053N334139N769670N452305N298913N554288N736560
3577.4D68125999N917460O175816O195187O066293O263047O548256O340265O323576
3593.7E17955899O681860O871104O914914O952405O803453O576955O836235P181645
3610E72774470P102311P000386O744385O765664P309079P057965O311416N921066O539822
$$ y = [305417359, 308257520, 311071217, 313899368, 316814631, 319611460, 322240233, 324990749, 328071207, 331409544, 334684730, 337735355, 340807080, 344114989, 347708046, 351294667, 354601890, 357928932, 361538261, 365341753, 369325787, 373353601, 377227843, 381222785, 385514438, 389863908, 394029170, 398087293, 402283520, 406716704, 411262423, 415844023, 420567185, 425427884, 430218071, 434980124, 440314263, 446083933, 451536238, 456835151, 462389439, 468125999, 474043459, 480219275, 486414462, 492480755, 498743802, 505292058, 511632323, 517955899, 524637759, 531508863, 538423777, 545376182, 552179635, 558756590, 565592825, 572774470, 579876781, 586877167, 593621552, 600387216, 607696295, 614754260, 621065676, 626986742, 633526564]
3628.4F33526564P393956O654918O075799O042660N842030N718231N570948N165339
3644.7F81990445M904389N394220N819798M968285M212440M522144M587055L995895
3661G20394671L583848L381312L090024L033340L231943K603888K087176K282143J967072
3679.4G45655417J370192N74350q61585k992213m738986l814757p69377K675712N539000
3697.7G42637753P051707P204473O041825M229366K883733K163112J947701J862407
3714G76022077J491785J206517J116037J001716Q94666R36508J003265Q83341P67171
3732.4G85323083P72000R40680J033187O11127N0425L50237R93431O11066L07978O81758
3752.8G91674972Q45432O03378L88920M95017N29408M00722L33011L10481M42862N27621
$$ y = [633526564, 640920520, 647575438, 653651237, 659693897, 665535927, 671254158, 676825106, 681990445, 686894834, 692289054, 698108852, 703077137, 707289577, 711811721, 716398776, 720394671, 723978519, 727359831, 730449855, 733483195, 736715138, 739319026, 741406202, 743688345, 745655417, 747025609, 747599959, 746738374, 743746161, 739007175, 735192418, 734423041, 737098753, 742637753, 749689460, 756893933, 762935758, 767165124, 770048857, 772211969, 774159670, 776022077, 777513862, 778720379, 779836416, 780838132, 781732798, 782669306, 783672571, 784555912, 785323083, 786095083, 787035763, 788068950, 788680077, 788730502, 789080739, 790074170, 790685236, 790993214, 791674972, 792520404, 793123782, 793512702, 794007719, 794537127, 794937849, 795270860, 795581341, 796024203, 796551824]
3773.2G96551824M38928L75688L43621K80500K05278K56181L67880L57210K64704J55628
3793.6G99597442K28405L59893M1187j4901L75390K21669J98126M41373L17335J2457
3814H01778376P6473K90394j1802N0366L58403K63333K07484J36018P9810J55985N2155
3836.4H03436995o5029R0778J80959K40982L50893K75194k12550p22468n3406O38962
3856.8H04161310L41535P093l2127J17898N7220j27732N7995J74343J39416P1227r1731
3879.2H04876447O3419J57118R7096J78397l3141j85966L1769P0334o0618p7546r8348
3901.7H05018961l8862J90377K03968N9425L4035L993j00911j16229Q464N9843K2471
3924.1H05345535J01745J29044k7000l1591J28210J22547M3392l278k1041N9188Q8572
$$ y = [796551824, 796990752, 797366440, 797710061, 797990561, 798195839, 798452020, 798819900, 799177110, 799441814, 799597442, 799825847, 800185740, 800226927, 800212026, 800587416, 800809085, 801007211, 801448584, 801765919, 801778376, 801854849, 802145243, 802133441, 802183807, 802542210, 802805543, 803013027, 803149045, 803228855, 803384840, 803436995, 803371966, 803462744, 803643703, 803884685, 804235578, 804510772, 804298222, 803575754, 803522348, 804161310, 804502845, 804509938, 804477811, 804595709, 804652929, 804525197, 804583192, 804757535, 804896951, 804968178, 804876447, 804939866, 805096984, 805194080, 805372477, 805339336, 805153370, 805185139, 805255473, 805194855, 805117309, 805018961, 804980099, 805170476, 805374444, 805433869, 805467904, 805471897, 805370986, 805254757, 805263221, 805323064, 805345535, 805447280, 805576324, 805549324, 805517733, 805645943, 805768490, 805811882, 805808604, 805787563, 805846751, 805935323]
3946.5H05935323L5227K6524L7908P4864J23262J01268O3360Q2195N4300j5557J1623
3969H06530297N6684P8559J37925J67966J46329J08421O3717M2916N2154O4492R7275
3991.4H07546735J22189P8261L5763
3997.5H07782948
$$ y = [805935323, 805970550, 805997074, 806034982, 806109846, 806233108, 806334376, 806397736, 806479931, 806534231, 806518674, 806530297, 806586981, 806665540, 806803465, 806971431, 807117760, 807226181, 807289898, 807332814, 807384968, 807449460, 807546735, 807668924, 807747185, 807782948]
##END=$$ End of the data block
