##TITLE=$$ Begin of the data block
##JCAMP-DX=5.00 $$ ACD/SpecManager v 10.08
##SPECTROMETER/DATA SYSTEM=Alpha
##DATE=14 Apr 2014 11:23:48
##DATA TYPE=INFRARED SPECTRUM
##DATA CLASS=XYDATA
##ORIGIN=
##OWNER=
##NPOINTS=1765
##FIRSTX=399.75695801
##LASTX=3997.56933594
##MAXX=3997.56933594
##MINX=399.75695801
##MAXY=0.84266585
##MINY=0.24482767
##XFACTOR=1.0000000000
##YFACTOR=1.000000000000000e-9
##FIRSTY=0.55197936
##DELTAX=2.03957629
##XUNITS=1/CM
##YUNITS=ARBITRARY UNITS
##XYDATA=(X++(Y..Y))
399.8E51979363k141357r07063q75711j107216l27230p40230j294315k68161j17302
$$ 551979363 549838006 548930943 548055232 546948016 546620786 545880556 544586241 544318080 544200778
418.1E44200778q79586J1206K63452n73635r4413K37703o87420m94957J5020o12199
$$ 544200778 543321192 543332398 543595850 543022215 542927802 543165505 542478085 541983128 541998148 541385949
438.5E41385949l54171L26633l04103n21123J27554q5890l36290J59264l11613q68678
$$ 541385949 541031778 541358411 541054308 540533185 540660739 540574849 540238559 540397823 540086210 539217532
458.9E39217532r358o7473q93295o80327n49257r60171o52134m29154j076937q84711
$$ 539217532 539208174 539140701 538247406 537567079 537017822 536057651 535405517 534976363 533899426 533014715
479.3E33014715j53363n46694o83248p6353l17932p13527m39524o71685j001477m69268
$$ 533014715 532861352 532314658 531631410 531555057 531237125 530523598 530084074 529412389 528410912 527941644
499.7E27941644n80668j093030m71950l27408j060307r28342o81818j215339j114368
$$ 527941644 527360976 526267946 525795996 525468588 524408281 523479939 522798121 521582782 520468414
518.1E20468414o36995j177669j473844r92119j256764j520157p69376n93246r87887
$$ 520468414 519831419 518653750 517179906 516187787 514931023 513410866 512641490 512048244 511060357
536.4E11060357o08504n30004j003742o46115m53710j177490j097441n59389j034320
$$ 511060357 510451853 509921849 508918107 508271992 507818282 506640792 505543351 504983962 503949642
554.8E03949642j295566r70304j400769j774192j390308j621127k108485j717359j634508
$$ 503949642 502654076 501683772 500283003 498508811 497118503 495497376 493388891 491671532 490037024
573.1D90037024j957744j478017j134723j420498j083404o81341j044362r36628l79175
$$ 490037024 488079280 486601263 485466540 484046042 482962638 482281297 481236935 480300307 479921132
591.5D79921132o07401q42035p08282j415819k365142k499520k613455k663076j834482
$$ 479921132 479313731 478471696 477763414 476347595 473982453 471482933 468869478 466206402 464371920
609.8D64371920j132727r59277j26064J194686K005160K759397L612876L738969L712982
$$ 464371920 463239193 462279916 462153852 463348538 465353698 468113095 471725971 475464940 479177922
628.2D79177922L967911L738731L364116L483772L183932K486824K353699K305567
$$ 479177922 483145833 486884564 490248680 493732452 496916384 499403208 501756907 504062474
644.5E04062474K135873K487123K638101J875103J574099K404690L264606L627598
$$ 504062474 506198347 508685470 511323571 513198674 514772773 517177463 520442069 524069667
660.8E24069667L699064L076196K752244L935814L699899K896786L112375L281296
$$ 524069667 527768731 530844927 533597171 537532985 541232884 544129670 547242045 550523341
677.1E50523341K877354K698362K769470K378166K070367K185405J966893J522959
$$ 550523341 553400695 556099057 558868527 561246693 563317060 565502465 567469358 568992317
693.5E68992317J460671J295149J026631J330256J781524J831233J995921K323270
$$ 568992317 570452988 571748137 572774768 574105024 575886548 577717781 579713702 582036972
709.8E82036972K334118K418458K768815K789080K598763K751648K825797K615749
$$ 582036972 584371090 586789548 589558363 592347443 594946206 597697854 600523651 603139400
726.1F03139400K570391K603769K360464K145707K189279K076566J929045K046048
$$ 603139400 605709791 608313560 610674024 612819731 615009010 617085576 619014621 621060669
742.4F21060669K086878J993656K089978K089321J914680J993776K086162J791477
$$ 621060669 623147547 625141203 627231181 629320502 631235182 633228958 635315120 637106597
758.7F37106597J570821J661301J519561J324415J338005J028717N27977L46721p570
$$ 637106597 638677418 640338719 641858280 643182695 644520700 645549417 646077394 646424115 646416545
777.1F46416545o11961p68900p07924p85232m08709N52237J398683K322554L610373
$$ 646416545 645804584 645035684 644327760 643542528 643133819 643686056 645084739 647407293 651017666
795.4F51017666M534840N053401N672873N789101N089044M406512L853202L089547
$$ 651017666 655552506 660605907 666278780 672067881 677156925 681563437 685416639 688506186
811.7F88506186K423167J859665Q86977k06292j071751k154648l267348l812671m119515
$$ 688506186 690929353 692789018 693675995 693469703 692397952 690243304 686975956 683163285 679043770
830.1F79043770m403114m213512l894329l846348l532231l009081k805292k297819
$$ 679043770 674640656 670427144 666532815 662686467 659154236 656145155 653339863 651042044
846.4F51042044q89540Q20876K564668M582703O335855P396996Q247971Q731783Q351564
$$ 651042044 650152504 650973380 653538048 658120751 664456606 671853602 680101573 688833356 697184920
864.8F97184920P736862P147491O044805M967570M440308L598392K313912J410723
$$ 697184920 704921782 712069273 718114078 723081648 727521956 731120348 733434260 734844983
881.1G34844983N25593o67393j357436j664400k036929j791537r59277l37184L73543
$$ 734844983 735370576 734703183 733345747 731681347 729644418 727852881 726893604 726556420 726929963
899.4G26929963J300215J527131J173019R70245M21405o96659j620234k514123l602922
$$ 726929963 728230178 729757309 730930328 731900573 732321978 731625319 730005085 727490962 723888040
917.8G23888040l939569l517926l061950k111137o54996K18213N82397J007914R19044
$$ 723888040 719948471 716430545 713368595 711257458 710602462 710820675 711403072 712410986 713330030
936.2G13330030L80278K67088J17124n41032r97364j474858k615451l746629m666984
$$ 713330030 713710308 713977396 714094520 713553488 712556124 711081266 708465815 704719186 700052202
954.5G00052202n983472p294238q289635r624839j1115134j2083649j2852550j3397038
$$ 700052202 694068730 686774492 678484857 668860018 657744884 645661235 632808685 619411647
970.8F19411647j2954414j1763691j0493756r088754p781983p054090o501794n739153
$$ 619411647 606457233 594693542 584199786 575111032 567329049 560274959 553773165 548034012
987.1E48034012n120217m543961l645241k823174k331197j818419j449585j611352
$$ 548034012 542913795 538369834 534724593 531901419 529570222 527751803 526302218 524690866
1003.5E24690866k037525k632498l564537m373312m701972m879117m875153m444510
$$ 524690866 522653341 520020843 516456306 512082994 507381022 502501905 497626752 493182242
1019.8D93182242m008085l821581l544331l250450l190934l072501k834379k729625
$$ 493182242 489174157 485352576 481808245 478557795 475366861 472294360 469459981 466730356
1036.1D66730356k570867k272308k201230k271384k145081k042741k032190j652539
$$ 466730356 464159489 461887181 459685951 457414567 455269486 453226745 451194555 449542016
1052.4D49542016r31114k78682L90530R55075Q74877K23428o58095j850575l026962
$$ 449542016 448610902 448332220 448722750 449677825 450552702 450776130 450118035 448267460 445240498
1070.8D45240498l555179l610998l516198l167778k807408k783686k847910k875567
$$ 445240498 441685319 438074321 434558123 431390345 428582937 425799251 422951341 420075774
1087.1D20075774l050655l053456k606482k073437j641392j230091j056195j108318
$$ 420075774 417025119 413971663 411365181 409291744 407650352 406420261 405364066 404255748
1103.4D04255748j048178r51916j074046j190871j212388j447111j937062k507567
$$ 404255748 403207570 402255654 401181608 399990737 398778349 397331238 395394176 392886609
1119.7C92886609k856583k544730j739562q85725L75897J640170J830280J485020J516402
$$ 392886609 390030026 387485296 385745734 384860009 385235906 386876076 388706356 390191376 391707778
1138.1C91707778J734585J708477J504243J341074J221985J209646J433492J753837
$$ 391707778 393442363 395150840 396655083 397996157 399218142 400427788 401861280 403615117
1154.4D03615117K049983K523630L159404L765524M495680N395889O138981O665170
$$ 403615117 405665100 408188730 411348134 415113658 419609338 425005227 431144208 437809378
1170.7D37809378P114500P340938P317572P314861P265896O910711O398082N803794
$$ 437809378 444923878 452264816 459582388 466897249 474163145 481073856 487471938 493275732
1187D93275732M866868L770471K899348K132655J546502J483321J738250K041102K454936
$$ 493275732 498142600 501913071 504812419 506945074 508491576 509974897 511713147 513754249 516209185
1205.4E16209185K694905K434373J990616J649022J282156J020610J048744J073658
$$ 516209185 518904090 521338463 523329079 524978101 526260257 527280867 528329611 529403269
1221.7E29403269J089037J397669J716912J816153K058924K417564K518415K559662
$$ 529403269 530492306 531889975 533606887 535423040 537481964 539899528 542417943 544977605
1238E44977605K694965K565622K207398J942516J570344J041531P74265O75142N16712
$$ 544977605 547672570 550238192 552445590 554388106 555958450 556999981 557774246 558449388 558966100
1256.4E58966100O61969J188755J668692K147377K810359L298699L613174M092455
$$ 558966100 559628069 560816824 562485516 564632893 567443252 570741951 574355125 578447580
1272.7E78447580M431725M465461M611253M834235M884541N050838N367041N375981
$$ 578447580 582879305 587344766 591956019 596790254 601674795 606725633 612092674 617468655
1289F17468655N183280N063414M700721M128694L778875L392994K771378K380073K117813
$$ 617468655 622651935 627715349 632416070 636544764 640323639 643716633 646488011 648868084 650985897
1307.4F50985897J644134J326442J218855R18448P30872R35853J037776J000524J188517
$$ 650985897 652630031 653956473 655175328 656093776 656824648 657760501 658798277 659798801 660987318
1325.7F60987318J196742P92324N02527K64227j74582l74019k18928j84834j28209
$$ 660987318 662184060 662976384 663478911 663743138 663568556 663194537 662975609 662790775 662662566
1344.1F62662566J32858R3818k14934l23951n02766r37163j174391j442730k078295
$$ 662662566 662795424 662889242 662674308 662350357 661847591 660910428 659736037 658293307 656215012
1362.4F56215012k358019k228141k434254k605796k629220l089190l815770n490899
$$ 656215012 653856993 651628852 649194598 646588802 643959582 640870392 637054622 631563723
1378.7F31563723r125590j0704518m902660L753364O032467K870738J42932j529098
$$ 631563723 622438133 611733615 606830955 610584319 616616786 619487524 619630456 618101358
1395.1F18101358k493798l023148l353536l566027l712475l516197l244937k902805
$$ 618101358 615607560 612584412 609230876 605664849 601952374 598436177 595191240 592288435
1411.4E92288435k409757k061009j947522j804948j380742j031696p66337o07849o16848
$$ 592288435 589878678 587817669 585870147 584065199 582684457 581652761 580886424 580278575 579661727
1429.7E79661727l07679Q9407J94311N64039J044750J262903J528025J969874K443373
$$ 579661727 579354048 579443455 579637766 580201805 581246555 582509458 584037483 586007357 588450730
1448.1E88450730K957046L509104M068136N489588P197142O590724N922913O537319
$$ 588450730 591407776 594916880 598985016 604474604 611671746 618262470 624185383 630722702
1464.4F30722702O976723O527066O761790Q063018P893682O289482N145728M203141
$$ 630722702 637699425 644226491 650988281 659051299 666944981 673234463 678380191 682583332
1480.7F82583332L183663K196014J275718J30057p88152j091659j771211k865077l219902
$$ 682583332 685766995 687963009 689238727 689368784 688580632 687488973 685717762 682852685 679632783
1499.1F79632783l108919l148436m176975o192267n620419m433156m274487m213333
$$ 679632783 676523864 673375428 669198453 663006186 657385767 652952611 648678124 644464791
1515.4F44464791l797591l144085l258169l121614k573371k562106k342701k158284
$$ 644464791 640667200 637523115 634264946 631143332 628569961 626007855 623665154 621506870
1531.7F21506870k275348j844346j415909j693010j526654o93083j07884J84297M41313
$$ 621506870 619231522 617387176 615971267 614278257 612751603 612058520 611950636 612134933 612576246
1550.1F12576246Q72612J113177J028418Q08656O24359L49700p6472n56410j415491
$$ 612576246 613448858 614562035 615590453 616399109 617023468 617373168 617296696 616740286 615324795
1568.4F15324795k253711k290547k918362m466296m548549m311264m995048n531132
$$ 615324795 613071084 610780537 607862175 603395879 598847330 594536066 589541018 584009886
1584.7E84009886n919755o332934o636977o814122p067978p122755p015884p112623
$$ 584009886 578090131 571757197 565120220 558306098 551238120 544115365 537099481 529986858
1601.1E29986858p211923p066608p023573p213294p046402o582439p037431p813274
$$ 529986858 522774935 515708327 508684754 501471460 494425058 487842619 480805188 472991914
1617.4D72991914o284059n333513n893856n589843m899054m296244l169298k395093
$$ 472991914 466707855 461374342 455480486 449890643 444991589 440695345 437526047 435130954
1633.7D35130954k091795q60781M96209J408815K193421L318280M366696M123360M778713
$$ 435130954 433039159 432178378 432674587 434083402 436276823 439595103 443961799 448085159 452863872
1652D52863872O723136N870849N145341N749821O568075O929189O504118O948352P943034
$$ 452863872 459587008 465457857 470603198 476353019 482921094 489850283 496354401 503302753 511245787
1670.4E11245787P577658P778823Q552134Q136571P749557Q511961J0531187R949803
$$ 511245787 518823445 526602268 535154402 543290973 551040530 559552491 570083678 580033481
1686.7E80033481Q544982Q805632Q510471R215891J0367095J0883570J2599528J1113942
$$ 580033481 588578463 597384095 605894566 615110457 625477552 636361122 648960650 660074592
1703F60074592R546280R637236Q581281P568717P000327O631553O714821O234765N161285
$$ 660074592 669620872 679258108 687839389 695408106 702408433 709039986 715754807 721989572 727150857
1721.4G27150857M672111M576623M302084M013122L641307L762007L888726L366768
$$ 727150857 731822968 736399591 740701675 744714797 748356104 752118111 756006837 759373605
1737.7G59373605L365696L514826L381014L345132L299653L176391L137291K829790
$$ 759373605 762739301 766254127 769635141 772980273 776279926 779456317 782593608 785423398
1754G85423398K469003K329886K186179K039731J900673J773834J654327J502573J497746
$$ 785423398 787892401 790222287 792408466 794448197 796348870 798122704 799777031 801279604 802777350
1772.4H02777350J556337J377702J283764J286209J190901J143455J228869J162589
$$ 802777350 804333687 805711389 806995153 808281362 809472263 810615718 811844587 813007176
1788.7H13007176R50873R86337J038790R21548Q66174Q74102Q28147Q32916Q38399
$$ 813007176 813958049 814944386 815983176 816904724 817770898 818645000 819473147 820306063 821144462
1807H21144462P31706O82831P20680O95288O41942O69777O28233N48065N97239N98013
$$ 821144462 821876168 822558999 823279679 823974967 824616909 825286686 825914919 826462984 827060223 827658236
1827.4H27658236M74095N26488O09398M85778M61221N87344N17070L00408L65972M94659
$$ 827658236 828132331 828658819 829268217 829753995 830215216 830802560 831319630 831620038 831986010 832480669
1847.8H32480669M55081M35710M15385L38018K99454L47376L55303L46482L27349K28047
$$ 832480669 832935750 833371460 833786845 834124863 834424317 834771693 835126996 835473478 835800827 836028874
1868.2H36028874K18213L32713L23832K43008K67029K74837J84893J72317K23697J38700
$$ 836028874 836247087 836579800 836903632 837146640 837413669 837688506 837873399 838045716 838269413 838408113
1888.6H38408113J31309K59578J97291Q9288J49369J83582J25885J61052J79410O4373
$$ 838408113 838539422 838799000 838996291 839085579 839234948 839418530 839544415 839705467 839884877 839949250
1909H39949250K8849P0751L6835L0399J23024Q3387j3710M3810M7386l7492k1755k385
$$ 839949250 839978099 840048850 840085685 840116084 840239108 840322495 840308785 840352595 840399981 840362489 840340734 840338349
1933.5H40338349o8187o6102l1173q2731r8348n3704p9572j18494r7990j02759j55210
$$ 840338349 840270162 840204060 840172887 840090156 839991808 839938104 839858532 839740038 839642048 839539289 839384079
1955.9H39384079j76072j55151j60813j61171j50323j69635j56224j29163j47164j45674
$$ 839384079 839208007 839052856 838892043 838730872 838580549 838410914 838254690 838125527 837978363 837832689
1976.3H37832689j11401j26958j51157j39058j31905j64926k00689j58846j16050j69277
$$ 837832689 837721288 837594330 837443173 837304115 837172210 837007284 836806595 836647749 836531699 836362422
1996.7H36362422k07365j73748j82449k03193j88768k06589k25842j87338j89483k34663
$$ 836362422 836155057 835981309 835798860 835595667 835406899 835200310 834974468 834787130 834597647 834362984
2017.1H34362984k18332k23458k73347k44677j64509j81257k22028j92225j82509j93358
$$ 834362984 834144652 833921194 833647847 833403170 833238661 833057404 832835376 832643151 832460642 832267284
2037.5H32267284j73926j85668k23339j73926j22667j76728j88946r4533q3566j55270
$$ 832267284 832093358 831907690 831684351 831510425 831387758 831211030 831022084 830927551 830843985 830688715
2057.9H30688715j62900j52170j27793m9233l1114j06990j00255l8207p7724q4996
$$ 830688715 830525815 830373645 830245852 830196619 830165505 830058515 829958260 829920053 829842329 829757333
2078.3H29757333M17j7762p6652k9802k5570q1122m7148K7299J1325j6093J0312j431
$$ 829757333 829757750 829739988 829663336 829633534 829607964 829526842 829479694 829506993 829518318 829502225 829512537 829511106
2102.8H29511106j1742K8074J0490l4451N126J9729j2458L0637N7161O497K4676Q1659
$$ 829511106 829499364 829527438 829537928 829503477 829508603 829528332 829515874 829546511 829603672 829610169 829634845 829716504
2127.3H29716504O9618Q5175J26243O8128K1100R8586J14023N0605J20401K15292J45197
$$ 829716504 829786122 829871297 829997540 830065668 830086768 830185354 830299377 830349982 830470383 830685675 830830872
2149.7H30830872P0691J02163Q9347R8467K06351J90914J00851J42753J70290J19090
$$ 830830872 830901563 831003726 831093073 831191540 831397891 831588805 831689656 831832409 832002699 832121789
2170.1H32121789J53840K07663J54733J20938J49727R9838P0333J67966J72317Q8334
$$ 832121789 832275629 832483292 832638025 832758963 832908690 833008528 833078861 833246827 833419144 833507478
2190.5H33507478J14262J22547O5387J10566J30952J3709J1086J38402J38104R0897
$$ 833507478 833621740 833744287 833809674 833920240 834051192 834064901 834075987 834214389 834352493 834443390
2210.9H34443390J04189K3067n0246N9545J07407K5630Q3149J35481q34l0280P2360
$$ 834443390 834547579 834570646 834520400 834579945 834687352 834712982 834796131 834931612 834930778 834900498 834972858
2233.3H34972858L4512M589R0003L0160p7128J907M8220k9504o616N3286N067N066
$$ 834972858 835007370 835011959 835101962 835132122 835054994 835056901 835105121 835075617 835069001 835122287 835127354 835132420
2257.8H35132420O4910J5854j9014O6638N6088j5080N3406Q1063j5438M530R5129P4148
$$ 835132420 835197330 835213184 835194170 835260808 835316896 835301816 835355222 835436285 835420847 835425377 835520506 835594654
2282.3H35594654P8797J10805K5452m5121J2159M5359j2993l0041r358J013L2187L9279
$$ 835594654 835673451 835784256 835809708 835764587 835776746 835822105 835809112 835779071 835769713 835770726 835802913 835842192
2306.7H35842192j7524k6524L6776J5319q1897j15752r0182n3823K6226J0848j13130
$$ 835842192 835824668 835798144 835834920 835850239 835768342 835652590 835562408 835508585 835534811 835545659 835432529
2329.2H35432529j66058k87652n19991m70459m7029L10064M85897P83145R04680N06877
$$ 835432529 835266471 834978819 834458828 833988369 833941340 834251404 834737301 835520446 836425126 836932003
2349.6H36932003J0789k18809k92301k46763K3007J83404J65224L19898N34713N56052
$$ 836932003 836942792 836723983 836431682 836184919 836207926 836391330 836556554 836876452 837411165 837967217
2370H37967217N47647N44131M73380M99130N48124M52220L86656L52800K06410J19985
$$ 837967217 838514864 839058995 839532375 840031505 840579629 841031849 841418505 841771305 841977715 842097700
2390.4H42097700J72019J26004J9133O0439P5281j4186J5199P1347N245n841M3511
$$ 842097700 842269719 842395723 842414856 842475295 842550576 842536390 842551589 842622936 842628181 842622340 842665851
2412.8H42665851n96m0293j5676p7009j64747j27375o7354k0563P6592R0539j1086
$$ 842665851 842665255 842624962 842609286 842532277 842367530 842240155 842172801 842152238 842228830 842319369 842308283
2435.2H42308283l9041k1875q4698q9884q822m1186j28925j07229r2268j12653o9737
$$ 842308283 842269242 842247367 842162669 842072785 842063963 842022777 841893852 841786623 841694355 841581702 841511965
2457.7H41511965o7711j22845q9765m9054j23322j60695r1970p8916j27256j31786
$$ 841511965 841444254 841321409 841231644 841182590 841059268 840898573 840806603 840727687 840600431 840468645
2478.1H40468645j33157j65581j60098j31608j40309j41322j39952j63496j40190r1731
$$ 840468645 840335488 840169907 840009809 839878201 839737892 839596570 839456618 839293122 839152932 839061201
2498.5H39061201j03832j25885j10984j22547j71959j58489j02460j14322j21176r4533
$$ 839061201 838957369 838831484 838720500 838597953 838425994 838267505 838165045 838050723 837929547 837835014
2518.9H37835014j31190j58429j28627j60873j91808j29044j25825j77026j31786r3877
$$ 837835014 837703824 837545395 837416768 837255895 837064087 836935043 836809218 836632192 836500406 836406529
2539.2H36406529j55926j96636j77323j77265j89304j82450j83403j74940j38938j38402
$$ 836406529 836250603 836053967 835876644 835699379 835510075 835327625 835144222 834969282 834830344 834691942
2559.6H34691942k00629k34068k04027j95384k07305k20537k64346k82526k65658k91229
$$ 834691942 834491313 834257245 834053218 833857834 833650529 833429992 833165646 832883120 832617462 832326233
2580H32326233l15487k82943k92421l47018l40342l45529m13656m08590l62992m03583
$$ 832326233 832010746 831727803 831435382 831088364 830748022 830402493 829988837 829580247 829217255 828813672
2600.4H28813672m25935l81589m06086m50492m36366m63605n15341m91262m45246m40717
$$ 828813672 828387737 828006148 827600062 827149570 826713204 826249599 825734258 825242996 824797750 824357033
2620.8H24357033m47870m78565n28813n20706m62711m53829m76003m57764m59850m85658
$$ 824357033 823909163 823430598 822901785 822381079 821918368 821464539 820988536 820530772 820070922 819585264
2641.2H19585264m74572m72844m75466m27783m31001n02110m95970m46260m60446m60267
$$ 819585264 819110692 818637848 818162382 817734599 817303598 816801488 816305518 815859258 815398812 814938545
2661.6H14938545l89218m00245m79460m70460m73380n02526m22895l63052m35710m87983
$$ 814938545 814549327 814149082 813669622 813199162 812725782 812223256 811800361 811437309 811001599 810513616
2682H10513616m90368n31971n27799m65870m87089n43058n25058n23328n65052n50867
$$ 810513616 810023248 809491277 808963478 808497608 808010519 807467461 806942403 806419075 805854023 805303156
2702.4H05303156n33461n66185n58257n49555o06775o33657o03080n78999n52416n31137
$$ 805303156 804769695 804203510 803645253 803095698 802488923 801855266 801252186 800673187 800120771 799589634
2722.8G99589634n80370o41943o12735n72145n91576n68450n31435n87106n98669n14388
$$ 799589634 799009264 798367321 797754586 797182441 796590865 796022415 795490980 794903874 794305205 793790817
2743.2G93790817n19573n76497n63681n85019o64771o67870o24716o40512o40988o06358
$$ 793790817 793271244 792694747 792131066 791546047 790881276 790213406 789588690 788948178 788307190 787700832
2763.6G87700832o21557o54817o99639p72715p90477p50661p56442q13484q39413q45253
$$ 787700832 787079275 786424458 785724819 784952104 784161627 783410966 782654524 781841040 781001627 780156374
2784G80156374q57711q65459r18448r88841r84669r57489r98020j074374j114964j157761
$$ 780156374 779298663 778433204 777514756 776525915 775541246 774583757 773585737 772511363 771396399 770238638
2804.4G70238638j197934j165986j162052j235307j271486j301825j381040j408100
$$ 770238638 769040704 767874718 766712666 765477359 764205873 762904048 761523008 760114908
2820.7G60114908j383304j453758j587867j648188j709342j847088k002895k226472
$$ 760114908 758731604 757277846 755689979 754041791 752332449 750485361 748482466 746255994
2837G46255994k642811l196418l766179m341841m607379m065812k896309j821875j212895
$$ 746255994 743613183 740416765 736650586 732308745 727701366 723635554 720739245 718917370 717704475
2855.4G17704475r82821j037240j309216j711846k161681k501249k595068k475380
$$ 717704475 716721654 715684414 714375198 712663352 710501671 708000422 705405354 702929974
2871.7G02929974k251983j973868j679003j463651j417280j515865j642585j711070
$$ 702929974 700677991 698704123 697025120 695561469 694144189 692628324 690985739 689274669
2888F89274669j779199j894474j953125j971126k041757k080500k102732k264441k530217
$$ 689274669 687495470 685600996 683647871 681676745 679634988 677554488 675451756 673187315 670657098
2906.4F70657098k812624l174662l599227l851831l722608l218293k521038j846910
$$ 670657098 667844474 664669812 661070585 657218754 653496146 650277853 647756815 645909905
2922.7F45909905j307070p84993k63453M8399L20614Q31365J397133J809717K116680
$$ 645909905 644602835 643817842 643554389 643602788 643923402 644754767 646151900 647961617 650078297
2941F50078297K258181K080560J675904J208544P74920M23312J82271J53184L10480
$$ 650078297 652336478 654417038 656092942 657301486 658076406 658499718 658681989 658835173 659145653
2959.4F59145653M96805N92709O12735O45042O57558O77943P66993P96556P93756R02831
$$ 659145653 659642458 660235167 660847902 661492944 662150502 662828445 663595438 664391994 665185750 666088581
2979.8F66088581R73642Q83579P98822P69198O89387M98116J99914p2241l25024n78344
$$ 666088581 667062223 667945802 668744624 669513822 670203209 670701325 670901239 670828998 670503974 669925630
3000.2F69925630p09116p93040q68797q63612q70407r82284j136065j280725j414120
$$ 669925630 669216514 668423474 667554677 666691065 665820658 664838374 663702309 662421584 661007464
3018.5F61007464j496613j540601j624585j713514j695156j651645j668751j748860
$$ 661007464 659510851 657970250 656345665 654632151 652936995 651285350 649616599 647867739
3034.9F47867739j880884j909733j879096j981318k132773k175749k123236k109766
$$ 647867739 645986855 644077122 642198026 640216708 638083935 635908186 633784950 631675184
3051.2F31675184k165973k182007k180934k181888k104640k020717j990020j973033
$$ 631675184 629509211 627327204 625146270 622964382 620859742 618839025 616849005 614875972
3067.5F14875972k024710k104938k080202j987398j941979k007126k116383k162456
$$ 614875972 612851262 610746324 608666122 606678724 604736745 602729619 600613236 598450780
3083.8E98450780k149999k101302k108276k205313k248823k210796k158523k163529
$$ 598450780 596300781 594199479 592091203 589885890 587637067 585426271 583267748 581104219
3100.1E81104219k294362k411604k331137k234221k362847k458572k356410k353609
$$ 581104219 578809857 576398253 574067116 571832895 569470048 567011476 564655066 562301457
3116.4E62301457k482593k615452k758443k788306k695083k668023k737224k784670
$$ 562301457 559818864 557203412 554444969 551656663 548961580 546293557 543556333 540771663
3132.8E40771663k771914k750933k782226k884626k966821k948046k904773k909541
$$ 540771663 537999749 535248816 532466590 529581964 526615143 523667097 520762324 517852783
3149.1E17852783k918958k982200l135085l186464l106237l072828l104329l109634
$$ 517852783 514933825 511951625 508816540 505630076 502523839 499451011 496346682 493237048
3165.4D93237048l095716l108203l119707l108174l113151l120988l092259l114879
$$ 493237048 490141332 487033129 483913422 480805248 477692097 474571109 471478850 468363971
3181.7D68363971l161908l115952l030985l005892l045649l073036l074199l083110
$$ 468363971 465202063 462086111 459055126 456049234 453003585 449930549 446856350 443773240
3198D43773240l071427l008307k939134k864629k800793k813071k820074k787650k783924
$$ 443773240 440701813 437693506 434754372 431889743 429088950 426275879 423455805 420668155 417884231
3216.4D17884231k731383k628476k621174k654641k590001k485335k433538k375216
$$ 417884231 415152848 412524372 409903198 407248557 404658556 402173221 399739683 397364467
3232.7C97364467k366155k427787k368152k235919k162129k091258k041400k086222
$$ 397364467 394998312 392570525 390202373 387966454 385804325 383713067 381671667 379585445
3249C79585445k094328j975656j904100j929105j920819j885831j875341j871854j854122
$$ 379585445 377491117 375515461 373611361 371682256 369761437 367875606 366000265 364128411 362274289
3267.4C62274289j795262j768440j833528j895458j882970j834303j815379j841098
$$ 362274289 360479027 358710587 356877059 354981601 353098631 351264328 349448949 347607851
3283.7C47607851j870036j879335j849442j787335j803786j917898k000868j987607
$$ 347607851 345737815 343858480 342009038 340221703 338417917 336500019 334499151 332511544
3300C32511544j923382j863480j888066k053619k204656k195001k115428k077580k072930
$$ 332511544 330588162 328724682 326836616 324782997 322578341 320383340 318267912 316190332 314117402
3318.4C14117402k077252k088666k080232k102434k175927k193273k157390k098709
$$ 314117402 312040150 309951484 307871252 305768818 303592891 301399618 299242228 297143519
3334.7B97143519k041131k087683k180189k172678k147556k129256k017588j990676
$$ 297143519 295102388 293014705 290834516 288661838 286514282 284385026 282367438 280376762
3351B80376762k117425k153963k059549j976788j940221j879573j704990j575351j719356
$$ 280376762 278259337 276105374 274045825 272069037 270128816 268249243 266544253 264968902 263249546
3369.3B63249546j937300j888066j630426j464575j402825j333654j218558j010149
$$ 263249546 261312246 259424180 257793754 256329179 254926354 253592700 252374142 251363993
3385.7B51363993p45565n49108o17504q86917q91656m87372j63645l48642o80134n76094
$$ 251363993 250618428 250069320 249451816 248564899 247673243 247185871 247022226 246673584 245993450 245417356
3406.1B45417356k75045j33827o8591m8562o3658K1174J69859K55137L81798O11991
$$ 245417356 245142311 245008484 244939893 244891331 244827673 244848847 245018706 245273843 245655641 246267632
3426.5B46267632Q03202Q08254Q63075J051352R70766P12156P70122J099020J381367
$$ 246267632 247070834 247879088 248742163 249793515 250764281 251476437 252246559 253345579 254726946
3444.8B54726946J498491J454800J459241J582891J742899J916945K047837K004624
$$ 254726946 256225437 257680237 259139478 260722369 262465268 264382213 266430050 268434674
3461.1B68434674J999825K299100K536982K279103J801938J792133K172708K501160
$$ 268434674 270434499 272733599 275270581 277549684 279351622 281143755 283316463 285817623
3477.4B85817623K533198K289533K259821K505600K563805K492487K582729K746344
$$ 285817623 288350821 290640354 292900175 295405775 297969580 300462067 303044796 305791140
3493.8C05791140K907306K899497K811134K847076K769112K654225K828777L105998
$$ 305791140 308698446 311597943 314409077 317256153 320025265 322679490 325508267 328614265
3510.1C28614265L251761L213525L087014L132224L327042L563076L548562L327758
$$ 328614265 331866026 335079551 338166565 341298789 344625831 348188907 351737469 355065227
3526.4C55065227L392696L648698L791571L923744L960401L864646M046827M338533
$$ 355065227 358457923 362106621 365898192 369821936 373782337 377646983 381693810 386032343
3542.7C86032343M355788M159749M050255M182934M429192M552424M599988M776210
$$ 386032343 390388131 394547880 398598135 402781069 407210261 411762685 416362673 421138883
3559D21138883M906475M781068M746317N327881N741894N439699N321830N579323N764723
$$ 421138883 426045358 430826426 435572743 440900624 446642518 452082217 457404047 462983370 468748093
3577.4D68748093N929589O143153O159156O064326O295204O573558O331563O301105
$$ 468748093 474677682 480820835 486979991 493044317 499339521 505913079 512244642 518545747
3593.7E18545747O678223O902636O935119O949306O834447O612182O819367P143676
$$ 518545747 525223970 532126606 539061725 546011031 552845478 559457660 566277027 573420703
3610E73420703P091821P022500O744206O747603P333636P099152O346524N951762O540000
$$ 573420703 580512524 587535024 594279230 601026833 608360469 615459621 621806145 627757907 634297907
3628.4F34297907P336498O580412O033599O019175N828262N726874N596935N196035
$$ 634297907 641634405 648214817 654248416 660267591 666095853 671822727 677419662 682615697
3644.7F82615697M883707N307138N737603M914641M212499M594743M634976L974378
$$ 682615697 687499404 692806542 698544145 703458786 707671285 712266028 716901004 720875382
3661G20875382L580928L425300L106714K986490L196776K595842K078355K320110J995981
$$ 720875382 724456310 727881610 730988324 733974814 737171590 739767432 741845787 744165897 746161878
3679.4G46161878J374006O13809q13067l001809m794598l822446p43091K648294N469442
$$ 746161878 747535884 748149693 747336626 744334817 739540219 735717773 734974682 737622976 743092418
3697.7G43092418P028579P266641O122649M219651K778649K073825J933574J891196
$$ 743092418 750120997 757387638 763510287 767729938 770508587 772582412 774515986 776407182
3714G76407182J571238J297355J123249R60529Q69453R17197J012682R35555Q37445
$$ 776407182 777978420 779275775 780399024 781359553 782229006 783146203 784158885 785094440 785931885
3732.4G85931885P73669Q25881R71497P11739J54078L03268R25303N71251K45571O93857
$$ 785931885 786705554 787531435 788502932 789214671 789368749 789672017 790597320 791168571 791414142 792107999
3752.8G92107999Q77858N97655M44591N58555M60685L17514L77655L62336M18783N28991
$$ 792107999 792985857 793583512 794028103 794586658 795047343 795364857 795742512 796104848 796523631 797052622
3773.2G97052622M54962L43680L01779K72989J95742K15709L08156L05772K91824K53439
$$ 797052622 797507584 797851264 798153043 798426032 798621774 798837483 799145639 799451411 799743235 799996674
3793.6G99996674K59399L05713P4207R0003L64066J66893K04265M60803L41833M8578
$$ 799996674 800256073 800561786 800635993 800725996 801090062 801256955 801461220 801922023 802263856 802312434
3814H02312434M9233K17199l6895O6281M13537L19957J54138K7597J11937K83480Q0645
$$ 802312434 802361667 802578866 802541971 802608252 803021789 803341746 803495884 803523481 803635418 803918898 803999543
3836.4H03999543j49846J79J65284L09407M24326K74360l02434q46148o2704P41125
$$ 803999543 803849697 803849876 804015160 804324567 804748893 805023253 804720819 803874671 803811967 804553092
3856.8H04553092M64856Q4698q7142J0670R954j59502N8412K38240K19166J38998o5803
$$ 804553092 805017948 805102646 805015504 805026174 805036128 804876626 804935038 805173278 805392444 805531442 805465639
3879.2H05465639M9650J33753M6015J19507j6749j41382J4365O5863q166m9293j18911
$$ 805465639 805515289 805649042 805695057 805814564 805797815 805656433 805670798 805736661 805728495 805679202 805560291
3901.7H05560291j6391K39431J97053M4883J6451n9069j24454m7326Q5532J11521L9398
$$ 805560291 805543900 805783331 805980384 806025267 806041718 805982649 805858195 805810869 805896401 806007922 806047320
3924.1H06047320N2870N1737p5460l0220J74106J72972N1737k4915l4809L7432M3452
$$ 806047320 806100190 806151927 806076467 806046247 806220353 806393325 806445062 806420147 806385338 806422770 806466222
3946.5H06466222j2219k5273O676J05322J60634J19269Q6665Q1480N6445L6478M4525
$$ 806466222 806454003 806428730 806435406 806540728 806701362 806820631 806907296 806988776 807045221 807081699 807126224
3969H07126224M1127Q0049J51396J53661J27733R6917O2942N6505N7459P3731J11103
$$ 807126224 807167351 807247400 807398796 807552457 807680190 807777107 807840049 807896554 807954013 808027744 808138847
3991.4H08138847J01149M9770M6552
$$ 808138847 808239996 808289766 808336318
3997.5H08336318
$$ 808336318
##END=$$ End of the data block
