##TITLE=$$ Begin of the data block
##JCAMP-DX=5.00 $$ ACD/SpecManager v 10.08
##SPECTROMETER/DATA SYSTEM=Alpha
##DATE=14 Apr 2014 11:23:48
##DATA TYPE=INFRARED SPECTRUM
##DATA CLASS=XYDATA
##ORIGIN=
##OWNER=
##NPOINTS=1765
##FIRSTX=399.75695801
##LASTX=3997.56933594
##MAXX=3997.56933594
##MINX=399.75695801
##MAXY=0.84276891
##MINY=0.24505089
##XFACTOR=1.0000000000
##YFACTOR=1.000000000000000e-9
##FIRSTY=0.54829711
##DELTAX=2.03957629
##XUNITS=1/CM
##YUNITS=ARBITRARY UNITS
##XYDATA=(X++(Y..Y))
$$ plain form
399.8 548297107 547238708 547427475 546909451 545438945 544777751 544337749 543455362 543124676 542682767
418.1 542682767 541595638 541685164 542230606 541853249 541676283 541810870 541259050 540811360 540737271 540295362
438.5 540295362 540135264 540487170 540344834 540085375 540278375 540071070 539613605 539701223 539374292 538404822
458.9 538404822 538150311 538003266 537339270 536993206 536479115 535174072 534253478 533837855 532865584 531974316
479.3 531974316 531780601 531422794 531009555 531090319 530804992 530070901 529722095 529152393 528073967 527344108
499.7 527344108 526652992 525716901 525314987 524937749 523767769 522717535 522057652 520862460 519613624
518.1 519613624 518885493 517794728 516505778 515750110 514716625 513206005 512177527 511327922 510296226
536.4 510296226 509770334 509282529 508251429 507596433 507257044 506315768 505324900 504619002 503425300
$$ packed form
399.8E48297107j058399J88767n18024j470506o61194m40002q82387l30686m41909
418.1E42682767j087129Q9526N45442l77357j76966J34587n51820m47690p4089m41909
438.5E40295362j60098L51906j42336k59459J93000k07305m57465Q7618l26931r69470
458.9E38404822k54511j47045o63996l46064n14091j305043r20594m15623r72271q91268
479.3E31974316j93715l57807m13239Q0764k85327p34091l48806n69702j078426p29859
499.7E27344108o91116r36091m01914l77238j169980j050234o59883j195192j248836
518.1E19613624p28131j090765j288950p55668j033485j510620j028478q49605j031696
536.4E10296226n25892m87805j031100o54996l39389r41276r90868p05898j193702
$$ plain form
554.8 503425300 502147257 501312971 500001609 498245955 496837735 495152354 493002594 491184980 489402682
573.1 489402682 487418652 485966623 484833807 483397394 482282549 481602341 480655283 479854733 479586869
591.5 479586869 479101121 478267789 477407426 475879520 473537058 471073687 468457133 465864927 464137137
609.8 464137137 463025957 462110758 462081641 463254303 465172678 467925847 471547395 475265086 478966922
628.2 478966922 482949406 486740470 490118772 493554622 496751010 499290854 501661718 503979445
644.5 503979445 506133974 508647025 511320651 513226688 514790535 517121553 520366371 524070680
660.8 524070680 527793288 530820429 533523142 537414074 541104019 544019341 547175586 550575793
677.1 550575793 553611934 556380630 559137404 561493754 563526571 565671384 567618608 569140613
$$ packed form
554.8E03425300j278043q34286j311362j755654j408220j685381k149760j817614j782298
573.1D89402682j984030j452029j132816j436413j114845o80208r47058q00550k67864
591.5D79586869m85748q33332q60363j527906k342462k463371k616554k592206j727790
609.8D64137137j111180r15199k9117J172662J918375K753169L621548L717691L701836
628.2D78966922L982484L791064L378302L435850L196388K539844K370864K317727
644.5E03979445K154529K513051K673626J906037J563847K331018L244818L704309
660.8E24070680L722608L027141K702713L890932L689945K915322L156245L400207
677.1E50575793L036141K768696K756774K356350K032817K144813J947224J522005
$$ plain form
693.5 569140613 570593596 571862280 572918773 574301660 576048374 577823579 579819620 582207799
709.8 582207799 584706843 587264121 589961410 592600405 595186353 598017991 600868225 603451729
726.1 603451729 606044769 608707845 611034632 613068223 615163207 617197931 619165838 621283829
742.4 621283829 623371363 625339270 627481341 629633844 631527364 633439004 635432541 637238145
758.7 637238145 638918698 640567899 641954362 643215060 644584239 645646751 646154165 646426857 646379292
777.1 646379292 645842314 645144403 644371986 643525302 643171132 643753409 645094872 647353351 650916398
795.4 650916398 655478597 660659790 666419685 672155023 677139997 681538880 685438931 688515961
811.7 688515961 690915287 692756832 693630517 693490207 692473412 690246463 686888576 683093131 679032564
$$ packed form
693.5E69140613J452983J268684J056493J382887J746714J775205J996041K388179
709.8E82207799K499044K557278K697289K638995K585948K831638K850234K583504
726.1F03451729K593040K663076K326787K033591K094984K034724J967907K117991
742.4F21283829K087534J967907K142071K152503J893520J911640J993537J805604
758.7F37238145J680553J649201J386463J260698J369179J062512N07414K72692m7565
777.1F46379292n36978o97911p72417q46684l54170N82277J341463K258479L563047
795.4F50916398M562199N181193N759895N735338M984974M398883L900051L077030
811.7F88515961K399326J841545Q73685j40310j016795k226949l357887l795445m060567
$$ plain form
830.1 679032564 674607575 670317829 666384339 662551165 659046888 656082630 653349698 651083529
846.4 651083529 650151074 650928497 653528690 658198953 664590240 671967924 680115461 688721299 697018385
864.8 697018385 704772174 711948812 718044639 723073840 727509022 731042504 733339906 734754086
881.1 734754086 735202432 734471083 733148932 731538296 729484856 727619171 726609826 726275027 726695001
899.4 726695001 728065193 729626060 730816722 731831491 732261062 731522918 729852498 727289379 723672569
917.8 723672569 719756663 716255128 713189840 711096704 710477769 710686624 711251915 712268293 713147879
936.2 713147879 713464081 713712871 713851869 713369906 712426245 710920751 708212972 704409361 699736655
954.5 699736655 693743467 686441362 678180277 668597043 657506406 645422876 632546902 619143486
$$ packed form
830.1F79032564m424989m289746l933490l833174l504277k964258k732932k266169
846.4F51083529r32455P77423K600193M670263O391287P377684Q147537Q605838Q297086
864.8F97018385P753789P176638O095827N029201M435182L533482K297402J414180
881.1G34754086M48346p31349j322151j610636k053440j865685j009345l34799M19974
899.4G26695001J370192J560867J190662J014769M29571p38144j670420k563119l616810
917.8G23672569l915906l501535l065288k093136o18935K08855N65291J016378Q79586
936.2G13147879L16202K48790J38998m81963r43661j505494k707779l803611m672706
954.5F99736655n993188p302105q261085r583234j1090637j2083530j2875974j3403416
$$ plain form
970.8 619143486 606218398 594493508 584031880 574968040 567209661 560139000 553565025 547761261
987.1 547761261 542628407 538129210 534538805 531710565 529326439 527456224 525983572 524391651
1003.5 524391651 522368968 519731462 516196907 511859357 507151484 502259791 497389674 492950916
1019.8 492950916 488940418 485124886 481593430 478342175 475139290 472065270 469257176 466538966
1036.1 466538966 463936061 461662203 459520727 457311779 455183029 453107566 451038271 449355841
1052.4 449355841 448378444 448068142 448469132 449447781 450357199 450626701 449962050 448060393 445024252
1070.8 445024252 441484660 437856495 434327930 431189269 428411663 425668418 422871530 419985890
1087.1 419985890 416917026 413920194 411398500 409370899 407707185 406406045 405306369 404219717
$$ packed form
970.8F19143486j2925088j1724890j0461628r063840p758379p070661o573975n803764
987.1E47761261n132854m499197l590405k828240k384126j870215j472652j591921
1003.5E24391651k022683k637506l534555m337550m707873m891693m870117m438758
1019.8D92950916m010498l815532l531456l251255l202885l074020k808094k718210
1036.1D66538966k602905k273858k141476k208948k128750k075463k069295j682430
1052.4D49355841r77397l10302M00990R78649R09418K69502o64651j901657l036141
1070.8D45024252l539592l628165l528565l138661k777606k743245k796888k885640
1087.1D19985890l068864k996832k521694k027601j663714j301140j099676j086652
$$ plain form
1103.4 404219717 403194010 402215838 401118517 399940282 398733348 397274971 395344049 392860383
1119.7 392860383 390000552 387417167 385643452 384747952 385130793 386762977 388571769 390086055 391684651
1138.1 391684651 393441051 395076454 396518260 397851169 399077356 400299788 401754618 403509885
1154.4 403509885 405555248 408079326 411216170 414941400 419420660 424835622 430993319 437671214
1170.7 437671214 444807917 452159554 459458083 466729879 473950952 480839163 487233132 493018031
1187 493018031 497867376 501660466 504577518 506680608 508175969 509633005 511396170 513490856 515990973
1205.4 515990973 518683791 521071136 523036480 524696469 525985241 526996732 528036773 529118419
1221.7 529118419 530207276 531582892 533307850 535183787 537295759 539719224 542222440 544772923
$$ packed form
1103.4D04219717j025707r78172j097321j178235j206934j458377j930922k483666
1119.7C92860383k859831k583385j773715q95500L82841J632184J808792J514286J598596
1138.1C91684651J756400J635403J441806J332909J226187J222432J454830J755267
1154.4D03509885K045363K524078L136844L725230M479260N414962O157697O677895
1170.7D37671214P136703P351637P298529P271796P221073O888211O393969N784899
1187D93018031M849345L793090K917052K103090J495361J457036J763165K094686K500117
1205.4E15990973K692818K387345J965344J659989J288772J011491J040041J081646
1221.7E29118419J088857J375616J724958J875937K111972K423465K503216K550483
$$ plain form
1238 544772923 547467232 550027609 552235782 554210126 555819988 556892157 557694256 558373213 558867097
1256.4 558867097 559517503 560698807 562331617 564446449 567253828 570550978 574152350 578224540
1272.7 578224540 582624316 587072313 591701806 596568644 601475537 606536984 611889422 617226779
1289 617226779 622398794 627477348 632187307 636349320 640184283 643585324 646314621 648676217 650810063
1307.4 650810063 652459204 653782547 655015230 655943453 656674445 657618642 658666193 659678757 660884202
1325.7 660884202 662091672 662900209 663429260 663675785 663430154 663021088 662833512 662699163 662590921
1344.1 662590921 662692130 662754953 662557960 662275612 661786139 660834372 659655094 658216059 656153321
1362.4 656153321 653822124 651586652 649130881 646526456 643888235 640779316 636945546 631435454
$$ packed form
1238E44772923K694309K560377K208173J974344J609862J072169Q02099O78957M93884
1256.4E58867097O50406J181304J632810K114832K807379L297150L601372M072190
1272.7E78224540M399776M447997M629493M866838M906893N061447N352438N337357
1289F17226779N172015N078554M709959M162013L834963L401041K729297K361596K133846
1307.4F50810063J649141J323343J232683R28223P30992R44197J047551J012564J205445
1325.7F60884202J207470Q08537N29051K46525k45631m09066j87576j34349j08242
1344.1F62590921J01209O2823j96993k82348m89473r51767j179278j439035k062738
1362.4F56153321k331197k235472k455771k604425k638221l108919l833770n510092
$$ plain form
1378.7 631435454 622330368 611672163 606774271 610484421 616474867 619353116 619544446 618047893
1395.1 618047893 615558624 612546623 609200060 605619669 601918340 598447859 595214665 592281222
1411.4 592281222 589842618 587772727 585823298 584014595 582637310 581632018 580918729 580342650 579715014
1429.7 579715014 579393148 579476774 579657137 580189168 581207931 582475603 584010422 585967183 588409245
1448.1 588409245 591385186 594906867 598954856 604375780 611528099 618143618 624092877 630638063
1464.4 630638063 637609720 644111156 650829792 658871770 666796982 673134327 678305805 682503104
1480.7 682503104 685659230 687817991 689060450 689175606 688407242 687346458 685570657 682664514 679419339
1499.1 679419339 676318347 673151553 668911338 662714958 657175481 652807891 648560107 644327760
$$ packed form
1378.7F31435454r105086j0658205m897892L710150N990446K878249J91330j496553
1395.1F18047893k489269l012001l346563l580391l701329l470481l233194k933443
1411.4E92281222k438604k069891j949429j808703j377285j005292p13289n76079o27636
1429.7E79715014l21866Q3626J80363N32031J018763J267672J534819J956761K442062
1448.1E88409245K975941L521681M047989N420924P152319O615519N949259O545186
1464.4F30638063O971657O501436O718636Q041978P925212O337345N171478M197299
1480.7F82503104L156126K158761J242459J15156p68364j060784j775801k906143l245175
1499.1F79419339l100992l166794m240215o196380n539477m367590m247784m232347
$$ plain form
1515.4 644327760 640484869 637319684 634100676 631049514 628509164 625944257 623594642 621430159
1531.7 621430159 619162798 617339969 615914941 614186764 612669230 612024724 611981869 612239301 612723112
1550.1 612723112 613570511 614637017 615641832 616430402 617078662 617466807 617393911 616833389 615448415
1568.4 615448415 613251686 610955179 607970774 603480101 598941505 594621897 589638650 584127367
1584.7 584127367 578199565 571856380 565214336 558375299 551277936 544139326 537105083 529990852
1601.1 529990852 522797346 515720725 508674681 501467705 494433939 487844318 480794907 472976655
1617.4 472976655 466668576 461301982 455412000 449856520 444975317 440675527 437487543 435048103
1633.7 435048103 432908893 432045072 432556450 433971643 436155856 439465046 443857312 448000222 452753037
$$ packed form
1515.4F44327760l842891l165185l219008l051162k540350k564907k349615k164483
1531.7F21430159k267361j822829j425028j728177j517534o44506m2855K57432M83811
1550.1F12723112Q47399J066506J004815P88570O48260L88145p2896n60522j384974
1568.4F15448415k196729k296507k984405m490673m538596m319608m983247n511283
1584.7E84127367n927802o343185o642044o839037p097363p138610p034243p114231
1601.1E29990852p193506p076621p046044p206976p033766o589621p049411p818252
1617.4D72976655o308079n366594n889982n555480m881203m299790l187984k439440
1633.7D35048103k139210q63821N11378J415193K184213L309190M392266M142910M752815
$$ plain form
1652 452753037 459467083 465387732 470571548 476334006 482928842 489909321 496439904 503382504 511333346
1670.4 511333346 518934429 526721239 535267293 543390691 551098466 559516370 569972336 579942822
1686.7 579942822 588524520 597345769 605856478 615045428 625345886 636154473 648752034 659922361
1703 659922361 669503748 679175913 687814176 695421278 702417135 709026992 715729237 721973419 727155685
1721.4 727155685 731840432 736415207 740691125 744660914 748267710 752024651 755931675 759313405
1737.7 759313405 762700200 766232848 769613326 772951663 776236236 779404223 782563269 785403669
1754 785403669 787863731 790205598 792406559 794445217 796345830 798101425 799726009 801218092 802704930
1772.4 802704930 804255664 805652142 806963563 808283687 809502482 810633481 811805129 812921226
$$ packed form
1652D52753037O714046N920649N183816N762458O594836O980479O530583O942600P950842
1670.4E11333346P601083P786810Q546054Q123398P707775Q417904J0455966R970486
1686.7E79942822Q581698Q821249Q510709R188950J0300458J0808587J2597561J1170327
1703F59922361R581387R672165Q638263P607102O995857O609857O702245O244182N182266
1721.4G27155685M684747M574775M275918L969789L606796L756941L907024L381730
1737.7G59313405L386795L532648L380478L338337L284573L167987L159046K840400
1754G85403669K460062K341867K200961K038658J900613J755595J624584J492083J486838
1772.4H02704930J550734J396478J311421J320124J218795J130999J171648J116097
$$ plain form
1788.7 812921226 813889802 814925671 815983891 816920578 817801774 818663478 819490254 820340633 821168661
1807 821168661 821864843 822532833 823263526 823953390 824581206 825260818 825907767 826449394 827033043 827651501
1827.4 827651501 828146219 828657746 829245746 829731226 830210328 830795169 831278086 831551254 831927001 832446992
1847.8 832446992 832918406 833363414 833771527 834107161 834441662 834817588 835160136 835475743 835765541 835967362
1868.2 835967362 836199164 836551249 836874425 837119281 837397277 837672114 837847233 838029802 838275015 838413775
1888.6 838413775 838526487 838759661 838939786 839044929 839216113 839390934 839503944 839666128 839840233 839903712
1909 839903712 839952290 840052545 840091646 840074480 840161145 840262532 840273380 840332448 840398550 840377927 840370297 840356767
1933.5 840356767 840264618 840195298 840156138 840050697 839941800 839897275 839837790 839730442 839612067 839472175
$$ packed form
1788.7H12921226R68576J035869J058220R36687Q81196Q61704Q26776Q50379Q28028
1807H21168661O96182O67990P30693O89864O27816O79612O46949N41627N83649O18458
1827.4H27651501M94718N11527N88000M85480M79102N84841M82917K73168L75747N19991
1847.8H32446992M71414M45008M08113L35634L34501L75926L42548L15607K89798K01821
1868.2H35967362K31802L52085L23176K44856K77996K74837J75119J82569K45213J38760
1888.6H38413775J12712K33174J80125J05143J71184J74821J13010J62184J74105O3479
1909H39903712M8578J00255L9101j7166Q6665J01387J0848N9068O6102k0623p630j3530
1933.5H40356767r2149o9320l9160j05441j08897m4525n9485j07348j18375j39892
$$ plain form
1953.9 839472175 839303911 839143455 839003801 838861525 838723302 838582158 838411570 838252187 838135839 838007331
1974.3 838007331 837841451 837690890 837552845 837402523 837249935 837105155 836953640 836788118 836629272 836475313
1994.7 836475313 836311758 836144865 835973918 835771918 835570037 835394084 835204005 834994793 834801376 834581852
2015.1 834581852 834325314 834113955 833916783 833666623 833423197 833250403 833063722 832834840 832642734 832460761
2035.5 832460761 832244575 832040489 831867278 831689119 831538141 831405818 831215203 831025243 830920458 830818772
2055.9 830818772 830669105 830513656 830370247 830274880 830243826 830198288 830072999 829971254 829928935 829839587
2076.3 829839587 829764128 829775691 829754174 829670608 829624593 829586565 829523563 829498112 829500735 829476535 829458296 829467714
2100.7 829467714 829463780 829465628 829495668 829492807 829473972 829529762 829572380 829538763 829572678 829648793 829626858 829629898
$$ packed form
1953.9H39472175j68264j60456j39654j42276j38223j41144j70588j59383j16348j28508
1974.3H38007331j65880j50561j38045j50322j52588j44780j51515j65522j58846j53959
1994.7H36475313j63555j66893j70947k02000k01881j75953j90079k09212j93417k19524
2015.1H34581852k56538k11359j97172k50160k43426j72794j86681k28882j92106j81973
2035.5H32460761k16186k04086j73211j78159j50978j32323j90615j89960j04785j01686
2055.9H30818772j49667j55449j43409r5367l1054m5538j25289j01745m2319q9348
2076.3H29839587p5459J1563k1517q3566m6015l8028o3002k5451K623k4200j8239R418
2100.7H29467714l934J848L0040k861j8835N5790M2618l3617L3915P6115k1935L040
$$ plain form
2125.2 829629898 829752982 829843462 829876363 829969108 830066919 830111980 830205977 830315411 830373526 830500066 830696225
2147.7 830696225 830823362 830933273 831105053 831215262 831278682 831443250 831615269 831719995 831866264 832013130
2168 832013130 832112014 832297385 832547963 832702518 832808971 832953155 833046556 833113968 833271861 833420277
2188.4 833420277 833495021 833635211 833804071 833876133 833960950 834084094 834113359 834132969 834246337 834349215
2208.8 834349215 834442317 834581792 834624112 834580064 834655166 834760547 834759533 834813535 834946871 834971905 834959865
2231.3 834959865 835037768 835072994 835062861 835116684 835131347 835095227 835146189 835220933 835209787 835199594 835219681
2253.7 835219681 835196257 835199952 835272491 835292578 835276902 835325539 835359335 835359216 835426867 835486293 835453749 835481346
2278.2 835481346 835610151 835680544 835723042 835807562 835843861 835829794 835847020 835863173 835844457 835858822 835883021
$$ packed form
2125.2H29629898J23084R0480L2901R2745R7811M5061R3997J09434N8115J26540J96159
2147.7H30696225J27137J09911J71780J10209O3420J64568J72019J04726J46269J46866
2168H32013130R8884J85371K50578J54555J06453J44184R3401O7412J57893J48416
2188.4H33420277P4744J40190J68860P2062Q4817J23144K9265J9610J13368J02878
2208.8H34349215R3102J39475M2320m4048P5102J05381j014N4002J33336K5034j2040
2231.3H34959865P7903L5226j0133N3823J4663l6120N0962P4744j1146j0193K0087
2253.7H35219681k3424L695P2539K0087j5676M8637L3796j19O7651N9426l2544K7597
2278.2H35481346J28805P0393M2498Q4520L6299j4067J7226J6153j8716J4365K4199
$$ plain form
2300.6 835883021 835877538 835898697 835915506 835851371 835792542 835835993 835863292 835775614 835678101 835603476 835501075
2323.1 835501075 835463047 835439026 835298777 835128725 834869564 834372580 833943427 833923519 834196091 834672451
2343.5 834672451 835519910 836464465 836930037 836848497 836554289 836298466 836177468 836224794 836346507 836561084
2363.8 836561084 836933792 837406993 837914884 838475049 839029312 839495599 840008616 840600014 841099441 841511548
2384.2 841511548 841856778 842039168 842152357 842337906 842466891 842475891 842530489 842622578 842645943 842671454 842714071
2406.7 842714071 842696249 842704058 842768908 842750371 842694879 842711270 842651069 842456162 842303455 842247546 842255950
2429.1 842255950 842351258 842439175 842400372 842338681 842337966 842283428 842176437 842126250 842074454 841970325 841882169
2451.5 841882169 841790140 841675818 841597974 841513395 841385663 841301024 841244459 841107607 840949774 840877116 840820730
$$ packed form
2300.6H35883021n483K1159J6809o4135n8829M3451K7299q7678r7513p4625j02401
2323.1H35501075l8028k4021j40249j70052k59161m96984m29153j9908K72572M76360
2343.5H34672451Q47459R44555M65572q1540k94208k55823j20998M7326J21713K14577
2363.8H36561084L72708M73201N07891N60165N54263M66287N13017N91398M99427M12107
2384.2H41511548L45230J82390J13189J85549J28985R000N4598R2089K3365K5511M2617
2406.7H42714071j7822P809O4850j8537n5492J6391o0201j94907j52707n5909Q404
2429.1H42255950R5308Q7917l8803o1691p15n4538j06991n0187n1796j04129q8156
2451.5H41882169r2029j14322p7844q4579j27732q4639n6565j36852j57833p2658n6386
$$ plain form
2474 840820730 840707600 840563297 840391636 840204537 840055764 839948118 839826047 839702964 839602530 839462876
2494.4 839462876 839299738 839184582 839092851 838971615 838822961 838658512 838480175 838357270 838294208 838182032
2514.8 838182032 838028550 837899387 837765515 837622702 837492585 837312460 837100506 836961925 836857796 836702764
2535.2 836702764 836547852 836431146 836283147 836115122 835976839 835826695 835661232 835492849 835277438 835063159
2555.6 835063159 834927320 834797084 834599018 834395528 834219158 834008217 833780169 833554208 833268583 832945228
2576 832945228 832649052 832358360 832069159 831812978 831520975 831160784 830810726 830455780 830057323 829686344
2596.4 829686344 829345405 828949451 828520000 828119457 827704966 827241480 826771379 826297224 825811446 825354218
2616.8 825354218 824925542 824481905 824005961 823492885 822963178 822475612 822010636 821524024 821054757 820600867
$$ packed form
2474H40820730j13130j44303j71661j87099j48773j07646j22071j23083j00434j39654
2494.4H39462876j63138j15156r1731j21236j48654j64449j78337j22905o3062j12176
2514.8H38182032j53482j29163j33872j42813j30117j80125k11954j38581j04129j55032
2535.2H36702764j54912j16706j47999j68025j38283j50144j65463j68383k15411k14279
2555.6H35063159j35839j30236j98066k03490j76370k10941k28048k25961k85625l23355
2576H32945228k96176k90692k89201k56181k92003l60191l50058l54946l98457l70979
2596.4H29686344l40939l95954m29451m00543m14491m63486m70101m74155m85778m57228
2616.8H25354218m28676m43637m75944n13076n29707m87566m64976m86612m69267m53890
$$ plain form
2637.1 820600867 820114374 819629729 819183469 818726122 818238556 817767203 817297876 816803694 816339552 815910339
2657.5 815910339 815453470 815000653 814610302 814208746 813735425 813263714 812807858 812326491 811879277 811477959
2677.9 811477959 811037183 810555995 810072660 809555292 809017062 808525980 808056355 807562292 807053685 806501865
2698.3 806501865 805919766 805370867 804810047 804214478 803678393 803163052 802558661 801922381 801330328 800753951
2718.7 800753951 800179422 799624145 799044073 798419178 797822773 797257841 796668649 796095431 795537829 794927537
2739.1 794927537 794327736 793792963 793262959 792731822 792211711 791645825 791017771 790391386 789763927 789073229
2759.5 789073229 788372815 787740171 787124395 786462784 785748065 784990132 784242511 783514857 782724321 781857967
2779.9 781857967 780992687 780136049 779273391 778425634 777541995 776568770 775568247 774603903 773625612
$$ packed form
2637.1H20600867m86493m84645m46260m57347m87566m71353m69327m94182m64142m29213
2657.5H15910339m56869m52817l90351m01556m73321m71711m55856m81367m47214m01318
2677.9H11477959m40776m81188m83335n17368n38230m91082m69625m94063n08607n51820
2698.3H06501865n82099n48899n60820n95569n36085n15341o04391o36280n92053n76377
2718.7H00753951n74529n55277n80072o24895n96405n64932n89192n73218n57602o10292
2739.1G94927537n99801n34773n30004n31137n20111n65886o28054o26385o27459o90698
2759.5G89073229p00414o32644o15776o61611p14719p57933p47621p27654p90536q66354
2779.9G81857967q65280q56638q62658q47757q83639r73225j000523r64344r78291
$$ plain form
2798.3 773625612 772577405 771485627 770336866 769123971 767940283 766778111 765542626 764243841
2814.6 764243841 762914658 761554599 760166228 758757532 757312000 755775094 754124939 752364159
2830.9 752364159 750485480 748492122 746291399 743651807 740450382 736687303 732359827 727806330
2847.2 727806330 723782420 720843196 718970358 717767656 716799021 715741992 714399457 712674141
2863.5 712674141 710529566 708050728 705466807 703019083 700822532 698883176 697180808 695662677
2879.9 695662677 694211364 692688704 691028178 689278543 687487185 685619354 683694959 681734502
2896.2 681734502 679687381 677596629 675488830 673217058 670673788 667871118 664716542 661107898
2912.5 661107898 657235682 653521717 650336325 647826433 645972133 644679368 643891037 643585742 643618405
$$ packed form
2798.3G73625612j048207j091778j148761j212895j183688j162172j235485j298785
2814.6G64243841j329183j360059j388371j408696j445532j536906j650155j760780
2830.9G52364159j878679j993358k200723k639592l201425l763079m327476m553497
2847.2G27806330m023910k939224j872838j202702r68635j057029j342535j725316
2863.5G12674141k144575k478838k583921k447724k196551j939356j702368j518131
2879.9F95662677j451313j522660j660526j749635j791358j867831j924395j960457
2896.2F81734502k047121k090752k107799k271772k543270k802670l154576l608644
2912.5F61107898l872216l713965l185392k509892j854300j292765p88331l05295L2663
$$ plain form
2930.8 643618405 643941164 644757330 646153629 648007751 650185823 652466655 654538453 656198978 657397032
2949.2 657397032 658167958 658569634 658722520 658865035 659184039 659707963 660326242 660947740 661611855 662301958
2969.6 662301958 662994325 663734674 664498270 665306509 666224480 667151690 667987943 668801069 669617712 670338392
2990 670338392 670826435 670988202 670887053 670587420 670052946 669331610 668526113 667696297 666877449 666048408
3010.4 666048408 665099621 663930893 662591934 661192715 659741521 658204436 656582475 654899120
3026.7 654899120 653207779 651523411 649819732 648050964 646165371 644250453 642389834 640471041
3043 640471041 638399303 636237621 634071946 631914973 629764140 627640426 625496566 623286724 621108949
3061.4 621108949 619047880 617078781 615137458 613113701 610984445 608892798 606933057 605014265
$$ packed form
2930.8F43618405L22759Q16166J396299J854122K178072K280832K071798J660525J198054
2949.2F57397032P70926M01676J52886J42515L19004N23924O18279O21498O64115O90103
2969.6F62301958O92367P40349P63596Q08239R17971R27210Q36253Q13126Q16643P20680
2990F70338392M88043J61767j01149k99633n34474p21336q05497q29816q18848q29041
3010.4F66048408r48787j168728j338959j399219j451194j537085j621961j683355
3026.7F54899120j691341j684368j703679j768768j885593j914918j860619j918793
3043F40471041k071738k161682k165675k156973k150833k123714k143860k209842k177775
3061.4F21108949k061069j969099j941323k023757k129256k091647j959741j918792
$$ plain form
3077.7 605014265 602974176 600811660 598656297 596538782 594436765 592304528 590081275 587835193
3094 587835193 585637212 583443940 581221342 578948855 576637506 574384093 572141409 569741607 567280233
3112.4 567280233 564916432 562542319 560045063 557414949 554651856 551864922 549171567 546505392
3128.7 546505392 543766141 540988982 538214386 535448015 532684624 529826820 526867628 523930013
3145 523930013 521009028 518065929 515171409 512254119 509155810 505976796 502869368 499789238 496679664
3163.4 496679664 493547320 490406781 487296939 484201998 481078207 477938801 474797964 471666813
3179.7 471666813 468538940 465426058 462346226 459292442 456256509 453211457 450149506 447096258
3196 447096258 444064289 441046387 438061088 435121983 432224184 429350704 426500112 423665822 420843661
$$ packed form
3077.7F05014265k040089k162516k155363k117515k102017k132237k223253k246082
3094E87835193k197981k193272k222598k272487k311349k253413k242684k399802k461374
3112.4E67280233k363801k374113k497256k630114k763093k786934k693355k666175
3128.7E46505392k739251k777159k774596k766371k763391k857804k959192k937615
3145E23930013k920985k943099k894520k917290l098309l179014l107428l080130l109574
3163.4D96679664l132344l140539l109842l094941l123791l139406l140837l131151
3179.7D71666813l127873l112882l079832l053784l035933l045052l061951l053248
3196D47096258l031969l017902k985299k939105k897799k873480k850592k834290k822161
$$ plain form
3214.3 420843661 418072730 415366501 412744284 410164505 407545775 404940724 402412981 399948120
3230.7 399948120 397556096 395182937 392770886 390407085 388147503 385973662 383882642 381838799
3247 381838799 379762769 377683550 375704527 373804837 371908396 370011955 368125051 366238207 364357352
3265.3 364357352 362502277 360700428 358898789 357025504 355111629 353230506 351432174 349654049
3281.6 349654049 347797543 345902622 344051719 342273891 340521783 338658959 336671442 334660500
3298 334660500 332671314 330746323 328899264 327022314 324996144 322845578 320665687 318519711 316425741
3316.3 316425741 314339548 312218636 310100228 308025450 305912644 303703368 301485300 299334466
3332.6 299334466 297273308 295282781 293243229 291079849 288880259 286714196 284610569 282604605
$$ packed form
3214.3D20843661k770931k706229k622217k579779k618730k605051k527743k464861
3230.7C99948120k392024k373159k412051k363801k259582k173841k091020k043843
3247C81838799k076030k079219j979023j899690j896441Tj886904j886844j880855
3265.3C64357352j855075j801849j801639j873285j913875j881123j798332j778125
3281.6C49654049j856506j894921j850903j777828j752108j862824j987517k010942
3298C34660500j989186j924991j847059j876950k026170k150566k179891k145976k093970
3316.3C16425741k086193k120912k118408k074778k112806k209276k218068k150834
3332.6B99334466k061158j990527k039552k163380k199590k166063k103627k005964
$$ plain form
3348.9 282604605 280599266 278484792 276329547 274257660 272311151 270421386 268531978 266763091
3365.3 266763091 265137255 263427138 261515588 259623319 257980615 256531686 255174905 253856480
3381.6 253856480 252612889 251579523 250836432 250300378 249690458 248846814 247998044 247490689 247297287
3399.9 247297287 246920362 246168450 245544001 245308682 245234534 245177463 245120242 245050892 245057747 245209485 245429322
3422.4 245429322 245782018 246415213 247271955 248128906 249023125 250070423 251008600 251709253 252494514
3440.7 252494514 253621042 254992723 256430477 257882416 259413093 261041284 262764901 264640480
3457 264640480 266662836 268670112 270676345 272950798 275447279 277696759 279489160 281285375 283463925
3475.4 283463925 285944849 288454533 290774614 293060750 295548230 298124641 300665438 303265125
$$ packed form
3348.9B82604605k005339k114474k155245k071887j946509j889765j889408j768887
3365.3B66763091j625836j710117j911550j892269j642704j448929j356781j318425
3381.6B53856480j243591j033366p43091n36054o09920q43644q48770n07355j93402
3399.9B47297287l76925p51912o24449k35319p4148n7071n7221o9350O855J51738K19837
3422.4B45429322L52696O33195Q56742Q56951Q94219J047298R38177P00653P85261
3440.7B52494514J126528J371681J437754J451939J530677J628191J723617J875579
3457B64640480K022356K007276K006233K274453K496481K249480J792401J796215K178550
3475.4B83463925K480924K509684K320081K286136K487480K576411K540797K599687
$$ plain form
3491.7 303265125 305986047 308823466 311644405 314435989 317306310 320099413 322743833 325517744
3508 325517744 328592211 331916213 335222751 338304609 341398716 344727010 348304659 351859838 355188638
3526.4 355188638 358581632 362228960 366017133 369943917 373932898 377819061 381831765 386125684
3542.7 386125684 390456200 394609153 398700088 402919710 407359362 411948293 416573584 421317428
3559 421317428 426174462 430930436 435669661 440964192 446668863 452122778 457463890 463072449 468894452
3577.4 468894452 474832267 480932981 487062782 493128836 499456316 506071985 512437284 518791318
3593.7 518791318 525547385 532474816 539346576 546243191 553070903 559662998 566459954 573591173
3610 573591173 580678403 587727249 594494283 601205111 608490109 615601778 621966124 627884269 634378016
$$ packed form
3491.7C03265125K720922K837419K820939K791584K870321K793103K644420K773911
3508C25517744L074467L324002L306538L081858L094107L328294L577649L555179L328800
3526.4C55188638L392994L647328L788173L926784L988981L886163M012704M293919
3542.7C86125684M330516M152953M090935M219622M439652M588931M625291M743844
3559D21317428M857034M755974M739225N294531N704671N453915N341112N608559N822003
3577.4D68894452N937815O100714O129801O066054O327480O615669O365299O354034
3593.7E18791318O756067O927431O871760O896615O827712O592095O796956P131219
3610E73591173P087230P048846O767034O710828P284998P111669O364346N918145O493747
$$ plain form
3628.4 634378016 641734064 648380876 654439747 660434783 666246593 671982288 677616596 682835937
3644.7 682835937 687691450 693000138 698808074 703774214 707976401 712528586 717149019 721121609
3661 721121609 724682152 728099823 731205285 734146953 737276018 739815593 741841316 744154632 746189535
3679.4 746189535 747605920 748245418 747376978 744276285 739527404 735830009 735118568 737777710 743278503
3697.7 743278503 750303686 757538617 763629913 767866969 770721376 772814035 774682224 776555359
3714 776555359 778137207 779394805 780473232 781430900 782307863 783238232 784271419 785169125 785907567
3732.4 785907567 786672831 787639260 788741052 789431810 789457619 789694011 790612042 791153371 791434109 792200804
3752.8 792200804 793101132 793694258 794101238 794654787 795206189 795581222 795910716 796217442 796605289 797125280
$$ packed form
3628.4F34378016P356048O646812O058871N995036N811810N735695N634308N219341
3644.7F82835937M855513N308688N807936M966140M202187M552185M620433L972590
3661G21121609L560543L417671L105462K941668L129065K539575K025723K313316K034903
3679.4G46189535J416385O39498q68440l100693m748881l697395p11441K659142N500793
3697.7G43278503P025183P234931O091296M237056K854407K092659J868189J873135
3714G76555359J581848J257598J078427R57668Q76963R30369J033187Q97706P38442
3732.4G85907567P65264R66429J101792O90758K5809K36392R18031N41329K80738P66695
3752.8G92200804R00328N93126M06980N53549N51402L75033L29494L06726L87847N19991
$$ plain form
3773.2 797125280 797631681 798041999 798378706 798675537 798883855 799088895 799375892 799721956 800106227 800363064
3793.6 800363064 800547123 800815940 800841153 800843060 801206470 801439106 801674068 802130997 802473128 802523494
3814 802523494 802570045 802789032 802775085 802903354 803337693 803585887 803684533 803738058 803872168 804084659 804027855
3836.4 804027855 803841472 803953409 804207146 804496050 804839909 805058599 804749131 803952098 804008365 804833353
3856.8 804833353 805311024 805376410 805268466 805279255 805317760 805181503 805177152 805308938 805528700 805762529
3877.2 805762529 805705309 805632114 805692673 805799127 805996001 805975914 805823207 805906594 806064546 806041420 805890560
3899.6 805890560 805755138 805757940 805987477 806236982 806340694 806340575 806237340 806061208 805969596 806088567 806253135
3922.1 806253135 806292951 806326091 806383073 806325376 806267977 806411088 806613982 806690753 806639135 806595087 806645572
$$ packed form
3773.2G97125280N06401M10318L36707K96831K08318K05040K86997L46064L84271K56837
3793.6H00363064J84059K68817K5213J907L63410K32636K34962M56929L42131N0366
3814H02523494M6551K18987j3947J28269M34339K48194R8646N3525J34110K12491n6804
3836.4H04027855j86383J11937K53737K88904L43859K18690l09468p97033N6267Q24988
3856.8H04833353M77671O5386j07944J0789L8505j36257m351J31786K19762K33829
3877.2H05762529n7220p3195O0559J06454J96874k0087j52707Q3387J57952k3126j50860
3899.6H05890560j35422K802K29537K49505J03712j19j03235j76132r1612J18971J64568
3922.1H06253135L9816L3140N6982n7697n7399J43111K02894P6771n1618m4048N0485
$$ plain form
3944.5 806645572 806692243 806721210 806745589 806752682 806847990 806997180 807065606 807097733 807199001 807320654 807369649
3966.9 807369649 807384789 807429373 807538688 807692170 807811558 807907283 807992935 808021426 808010101 808047950 808186412
3989.4 808186412 808355689 808464289 808528364 808594763
3997.5 808594763
$$ packed form
3944.5H06645572M6671K8967K4379P093R5308J49190O8426L2127J01268J21653M8995
3966.9H07369649J5140M4584J09315J53482J19388R5725Q5652K8491j1325L7849J38462
3989.4H08186412J69277J08600O4075O6399
3997.5H08594763
##END=$$ End of the data block
