##TITLE=$$ Begin of the data block
##JCAMP-DX=5.00 $$ ACD/SpecManager v 10.08
##SPECTROMETER/DATA SYSTEM=Alpha
##DATE=14 Apr 2014 11:23:48
##DATA TYPE=INFRARED SPECTRUM
##DATA CLASS=XYDATA
##ORIGIN=
##OWNER=
##NPOINTS=1765
##FIRSTX=399.75695801
##LASTX=3997.56933594
##MAXX=3997.56933594
##MINX=399.75695801
##MAXY=0.84311694
##MINY=0.24603570
##XFACTOR=1.0000000000
##YFACTOR=1.000000000000000e-9
##FIRSTY=0.55068582
##DELTAX=2.03957629
##XUNITS=1/CM
##YUNITS=ARBITRARY UNITS
##XYDATA=(X++(Y..Y))
399.8 550685823 549343467 549013376 548143983 546660066 545873761 544829547 543328762 542916775 542863488
418.1 542863488 542317152 542592943 542867362 542146802 541753888 541844785 541257560 540636480 540549159 540308475
438.5 540308475 540197730 540334761 540094554 540068924 540507197 540285826 539810896 540003359 539660752 538648844
458.9 538648844 538367510 538082182 537287712 536897719 536378324 535154819 534426689 534095824 533093274
477.3 533093274 532355487 532320261 531775415 531174958 531265080 530855477 529948592 529604971 529074013 528090000
497.7 528090000 527581632 527018428 526035607 525494635 524999619 523927867 523109496 522497296 521148384
516 521148384 519786298 519012928 517833531 516474247 515683353 514573932 513073444 512200832 511557639
534.4 511557639 510746837 510333836 509753525 508565128 507787287 507273555 506249368 505473197 504975259
552.7 504975259 503713429 502300918 501367867 499958336 498153687 496778876 495239288 493273377 491595894
571.1 491595894 489773273 487543732 485974193 484985888 483782858 482784420 482099026 481216162 480525255
589.4 480525255 480236501 479556799 478586942 477778375 476316512 473974138 471478313 468870848 466325462
607.8 466325462 464544773 463318884 462369055 462436616 463764727 465730906 468460321 472094029 475775063
626.1 475775063 479428083 483420968 487172365 490489155 493936539 497182131 499790877 502277017
642.5 502277017 504676223 506810129 509298682 511978567 513854980 515403450 517818570 521105886
658.8 521105886 524708986 528322160 531291306 533970356 537880957 541611135 544607520 547843039
675.1 547843039 551173508 554092407 556938946 559858084 562305450 564385176 566504896 568392158
691.4 568392158 569899082 571367919 572678387 573724747 574993908 576672375 578480721 580491364
707.7 580491364 582810044 585169435 587658107 590483963 593262851 595860541 598686159 601547837
724 601547837 604168475 606815577 609470785 611779332 613850415 615943968 617898107 619780719 621850133
742.4 621850133 623892486 625814140 627996922 630279005 632247210 634131372 636079550 637822568
758.7 637822568 639461398 641154230 642574430 643812418 645131111 646114469 646563292 646878004 646909475
777.1 646909475 646339417 645577252 644859135 644110262 643804193 644394815 645734072 648010671 651594698
795.4 651594698 656114817 661193669 666879058 672614336 677639663 682051003 685941041 689032316
811.7 689032316 691420197 693200231 694020331 693835437 692762315 690537989 687266171 683527648 679463983
830.1 679463983 675056338 670816898 666918397 663073897 659547687 656590819 653861284 651618242
846.4 651618242 650716603 651431441 653924346 658546925 664945662 672341347 680487692 689085305 697394013
864.8 697394013 705172062 712349117 718402624 723373175 727758169 731270611 733607173 735085130
881.1 735085130 735553086 734811962 733478308 731816590 729713917 727886558 726942599 726584077 726922393
899.4 726922393 728271663 729847491 731029034 732043922 732457578 731674790 730012119 727515101 723940849
917.8 723940849 720017970 716466844 713321447 711171269 710553944 710808277 711401165 712390602 713244796
936.2 713244796 713596284 713900387 714021504 713473201 712502539 711012423 708343387 704556704 699846327
954.5 699846327 693803668 686454296 678135812 668514073 657440007 645402789 632553816 619157791
970.8 619157791 606238425 594526887 584087074 575027406 567247570 560198903 553708911 547969639
987.1 547969639 542830050 538272083 534644246 531833529 529470265 527586341 526078045 524453580
1003.5 524453580 522418439 519776821 516226053 511885583 507213473 502361953 497502625 493060857
1019.8 493060857 489040524 485220909 481742650 478559762 475358367 472268581 469480962 466787070
1036.1 466787070 464190573 461901367 459739715 457557887 455481112 453379065 451230854 449542254
1052.4 449542254 448618829 448332995 448716164 449687451 450593889 450798333 450074017 448199719 445215613
1070.8 445215613 441714078 438113958 434585214 431434691 428675771 425953925 423150063 420278579
1087.1 420278579 417256236 414297312 411769778 409702539 408061922 406875163 405848473 404706895
1103.4 404706895 403582156 402558535 401453733 400278956 399117172 397709876 395773977 393263996
1119.7 393263996 390407741 387838900 386026651 385043889 385379314 387029380 388869673 390393347 391980082
1138.1 391980082 393756837 395461231 396935046 398233205 399411440 400594920 402025491 403787524
1154.4 403787524 405858755 408388227 411491930 415178925 419651598 425071687 431213379 437857658
1170.7 437857658 444953650 452262700 459538639 466810137 474014848 480871886 487247199 493004233
1187 493004233 497814149 501588225 504497826 506614208 508170664 509697139 511481822 513537169 515962899
1205.4 515962899 518611312 521017671 523030162 524735153 526060879 527097702 528131306 529181302
1221.7 529181302 530260444 531645238 533369064 535232902 537329376 539745450 542269349 544853270
1238 544853270 547559559 550139427 552397549 554405630 556030214 557131946 557945132 558603942 559097350
1256.4 559097350 559771061 560944200 562544703 564647496 567418814 570659459 574253440 578335702
1272.7 578335702 582708657 587122679 591750801 596622527 601512671 606552660 611890137 617224336
1289 617224336 622421563 627533734 632233977 636353076 640178025 643618345 646404862 648814559 650971889
1307.4 650971889 652631998 653946996 655139685 656049192 656811357 657792270 658843935 659840167 661040902
1325.7 661040902 662257254 663063049 663570166 663819134 663620472 663237154 663023233 662859976 662757695
1344.1 662757695 662882268 662949324 662762880 662505865 662015438 661064386 659916759 658510327 656464994
1362.4 656464994 654114842 651813269 649294198 646687210 644090533 640996397 637152493 631638229
1378.7 631638229 622516334 611858130 606991231 610719383 616710901 619583130 619744539 618218243
1395.1 618218243 615744114 612745643 609384298 605834246 602188289 598711491 595457435 592532396
1411.4 592532396 590099275 588037431 586102307 584299505 582918406 581884861 581125796 580536723 579938948
1429.7 579938948 579644799 579719424 579865992 580402732 581448436 582681358 584155142 586107969 588579714
1448.1 588579714 591559291 595044732 599047482 604476571 611678779 618301451 624236047 630777657
1464.4 630777657 637750149 644249976 650973141 659038365 666986942 673323631 678495407 682689905
1480.7 682689905 685829878 687978983 689233601 689396739 688658357 687558174 685729980 682814777 679591477
1499.1 679591477 676508665 673359275 669119358 662892580 657363892 653043091 648805320 644548059
1515.4 644548059 640707791 637566328 634363711 631329298 628806710 626270175 623944700 621766150
1531.7 621766150 619452238 617600083 616168261 614434421 612953007 612398803 612420499 612679005 613154292
1550.1 613154292 614020050 615108430 616129696 616931617 617570400 617944539 617865860 617312133 615949571
1568.4 615949571 613763630 611468971 608487487 603990018 599467993 595160604 590140760 584601402
1584.7 584601402 578677118 572315753 565645158 558797956 551687717 544526339 537496209 530407727
1601.1 530407727 523242474 516183913 509101510 501836717 494791359 488204151 481139898 473309189
1617.4 473309189 466992706 461607784 455684513 450078368 445154428 440849215 437679440 435250163
1633.7 435250163 433106393 432234019 432757676 434220403 436453909 439796120 444205910 448346049 453109711
1652 453109711 459848970 465756983 470916033 476668894 483280361 490293682 496844143 503808320 511781335
1670.4 511781335 519363225 527113557 535648286 543785453 551519096 559970737 570433199 580352843
1686.7 580352843 588878214 597679853 606191814 615364373 625650764 636466742 649054766 660206258
1703 660206258 669785619 679465294 688090980 695665121 702641964 709258258 716005266 722298026 727474272
1721.4 727474272 732130527 736672163 740903676 744867265 748533964 752356768 756267846 759616137
1737.7 759616137 762968063 766481459 769869804 773238063 776535690 779669225 782803953 785662889
1754 785662889 788122058 790428340 792631984 794728458 796660960 798394918 799972296 801428914 802935123
1772.4 802935123 804524064 805924237 807216167 808509171 809726715 810900986 812112033 813234031
1788.7 813234031 814174592 815159500 816197038 817141950 818032503 818906486 819734693 820567369 821397245
1807 821397245 822144449 822858274 823577702 824236333 824847460 825519383 826155186 826686502 827290177 827939987
1827.4 827939987 828438818 828943253 829533279 830013573 830470085 831043780 831532478 831820548 832229257 832770050
1847.8 832770050 833219528 833627880 834032357 834379554 834710956 835081935 835416496 835731387 836047471 836282134
1868.2 836282134 836530268 836877048 837166250 837364495 837624192 837926805 838126421 838280976 838483512 838625491
1888.6 838625491 838768780 839016795 839208484 839334309 839520574 839696646 839796424 839942396 840105474 840160608
1909 840160608 840207398 840308547 840359807 840379298 840478778 840550363 840550661 840617716 840668261 840627432 840605140 840585768
1933.5 840585768 840512931 840483487 840475857 840363860 840238869 840184510 840091646 839960814 839867592 839755714 839581370
1955.9 839581370 839398503 839235544 839080691 838953674 838834643 838683367 838528872 838387489 838231623 838069856
1976.3 838069856 837942183 837822378 837681890 837546229 837428927 837293804 837122858 836956263 836792767 836610317
1996.7 836610317 836441517 836283267 836085021 835873604 835682690 835489690 835284591 835087061 834860981 834598482
2017.1 834598482 834372640 834161878 833935082 833739638 833577991 833380282 833172560 833007693 832813740 832578540
2037.5 832578540 832367301 832164228 831952095 831787944 831667840 831511259 831344068 831253767 831158340 830984056
2057.9 830984056 830804169 830655992 830554783 830520213 830477059 830351114 830242217 830194950 830095887 830003798
2078.3 830003798 830033839 830050111 829982340 829940200 829904199 829844356 829813421 829788208 829737723 829730749 829772770 829782784
2102.8 829782784 829782546 829810143 829799175 829765320 829800725 829831898 829801321 829824626 829904795 829927385 829956114 830062032
2127.3 830062032 830143869 830203772 830314994 830402076 830442011 830528498 830618739 830680430 830817401 830992937 831081629
2149.7 831081629 831167042 831337512 831467807 831565619 831750631 831928492 832048357 832218587 832385480 832494080
2170.1 832494080 832669437 832883000 832986772 833065212 833235800 833382905 833475530 833623707 833776176 833872855
2190.5 833872855 833996296 834125817 834197402 834295630 834405541 834427059 834469318 834618032 834739208 834822834
2210.9 834822834 834940553 834963202 834896922 834945202 835060894 835124016 835232496 835361123 835365891 835355341 835418582
2233.3 835418582 835418403 835386097 835440874 835469365 835448742 835506320 835561872 835517764 835506797 835565686 835570097 835570276
2257.8 835570276 835636318 835656285 835630834 835681736 835732579 835713208 835759044 835843861 835843503 835879445 836020887 836124480
2282.3 836124480 836184323 836251915 836252928 836214066 836247683 836287022 836266160 836280763 836304843 836282551 836276352 836270988
2306.7 836270988 836213171 836181879 836250007 836301804 836260200 836195529 836113334 836019754 836003602 835967720 835818708
2329.2 835818708 835666299 835446000 835024118 834620118 834534645 834746718 835193574 836036742 836997449 837495744
2349.6 837495744 837477386 837259591 837059498 836958289 837002099 837121725 837273240 837535918 837928236 838397086
2370 838397086 838964343 839539886 840015113 840503216 841014624 841444731 841852188 842212796 842411995 842550159
2390.4 842550159 842734873 842837811 842835903 842902303 842992842 842997432 843023896 843091965 843090594 843081295 843116939 843093812
2414.8 843093812 843042076 843049109 842983544 842779696 842606127 842530191 842527568 842623472 842720449 842712283 842684090 842681110
2439.3 842681110 842618585 842526436 842487156 842429161 842311323 842216969 842123985 842004061 841927707 841852307 841724455
2461.7 841724455 841635823 841584861 841462195 841335177 841277719 841176331 841020167 840899706 840760112 840570271
2482.1 840570271 840426028 840326190 840195715 840060174 839942634 839797556 839650512 839550138 839439273 839277625
2502.5 839277625 839131296 839015186 838870287 838734448 838634908 838507950 838367045 838242769 838094294 837938905
2522.9 837938905 837807000 837647200 837479591 837367833 837245643 837058127 836903811 836796701 836632490 836445212
2543.3 836445212 836290836 836120427 835942864 835787058 835601449 835413039 835288644 835150182 834937930 834714353
2563.7 834714353 834502697 834271014 834041953 833821952 833558917 833271801 833017766 832741857 832413495 832105339
2584.1 832105339 831797719 831463218 831148386 830815077 830410838 830019236 829667747 829265893 828829944 828418911
2604.5 828418911 827996075 827551782 827118158 826660693 826174378 825714946 825274765 824809074 824321270 823815703
2624.9 823815703 823285162 822782099 822320879 821836352 821335196 820879996 820445120 819987178 819528103 819045305
2645.3 819045305 818537891 818082392 817647934 817166567 816692948 816248178 815781355 815332949 814940333 814504325
2665.7 814504325 814008653 813560545 813115776 812628031 812193096 811793983 811347246 810885131 810423613 809903562
2686.1 809903562 809376419 808912575 808423996 807888448 807387650 806872785 806287348 805713773 805176675 804626703
2706.5 804626703 804080546 803526223 802926004 802320302 801726043 801124990 800550222 799993217 799395323 798781335
2726.9 798781335 798211277 797637343 797024727 796462774 795945108 795354247 794715762 794135749 793599606 793075740
2747.3 793075740 792554736 791960537 791300774 790690482 790117085 789484918 788821101 788164794 787495315 786817670
2767.7 786817670 786121070 785396576 784659028 783905089 783120453 782286048 781426251 780564785 779683530 778797090
2788.1 778797090 777908802 776985824 776026547 775049567 774046540 772989392 771885216 770746946 769564450
2806.4 769564450 768367887 767168462 765930831 764662862 763344646 761970103 760598838 759214640
2822.7 759214640 757744551 756175339 754545212 752831876 750971556 748944283 746687591 744045496
2839.1 744045496 740892172 737171769 732865572 728287101 724220335 721282780 719418585 718204319
2855.4 718204319 717236936 716198385 714880168 713171065 711012065 708492994 705873728 703397393
2871.7 703397393 701183915 699257731 697572887 696058273 694619715 693110466 691449463 689704180
2888 689704180 687917173 686072469 684206128 682276011 680191636 678044021 675909460 673656642 671168387
2906.4 671168387 668393910 665218651 661593020 657729924 654014707 650799692 648275077 646428168
2922.7 646428168 645134151 644344211 644048870 644096375 644453406 645323634 646741509 648567438 650709093
2941 650709093 652955174 655001223 656677306 657907069 658693373 659120262 659309149 659455061 659753084
2959.4 659753084 660269141 660905242 661549091 662173927 662789464 663476884 664270222 665061653 665860593 666781843
2979.8 666781843 667741835 668604672 669417858 670226395 670951843 671458721 671630144 671519518 671219587 670708954
3000.2 670708954 670022488 669229448 668367386 667506278 666656792 665726960 664620578 663313448 661861539
3018.5 661861539 660346627 658805966 657197893 655517757 653847694 652201235 650536478 648774207
3034.9 648774207 646856248 644934833 643101811 641192675 639103174 636909485 634741485 632628381
3051.2 632628381 630492687 628332317 626174212 624007463 621886671 619845688 617844105 615864277
3067.5 615864277 613858223 611790895 609729409 607744277 605807960 603793859 601661980 599506021
3083.8 599506021 597366333 595232844 593102217 590943217 588738084 586515844 584334850 582167029
3100.1 582167029 579878271 577492714 575175822 572913229 570529521 568064332 565692127 563347936
3116.4 563347936 560901582 558290601 555495679 552667975 549967766 547332942 544630826 541868091
3132.8 541868091 539092302 536324263 533571124 530725479 527739406 524762332 521853983 518962502
3149.1 518962502 516081512 513095796 509924889 506747127 503671706 500610232 497507125 494379908
3165.4 494379908 491246641 488122135 485023767 481923252 478791803 475661695 472551703 469443649
3181.7 469443649 466345400 463259727 460173637 457086384 454009950 450949579 447873265 444807440
3198 444807440 441801757 438826114 435874909 432978600 430127591 427317142 424538851 421759337 418971956
3216.4 418971956 416224122 413554966 410921603 408310324 405768961 403269529 400779277 398366302
3232.7 398366302 395994455 393550694 391143858 388921380 386804938 384707928 382635444 380545497
3249 380545497 378466725 376489937 374578118 372638047 370682359 368768245 366898805 365069956 363287568
3267.4 363287568 361554563 359793961 357911140 355955005 354029119 352182925 350380719 348540038
3283.7 348540038 346650094 344766468 342954636 341193438 339365393 337423116 335427165 333454609
3300 333454609 331541032 329701334 327829480 325760812 323560029 321384758 319267750 317178816 315088481
3318.4 315088481 312998414 310946912 308925480 306808919 304565936 302337468 300188214 298124820
3334.7 298124820 296134800 294097215 291944653 289760768 287592560 285486966 283525616 281562477
3351 281562477 279426515 277227998 275156140 273240417 271347463 269428462 267629594 265978724 264285356
3369.3 264285356 262421727 260536700 258877128 257456064 256131679 254794598 253528327 252481222
3385.7 252481222 251682162 251123637 250561982 249711603 248841316 248392209 248231024 247851074 247132093 246507868
3406.1 246507868 246225342 246152207 246153727 246116102 246035695 246053383 246230364 246507406 246880546 247436360 248210877
3428.5 248210877 249046922 249928176 250963479 251933515 252673268 253456712 254544050 255877435 257303178
3446.8 257303178 258748055 260267168 261892051 263622463 265546411 267630607 269618720 271582842
3463.2 271582842 273866773 276361883 278583914 280356526 282131374 284276664 286758065 289324313
3479.5 289324313 291658491 293902636 296375722 298938394 301452547 304044187 306751400 309557348
3495.8 309557348 312363595 315164924 318060160 320886970 323537886 326286286 329329282 332610518
3512.1 332610518 335886121 338988543 342125058 345476359 349053919 352632314 355999947 359369516
3528.4 359369516 362966895 366736919 370667160 374664694 378587037 382647276 386922896 391192853
3544.7 391192853 395296782 399375260 403624952 408058405 412592471 417204916 421973467 426863581
3561.1 426863581 431650013 436356843 441605240 447353810 452888429 458233535 463759601 469530910
3577.4 469530910 475503415 481660157 487822562 493867010 500110865 506700218 513116121 519492805
3593.7 519492805 526238680 533151150 540032327 546952784 553777099 560356081 567137301 574269950
3610 574269950 581377387 588457167 595316529 602126420 609396577 616418481 622714281 628613174 635136902
3628.4 635136902 642537594 649174154 655176044 661142349 666964948 672705889 678307593 683444917
3644.7 683444917 688184142 693393767 699219704 704293966 708560765 713097215 717676044 721616089
3661 721616089 725182354 728618503 731686771 734550357 737645626 740256190 742397130 744768620 746832848
3679.4 746832848 748239219 748802006 747888207 744804502 740067363 736395836 735724151 738395929 743910134
3697.7 743910134 750935614 758099973 764118493 768321693 771114767 773159683 775111139 777119696
3714 777119696 778731883 779967427 781081438 782080948 782950401 783847451 784803510 785634160 786391258
3732.4 786391258 787192047 788124621 789154112 789810061 789866984 790189505 791199386 791770160 791989625
3750.7 791989625 792673588 793548644 794161916 794626355 795244038 795814991 796170175 796442866 796698749 797132730
3771.1 797132730 797728956 798232019 798584580 798861921 799144566 799362302 799568474 799915135 800325096 800677299
3791.5 800677299 800881982 801046729 801302433 801309764 801283538 801654100 801954627 802241206 802685082 802994490
3811.9 802994490 803004146 803025067 803271115 803265572 803344250 803738296 803997457 804128468 804199398 804331481 804543436
3834.4 804543436 804517090 804366112 804509401 804818869 805164933 805515051 805670142 805290163 804466963 804486871
3854.8 804486871 805248857 805664837 805700719 805629373 805690110 805724323 805556178 805536985 805670142 805882752
3875.2 805882752 806089461 806062996 806131840 806286097 806368351 806550801 806519389 806299567 806307673 806433320 806463003
3897.6 806463003 806372166 806178093 806111693 806320786 806540191 806661725 806754827 806719244 806550622 806479275
3918 806479275 806595206 806682467 806688309 806797087 806910574 806835890 806789577 806949019 807108104 807153940 807108760
3940.4 807108760 807057321 807102263 807157576 807174683 807232976 807296753 807328820 807412028 807554781 807665884 807705581
3962.9 807705581 807689846 807709217 807845533 807985187 808059216 808155954 808263183 808355272 808462441 808531404 808523238
3985.3 808523238 808536291 808662832 808871090 809022427 809061170 809121668
3997.5 809121668
##END=$$ End of the data block
