##TITLE=$$ Begin of the data block
##JCAMP-DX=5.00 $$ ACD/SpecManager v 10.08
##SPECTROMETER/DATA SYSTEM=Alpha
##DATE=15 Apr 2014 09:00:42
##DATA TYPE=INFRARED SPECTRUM
##DATA CLASS=XYDATA
##ORIGIN=
##OWNER=
##NPOINTS=1765
##FIRSTX=399.75695801
##LASTX=3997.56933594
##MAXX=3997.56933594
##MINX=399.75695801
##MAXY=0.86310494
##MINY=0.21654174
##XFACTOR=1.0000000000
##YFACTOR=1.000000000000000e-9
##FIRSTY=0.62045223
##DELTAX=2.03957629
##XUNITS=1/CM
##YUNITS=ARBITRARY UNITS
##XYDATA=(X++(Y..Y))
$$ plain form
399.8 620452225 616740108 616003513 616442084 614235103 611401320 611525357 612185597 610138118 607797503
418.1 607797503 608401597 608634531 606243610 604918718 606402755 606579721 603788018 602058113 602815628
436.5 602815628 602460027 600297451 599994302 601889014 601591051 598860502 598425031 600375593 599963665
454.8 599963665 597394705 597239077 598582804 597293556 594653070 594422221 595296025 593653440 591169119
473.2 591169119 591431975 592167497 590196788 588110864 589036942 590164244 588313401 586339176 586940646
491.5 586940646 586969733 584066987 581839859 582643151 582743168 579887688 577941537 578685939 578320682
509.9 578320682 575390816 573615849 574282706 573562443 570353687 568575680 569018185 567926645 564612389
528.3 564612389 562775910 562970817 561783075 558995545 558030307 558742523 557654679 555068076 554411948
$$ packed form
399.8F20452225l712117p36595M38571k206981k833783J24037O60240k047479k340615
418.1F07797503O04094K32934k390921j324892J484037J76966k791703j729905P57515
436.5F02815628l55601k162576l03149J894712k97963k730549m35471J950562m11928
454.8E99963665k568960j55628J343727j289248k640486k30849Q73804j642585k484321
473.2E91169119K62856P35522j970709k085924R26078J127302j850843j974225O01470
491.5E86940646K9087k902746k227128Q03292J00017k855480j946151P44402l65257
509.9E78320682k929866j774967O66857p20263l208756j778007M42505j091540l314256
528.3E64612389j836479J94907j187742k787530r65238P12216j087844k586603o56128
$$ plain form
546.6 554411948 555236340 554016173 551163673 550116241 550478816 548885703 545717180 544112325 543501556
565 543501556 540822685 536759675 534408271 533153713 530025244 525813639 523655355 522609115 519666970
583.3 519666970 515764415 513586581 512047887 508509874 504126787 501538455 499750763 496264637
599.6 496264637 492004246 489623904 488712907 487127036 485457629 485394061 485766441 485057980 485409826
618 485409826 489080250 493931383 497062087 499329388 503106952 507553756 510650456 513543129 518080413
636.3 518080413 522511721 524101198 523903489 525394142 529106975 532246530 533882439 534904003 534516752
654.7 534516752 533746064 537167311 545415580 553078413 556458831 558073521 562591732 567010462 568588257
673.1 568588257 569965839 573436379 577017963 578218222 579074085 581948280 584754229 585169494 585204124
$$ packed form
546.6E54411948Q24392j220167k852500j047432L62575j593113l168523j604855o10769
565E43501556k678871m063010k351404j254558l128469m211605k158284j046240k942145
583.3E19666970l902555k177834j538694l538013m383087k588332j787692l486126
599.6D96264637m260391k380342r10997j585871j669407o3568L72380p08461L51846
618D85409826L670424M851133L130704K267301L777564M446804L096700K892673M537284
636.3E18080413M431308J589477j97709J490653L712833L139555J635909J021564l87251
654.7E34516752p70688L421247Q248269P662833L380418J614690M518211M418730J577795
673.1E68588257J377582L470540L581584J200259Q55863K874195K805949M15265L4630
$$ plain form
691.4 585204124 587183297 589124739 588709235 588171065 590030909 592232525 592421889 592738330 595431626
709.8 595431626 598215401 598801017 599275470 601806879 604454517 605306208 606607795 610282004 613830507
728.1 613830507 614948750 615881741 618809402 621480227 621824563 622234523 624899924 627569199 628092825
746.5 628092825 628760397 631712437 634607852 635349393 636402726 639841259 643108547 644065917 645178854
764.8 645178854 648592770 651737154 652329683 652801752 655294478 657195985 656195164 654939890 655860901
783.2 655860901 656568170 655139863 654618979 657429874 660989165 663208306 666671515 673264205 679909229
801.6 679909229 683968365 687948167 694070637 699435353 701678097 703673482 707765400 710956991
817.9 710956991 710716486 709841311 710583627 709990919 705902338 701481760 699292719 696742535 691821277
$$ packed form
691.4E85204124J979173J941442m15504n38170J859844K201616J89364L16441K693296
709.8E95431626K783775N85616M74453K531409K647638Q51691J301587L674209L548503
728.1F13830507J118243R32991K927661K670825L44336M09960K665401K669275N23626
746.5F28092825O67572K952040K895415P41541J053333L438533L267288R57370J112937
764.8F45178854L413916L144384N92529M72069K492726J901507j000821j255274R21011
783.2F55860901P07269j428307n20884K810895L559291K219141L463209O592690O645024
801.6F79909229M059136L979802O122470N364716K242744J995385M091918L191591
817.9G10956991k40505q75175P42316n92708m088581m420578k189041k550184m921258
$$ plain form
836.2 691821277 687498033 685787499 683679819 679192305 675554931 675560355 677191615 678737521 682893872
854.6 682893872 691418231 700954318 708561659 716333032 726268828 735368252 740886748 745540261
870.9 745540261 751934111 757264793 758970976 760017812 763018906 764952183 763236821 761061430
887.2 761061430 761281490 761201680 758603156 756734669 758348584 760607004 760848463 761666656 765193582
905.6 765193582 768167377 767816782 766823888 767465770 766852081 762690485 758100331 756021559 754324734
923.9 754324734 751242161 749723971 751852334 754516840 754923761 755338550 757929385 760117590 759628534
942.3 759628534 759021044 760537922 761480868 759391189 756577849 755023122 752165318 745875895 738462925
960.6 738462925 731699169 722975433 710273921 695863247 681876004 667183876 651401520 637345731
$$ packed form
836.2F91821277m323244j710534k107680m487514l637374N424J631260J545906M156351
854.6F82893872Q524359R536087P607341P771373R935796R099424N518496M653513
870.9G45540261O393850N330682J706183J046836L001094J933277j715362k175391
887.2G61061430K20060p9810k598524j868487J613915K258420K41459Q18193L526926
905.6G65193582K973795l50595r92894O41882o13689m161596m590154k078772j696825
923.9G54324734l082573j518190K128363K664506M06921M14789K590835K188205m89056
942.3G59628534o07490J516878R42946k089679k813340j554727k857804o289423p412970
960.6G38462925o763756q723736j2701512j4410674j3987243j4692128j5782356j4055789
$$ plain form
977 637345731 626661420 617034018 606970727 598992348 594360411 590207458 584710419 579677284
993.3 579677284 576673746 574389517 571426570 568916857 567872524 566500127 562854230 557747781
1009.6 557747781 552525938 546457052 538784683 531015515 524678171 518898308 512496293 506373465
1025.9 506373465 501619101 497369498 492635578 488305211 485412091 483099610 480199546 477258623
1042.2 477258623 475120395 472979605 469764382 466205388 463743061 462431401 461683214 462015301 463914454
1060.6 463914454 465967089 466117889 464066923 460557461 455402106 448299944 440273672 432435572
1076.9 432435572 424496621 416006416 407848716 401027560 394965708 388537794 381967664 376392573
1093.2 376392573 372224420 369225025 367659897 367891550 369287312 370704889 371897876 373371661
$$ packed form
977F37345731j0684311r627402j0063291p978379m631937m152953n497039n033135
993.3E79677284l003538k284229k962947k509713j044333j372397l645897n106449
1009.6E57747781n221843o068886p672369p769168o337344n779863o402015o122828
1025.9E06373465m754364m249603m733920m330367k893120k312481k900064k940923
1042.2D77258623k138228k140790l215223l558994k462327j311660p48187L32087J899153
1060.6D63914454K052635J50800k050966l509462n155355p102162q026272p838100
1076.9D32435572p938951q490205q157700o821156o061852o427914o570130n575091
1093.2C76392573m168153k999395j565128K31653J395762J417577J192987J473785
$$ plain form
1109.5 373371661 375002295 375913441 375566840 373710513 369594932 363451809 358493209 358056754 361197680
1127.9 361197680 364325881 365185261 364099175 363200635 364093125 366662204 370148361 373708457 376495332
1146.2 376495332 378526360 380639821 383183300 385791659 388660163 392904729 399250567 407421649
1162.6 407421649 417161256 428765893 441963792 455332458 467801183 479725420 491415262
1176.8 491415262 501987040 510808289 518467844 525127351 529505074 530814230 530202627 529109776
1193.1 529109776 527838111 526883066 527834594 531510353 536668599 541837573 546958089 552049458 555980384
1211.5 555980384 558070421 559479475 561354399 563046515 563845396 564714432 566555381 568542123 569888353
1229.9 569888353 571476281 574085414 576806605 578766763 580728173 583418846 585861683 587035298
$$ packed form
1109.5C73371661J630634R11146l46601j856327m115581o143123m958600m36455L140926
1127.9C61197680L128201Q59380j086086q98540Q92490K569079L486157L560096K786875
1146.2C76495332K031028K113461K543479K608359K868504M244566O345838Q171082
1162.6D07421649R739607J1604637J3197899J3368666J2468725J1924237J1689842
1176.8D91415262J0571778Q821249P659555O659507M377723J309156o11603j092851
1193.1E29109776j271665r55045R51528L675759N158246N168974N120516N091369L930926
1211.5E55980384K090037J409054J874924J692116P98881Q69036J840949J986742J346230
1229.9E69888353J587928K609133K721191J960158J961410K690673K442837J173615
$$ plain form
1246.2 587035298 587736309 588952422 589996755 590149999 590455711 592087924 594462991 596775353 599884987
1264.5 599884987 604689896 610246897 615423560 620857120 627421618 634186149 639942706 645428181
1280.8 645428181 651824832 658441246 664111555 669468939 675537884 681393802 685699105 689197659
1297.2 689197659 693214118 697042882 699399948 701105475 703547418 705951810 706990004 707467914
1313.5 707467914 708793700 710351348 710896969 711235404 712766767 714710891 715587795 715951920 717005670
1331.8 717005670 718010366 717753410 717034101 717284620 717940867 717804193 717543840 718359411 719466031
1350.2 719466031 719394684 718738079 718848228 719085038 717889488 715501010 713593960 712304175 710370958
1368.5 710370958 707896352 705788493 703501344 700586081 698290288 697208345 696278632 695220053
$$ packed form
1246.2E87035298P01011J216113J044333J53244L05712J632213K375067K312362L109634
1264.5E99884987M804909N557001N176663N433560O564498O764531N756557N485475
1280.8F45428181O396651O616414N670309N357384O068945N855918M305303L498554
1297.2F89197659M016459L828764K357066J705527K441943K404392J038194M77910
1313.5G07467914J325786J557648N45621L38435J531363J944124Q76904L64125J053750
1331.8G17005670J004696k56956p19309K50519O56247j36674k60353Q15571J106620
1350.2G19466031p1347o56605J10149K36810j195550k388478j907050j289785j933217
1368.5G10370958k474606k107859k287149k915263k295793j081943r29713j058579
$$ plain form
1384.9 695220053 694978535 695642889 696038246 695104539 693126619 691409290 689535081 686380386 682649136
1403.2 682649136 679497540 676815987 673682928 670438290 668425798 667557478 666339219 664366305
1419.5 664366305 663225710 662972152 662165344 660864234 660140038 659932256 659474373 658935010 659271121
1437.9 659271121 660297632 660948217 661224246 662266433 664099276 665366471 666080713 667891979 672206640
1456.2 672206640 677752256 682306707 687327862 693912029 701033533 708791435 719322741 732589006
1472.6 732589006 743319750 749755263 754920125 759731054 762974203 764458597 765688419 766822100
1488.9 766822100 766205490 764245629 762578309 760869384 757791102 753932714 750887930 748091161
1505.2 748091161 742762864 736280084 731256187 727191031 723034859 718683422 715398371 712849379
$$ packed form
1384.9F95220053k41518O64354L95357r33707j977920j717329j874209l154695l731250
1403.2F82649136l151596k681553l133059l244638k012492q68320j218259j972914
1419.5F64366305j140595k53558q06808j301110p24196k07782m57883n39363L36111
1437.9F59271121J026511O50585K76029J042187J832843J267195P14242J811266M314661
1456.2F72206640N545616M554451N021155O584167P121504P757902J0531306J3266265
1472.6G32589006J0730744O435513N164862M810929L243149J484394J229822J133681
1488.9G66822100o16610j959861j667320j708925l078282l858388l044784k796769
1505.2G48091161n328297o482780n023897m065156m156172m351437l285051k548992
$$ plain form
1521.5 712849379 709646225 705977738 702808738 700705349 698509395 695291638 692804635 691839039
1537.8 691839039 690402448 687730551 686070263 685629010 685283422 684711576 684914052 686315179 687785208
1556.2 687785208 688067853 687301099 686755240 685714722 683642089 681068361 678079545 674460649 669635057
1574.5 669635057 663188279 656966090 650810480 643462658 635860443 628660858 621031284 612551808
1590.9 612551808 604203284 596454918 588657439 580468476 572505414 565175295 557895303 550146222
1607.2 550146222 542315364 535045505 528154552 520479798 511931181 505192041 499525517 492917776
1623.5 492917776 486476213 481162667 476462394 472500563 469448239 467108637 465684712 465092570
1639.8 465092570 465463787 467130601 470112652 473484755 476523757 480997980 487525195 492655188
$$ packed form
1521.5G12849379l203154l668487l169000k103389k195954l217757k487003r65596
1537.8F91839039j436591k671897j660288m41253l45588n71846K02476J401127J470029
1556.2F87785208K82645p66754n45859j040518k072633k573728k988816l618896m825592
1574.5F69635057o446778o222189o155610p347822p602215p199585p629574q479476
1590.9F12551808q348524p748366p797479q188963p963062p330119p279992p749081
1607.2E50146222p830858p269859o890953p674754q548617o739140n666524o607741
1623.5D92917776o441563n313546m700273l961831l052324k339602j423925n92142
1639.8D65092570L71217J666814K982051L372103L039002M474223O527215N129993
$$ plain form
1656.1 492655188 497376978 503602564 511371851 519284129 526530385 534960091 544865131 553796530
1672.4 553796530 562838972 573183239 583272696 592789173 603164613 616063535 627955914 637639761
1688.8 637639761 647249758 656908810 667893767 679453969 690301478 702187002 712380588 720429361
1705.1 720429361 727865338 734827936 741642058 747702777 752944767 758533061 763801873 767499149
1721.4 767499149 770492733 774056852 778129280 781733155 784573138 787824988 791226685 793411672
1737.7 793411672 794971466 797121048 800199866 803391337 806545198 810597539 815297723 818837941
1754 818837941 821194768 823628485 826470733 828708172 829879224 831351280 833660066 835497499 836157322
1772.4 836157322 837003112 838649988 839988887 840498865 841291070 842913091 844147205 844567418 845364928
$$ packed form
1656.1D92655188M721790O225586P769287P912278P246256Q429706R905040Q931399
1672.4E53796530R042442J0344267J0089457R516477J0375440J2898922J1892379R683847
1688.8F37639761R609997R659052J0984957J1560202J0847509J1885524J0193586Q048773
1705.1G20429361P435977O962598O814122O060719N241990N588294N268812L697276
1721.4G67499149K993584L564119M072428L603875K839983L251850L401697K184987
1737.7G93411672J559794K149582L078818L191471L153861M052341M700184L540218
1754H18837941K356827K433717K842248K237439J171052J472056K308786J837433O59823
1772.4H36157322Q45790J646876J338899N09978P92205J622021J234114M20213P97510
$$ plain form
1790.7 845364928 846966207 847951412 848024666 848503888 849853635 850713789 850575387 850791931 852007568
1809.1 852007568 852940798 852784097 852846980 853895366 854735315 854634762 854748905 855831683 856737852
1827.4 856737852 856546521 856324732 857103884 857815802 857525289 857342482 858260870 859154820 858861625 858561277
1847.8 858561277 859260499 859947085 859618962 859265029 859963179 860763550 860528469 860187232 860906720 861708701
1868.2 861708701 861245155 860651970 861209512 861973882 861722529 861220777 861672699 862370193 862169683 861706674
1888.6 861706674 862103283 862752020 862478018 861866534 862190425 862872779 862624466 862029552 862379193 863095105
1909 863095105 862844110 862173378 862424433 863104939 862846076 862184405 862417042 863018453 862743258 862057626
1929.4 862057626 862227499 862811565 862499297 861749172 861905932 862575054 862311542 861434639 861367881 861880243
$$ packed form
1790.7H45364928J601279R85205P3254M79222J349747Q60154j38402K16544J215637
1809.1H52007568R33230j56701O2883J048386Q39949j00553J14143J082778R06169
1827.4H56737852j91331k21789P79152P11918k90513j82807R18388Q93950k93195l00348
1847.8H58561277O99222O86586l28123l53933O98150Q00371k35081l41237P19488Q01981
1868.2H61708701m63546n93185N57542P64370k51353n01752M51922O97494k00510m63009
1888.6H61706674L96609O48737k74002o11484L23891O82354k48313n94914L49641P15912
1909H63095105k50995o70732K51055O80506k58863o61671K32637O01411k75195o85632
1929.4H62057626J69873N84066l12268p50125J56760O69122k63512q76903o6758N12362
$$ plain form
1949.8 861880243 861642897 860825479 860743582 861236632 860990703 860161662 860086501 860614598 860356688 859452724
1970.2 859452724 859302700 859837234 859679461 858823836 858613491 859080613 858928740 858145893 858002603 858518124
1990.6 858518124 858366728 857473850 857170641 857576907 857420921 856553555 856278062 856746554 856619298 855710506
2011 855710506 855348468 855759203 855646789 854755700 854347765 854731143 854664981 853805542 853394926 853785694
2031.4 853785694 853741705 852892756 852480292 852931380 852988124 852140963 851635754 851986110 851989865 851150632
2051.8 851150632 850686789 851102769 851172268 850373685 849893451 850300968 850459635 849767685 849344254 849835038
2072.2 849835038 850112915 849484205 849061430 849549949 849858522 849253714 848803222 849270761 849637985 849115431
2092.6 849115431 848668814 849098325 849478185 848994017 848572075 849053681 849519730 849078119 848591328 848974109
$$ packed form
1949.8H61880243k37346q17418q1897M93050k45929q29041p5161N28097k57910r03964
1970.2H59452724j50024N34534j57773q55625k10345M67122j51873p82847j43290N15521
1990.6H58518124j51396q92878l03209M06266j55986q67366k75493M68492j27256r08792
2011H55710506l62038M10735j12414q91089m07935L83378o6162q59439m10616L90768
2031.4H53785694m3989q48949m12464M51088N6744q47161n05209L50356L755q39233
2051.8H51150632m63843M15980O9499p98583m80234M07517J58667o91950m23431M90784
2072.2H49835038K77877o28710m22775M88519L08573o04808m50492M67539L67224n22554
2092.6H49115431m46617M29511L79860m84168m21942M81606M66049m41611m86791L82781
$$ plain form
2113 848974109 849388957 848951221 848539174 849057376 849634469 849321842 848911047 849347353 849884510 849563122
2133.4 849563122 849117637 849556625 850184262 849944830 849468946 849825978 850448430 850265145 849822640 850195527
2153.8 850195527 850826144 850656152 850221217 850581229 851253211 851148963 850684166 850972652 851655722 851626635
2174.2 851626635 851213992 851486862 852108121 852017045 851559937 851812363 852453709 852390468 851898849 852081954
2194.6 852081954 852688968 852616251 852091014 852231085 852854967 852846086 852353513 852458954 853027403 853000998
2215 853000998 852490962 852561891 853137493 853153229 852658987 852670789 853147030 853104293 852562308 852534831 853055656
2237.4 853055656 853096128 852560937 852435887 852840602 852827132 852282286 852175415 852639735 852689207 852163255
2257.8 852163255 852020264 852437496 852484226 851977825 851879776 852426887 852638483 852228284 852159560 852709413
$$ packed form
2113H48974109M14848m37736m12047N18202N77093l12627m10795M36306N37157l21388
2133.4H49563122m45485M38988O27637k39432m75884L57032O22452j83285m42505L72887
2153.8H50195527O30617j69992m34935L60012O71982j04248m64797K88486O83070k9087
2174.2H51626635m12643K72870O21259r1076m57108K52426O41346o3241m91619J83105
2194.6H52081954O07014p2717n25237J40071O23882q881m92573J05441N68449k6405
2215H53000998n10036P0929N75602J5736m94242J1802M76241m2737n41985k7477N20825
2237.4H53055656M0472n35191j25050M04715j3470n44846j06871M64320M9472n25952
2257.8H52163255j42991M17232M6730n06401r8049N47111K11596m10199o8724N49853
$$ plain form
2278.2 852709413 852930367 852529526 852401614 852861345 853055120 852612138 852370024 852753162 852930188 852480710
2298.6 852480710 852219999 852572858 852707624 852141500 851684928 851857901 851934075 851391792 850849867 850788414
2319 850788414 850632370 849944770 849418581 849526286 849550366 848988056 848604083 848915935 849173605 848839879
2339.4 848839879 848656714 849338651 850418448 851084769 851132035 850725472 849892437 848606467 847593606
2357.7 847593606 847623169 848125100 848369837 848911464 850270689 851682067 852534175 853436232 854869664
2376.1 854869664 856215298 856908977 857417941 858275115 859046876 859146476 858999789 859327734 859790981 859716952
2396.5 859716952 859471083 859717786 860144734 860102236 859851599 860036492 860426724 860370696 860093951 860256195
2416.9 860256195 860618114 860517204 860188186 860288501 860629439 860567033 860256135 860338211 860650003 860561132
$$ packed form
2278.2H52709413K20954m00841j27912M59731J93775m42982k42114L83138J77026m49478
2298.6H52480710k60711L52859J34766n66124m56572J72973P6174n42283n41925o1453
2319H50788414j56044o87600n26189J07705K4080n62310l83973L11852K57670l33726
2339.4H48839879j83165O81937J079797O66321M7266m06563q33035j285970j012861
2357.7H47593606K9563N01931K44737N41627J359225J411378Q52108R02057J433432
2376.1H54869664J345634O93679N08964Q57174P71761R9600j46687L27945M63247p4029
2396.5H59716952k45869K46703M26948m2498k50637J84893L90232n6028k76745J62244
2416.9H60256195L61919j00910l29018J00315L40938o2406l10898Q2076L11792q8871
$$ plain form
2437.3 860561132 860250533 860347390 860680342 860614717 860285580 860304594 860581875 860540628 860270321 860337734
2457.7 860337734 860622764 860526085 860175848 860189319 860466421 860406458 860069931 860047877 860284507 860183835
2478.1 860183835 859799206 859738767 860002697 859992564 859673917 859601974 859790444 859696686 859334409 859287143
2498.5 859287143 859561384 859554708 859206498 859109104 859341562 859299600 858889639 858700693 858859241 858849764 858557522
2520.9 858557522 858450174 858612418 858566701 858226120 858091176 858260632 858239353 857914209 857760966 857899845
2541.3 857899845 857830942 857427835 857233822 857431710 857508838 857220590 857024252 857145667 857101023 856677890
2561.7 856677890 856373250 856433988 856439769 856126845 855849385 855839014 855720282 855268657 854905903 854921758
2582.1 854921758 854887664 854456365 854027212 853927076 853786111 853335321 852932394 852825165 852664173 852183342
$$ packed form
2437.3H60561132l10599R6857L32952o5625l29137J9014K77281m1247k70307O7413
2457.7H60337734K85030r6679l50237J3471K77102n9963l36527k2054K36630j00672
2478.1H60183835l84629o0439K63930j0133l18647p1943J88470r3758l62277m7266
2498.5H59287143K74241o676l48210r7394K32458m1962m09961j88946J58548r477k92242
2520.9H58557522j07348J62244m5717l40581j34944J69456k1279l25144j53243J38879
2541.3H57899845o8903m03107j94013J97888P7128k88248j96338J21415m4644m23133
2561.7H56677890l04640O0738N781l12924k77460j0371j18732m51625l62754J5855
2582.1H54921758l4094m31299m29153j00136j40965m50790m02927j07229j60992m80831
$$ plain form
2602.5 852183342 851744592 851627111 851436555 850882649 850362659 850198328 850037873 849551976 849039912 848793328
2622.9 848793328 848512530 847920656 847370625 847208202 847069025 846562922 846023560 845825374 845643520 845090508
2643.3 845090508 844482839 844245076 844099104 843611181 843021154 842726648 842481136 841914535 841312528 841088295
2663.7 841088295 840978682 840546310 839987338 839682400 839437008 838946581 838431597 838192344 838033259 837592602
2684.1 837592602 837019622 836696506 836480677 835978627 835350275 835048556 834919691 834477246 833834112 833416998
2704.5 833416998 833088398 832447946 831665516 831199765 830921173 830365241 829626143 829106212 828716934 828096330
2724.8 828096330 827338696 826849937 826585174 826152861 825596094 825253367 825027883 824552357 823894799 823460937
2745.2 823460937 823235273 822784543 822092295 821563005 821192443 820578933 819747329 819148660 818769813 818154275
$$ packed form
2602.5H52183342m38750j17481j90556n53906n19990j64331j60455m85897n12064k46584
2622.9H48793328k80798n91874n50031j62423j39177n06103n39362j98186j81854n53012
2643.3H45090508o07669k37763j45972m87923n90027k94506k45512n66601o02007k24233
2663.7H41088295j09613m32372n58972l04938k45392m90427n14984k39253j59085m40657
2684.1H37592602n72980l23116k15829n02050o28352l01719j28865m42445o43134m17114
2704.5H33416998l28600o40452p82430m65751k78592n55932p39098n19931l89278o20604
2724.8H28096330p57634m88759k64763m32313n56767l42727k25484m75526o57558m33862
2745.2H23460937k25664m50730o92248n29290l70562o13510q31604n98669l78847o15538
$$ plain form
2765.6 818154275 817321658 816671431 816165268 815418363 814424992 813587785 812958002 812135160 811051667
2784 811051667 810091376 809345543 808434129 807254553 806194484 805356026 804346800 803029656 801737845
2802.3 801737845 800609529 799360275 797897756 796511114 795222580 793698430 791888714 790087342
2818.7 790087342 788329661 786284745 783855736 781306624 778648734 775446236 771403849 766611576
2835 766611576 760925412 753741264 744744658 734152019 722025156 708437562 694629312 683220208
2851.3 683220208 676734447 675864160 679351211 685056984 690725863 694561362 695911586 695394933 694268227
2869.7 694268227 693717241 694323778 695810676 697297156 697823465 696906984 694711149 691557288 687532306
2888 687532306 682785511 677759111 672750175 667634308 662253201 656724811 651080191 644939423 637890339
$$ packed form
2765.6H18154275q32617o50227n06163p46905r93371q37207o29783q22842j083493
2784H11051667r60291p45833r11414j179576j060069q38458j009226j317144j291811
2802.3H01737845j128316j249254j462519j386642j288534j524150j809716j801372
2818.7G90087342j757681k044916k429009k549112k657890l202498m042387m792273
2835G66611576n686164p184148q996606j0592639j2126863j3587594j3808250j1409104
2851.3F83220208o485761q70287L487051N705773N668879L835499J350224n16653j126706
2869.7F94268227n50986O06537J486898J486480N26309r16481k195835l153861m024982
2888F87532306m746795n026400n008936n115867n381107n528390n644620o140768p049084
$$ plain form
2906.4 637890339 629833221 620605409 609673738 596774995 582578361 568446517 556020260 547105551
2922.7 547105551 543165863 544527769 550191820 558553219 568446994 579236269 590157807 600277066
2939 600277066 608944297 615704954 619983137 621500850 620837092 619196773 617747426 617419302 618964791
2957.4 618964791 622624815 627968013 634409606 641621053 649251759 656654179 663229764 668832004
2973.7 668832004 673593938 677575648 680737019 683169067 685132205 686739147 687913775 688789845
2990 688789845 689548016 689931035 689683795 688952029 688011825 686984539 685759723 684409201 683276474
3008.3 683276474 682379961 681372941 680144250 678856671 677505910 675966561 674348116 672806859
3024.7 672806859 671225727 669457257 667571366 665732861 663842082 661686838 659469783 657433987
$$ packed form
2906.4F37890339q057118r227812j0931671j2898743j4196634j4131844j2426257q914709
2922.7E47105551l939688J361906N664051Q361399R893775J0789275J0921538J0119259
2939F00277066Q667231O760657M278183J517713o63758j640319j449347l28124J545489
2957.4F18964791L660024N343198O441593P211447P630706P402420O575585N602240
2973.7F68832004M761934L981710L161371K432048J963138J606942J174628Q76070
2990F88789845P58171L83019k47240p31766r40204j027286j224816j350522j132727
3008.3F83276474q96513j007020j228691j287579j350761j539349j618445j541257
3024.7F72806859j581132j768470j885891j838505j890779k155244k217055k035796
$$ plain form
3041 657433987 655362725 653006673 650473475 648013890 645620883 643094003 640503585 637997091 635521412
3059.3 635521412 633032441 630569577 628211856 625881433 623364866 620732725 618291259 616096258
3075.6 616096258 613890529 611467659 608914852 606377125 603767574 601097286 598547816 596030653
3092 596030653 593355298 590598643 587917268 585254192 582418621 579452753 576632500 573941171 571022987
3110.3 571022987 567916632 565002620 562199116 559146821 555780828 552338481 549030960 545773625
3126.6 545773625 542444706 539067745 535663605 532250345 528865576 525501430 522047997 518429101
3143 518429101 514714003 511038065 507504165 504007399 500308096 496416628 492558867 488779306 484982342
3161.3 484982342 481167346 477351844 473471999 469528824 465633303 461810052 457961917 454033703
$$ packed form
3041F57433987k071262k356052k533198k459585k393007k526880k590418k506494k475679
3059.3F35521412k488971k462864k357721k330423k516567k632141k441466k195001
3075.6F16096258k205729k422870k552807k537727k609551k670288k549470k517163
3092E96030653k675355k756655k681375k663076k835571k965868k820253k691329k918184
3110.3E71022987l106355k914012k803504l052295l365993l442347l307521l257335
3126.6E45773625l328919l376961l404140l413260l384769l364146l453433l618896
3143E18429101l715098l675938l533900l496766l699303l891468l857761l779561l796964
3161.3D84982342l814996l815502l879845l943175l895521l823251l848135l928214
$$ plain form
3177.6 454033703 450117916 446271122 442409217 438507318 434655935 430900842 427174091 423405647
3193.9 423405647 419613630 415874004 412218720 408623397 405103654 401704282 398361653 394988239
3210.3 394988239 391621292 388304949 384995371 381667942 378419578 375344515 372349620 369301021
3226.6 369301021 366265148 363383919 360629886 357817322 354944438 352203727 349595279 347039551
3242.9 347039551 344587803 342219442 339797646 337362647 335053682 332847893 330661297 328451067
3259.2 328451067 326222211 324025482 321880430 319773704 317724794 315683782 313554764 311348796
3275.5 311348796 309144229 307006836 304914325 302798808 300673038 298585624 296585828 294631839
3291.8 294631839 292558551 290361047 288166612 286020398 283954382 281988174 280023128 277923107
$$ packed form
3177.6D54033703l915787l846794l861905l901899l851383l755093l726751l768444
3193.9D23405647l792017l739626l655284l595323l519743l399372l342629l373414
3210.3C94988239l366947l316343l309578l327429l248364l075063k994895l048599
3226.6C69301021l035873k881229k754033k812564k872884k740711k608448k555728
3242.9C47039551k451748k368361k421796k434999k308965k205789k186596k210230
3259.2C28451067k228856k196729k145052k106726k048910k041012k129018k205968
3275.5C11348796k204567k137393k092511k115517k125770k087414j999796j953989
3291.8B94631839k073288k197504k194435k146214k066016j966208j965046k100021
$$ plain form
3308.2 277923107 275684029 273414731 271216929 269104689 267028630 265003979 263060838 261127502
3324.5 261127502 259106010 257028937 255019039 253101021 251290053 249602586 247893363 246062785
3340.8 246062785 244216606 242412433 240686685 239135787 237598807 235872835 234109804 232523546
3357.1 232523546 231097952 229723811 228391811 227197617 226098582 224906892 223556563 222239271
3373.4 222239271 221182108 220319897 219504461 218713149 218040466 217565611 217305049 217277154 217241466 216912210
3393.8 216912210 216541737 216595739 216952071 217031792 216754481 216692075 217039675 217481151 217856184 218149289
3414.2 218149289 218430296 218911335 219620913 220405549 221295416 222353324 223510563 224661067 225915715
3432.6 225915715 227384478 228766054 229876131 231003627 232390538 234011278 235747933 237475410
$$ packed form
3308.2B77923107k239078k269298k197802k112240k076059k024651j943141j933336
3324.5B61127502k021492k077073k009898j918018j810968j687467j709223j830578
3340.8B46062785j846179j804173j725748j550898j536980j725972j763031j586258
3357.1B32523546j425594j374141j332000j194194j099035j191690j350329j317292
3373.4B22239271j057163q62211q15436p91312o72683m74855k60562k7895l5688l29256
3393.8B16912210l70473N4002L56332P9721k77311o2406L47600M41476L75033K93105
3414.2B18149289K81007M81039P09578P84636Q89867J057908J157239J150504J254648
3432.6B25915715J468763J381576J110077J127496J386911J620740J736655J727477
$$ plain form
3448.9 237475410 239293531 241304025 243432328 245667845 247994110 250254154 252510399 255081296
3465.2 255081296 257912785 260531873 262741745 264933676 267448157 270309091 273263931 275967032
3481.5 275967032 278600544 281548381 284660518 287668675 290673614 293842763 297166795 300442934
3497.8 300442934 303692877 307093352 310445786 313579649 316810995 320388883 324199438 327986419
3514.2 327986419 331616044 335286409 339228660 343471766 347642541 351512879 355427265 359563410
3530.5 359563410 363838702 368330956 372950196 377451986 382040501 386942416 391978711 396762222
3546.8 396762222 401294976 406018764 411056608 416166365 421326667 426663935 432062000 437344432
3563.1 437344432 442755103 448750407 454905450 460696965 466430932 472442389 478694946 485080421
$$ packed form
3448.9B37475410J818121K010494K128303K235517K326265K260044K256245K570897
3465.2B55081296K831489K619088K209872K191931K514481K860934K954840K703101
3481.5B75967032K633512K947837L112137L008157L004939L169149L324032L276139
3497.8C00442934L249943L400475L352434L133863L231346L577888L810555L786981
3514.2C27986419L629625L670365L942251M243106M170775L870338L914386M136145
3530.5C59563410M275292M492254M619240M501790M588515M901915N036295M783511
3546.8C96762222M532754M723788N037844N109757N160302N337268N398065N282432
3563.1D37344432N410671N995304O155043N791515N733967O011457O252557O385475
$$ plain form
3579.4 485080421 491587847 498194963 504958868 511894584 518721044 525307000 532089472 539233267
3595.7 539233267 546472311 553735912 561034858 568233192 575380564 582828224 590413749 597862720
3612.1 597862720 605214119 612371922 619776428 627554476 634765506 641318798 647898316 655273020
3628.4 655273020 662891090 669569194 675934255 682367980 688687921 694880962 700866878 706593752
3644.7 706593752 712333798 718390644 724105120 728801787 733176649 737874210 742436349 746556520
3661 746556520 750392258 754055679 757619441 761184037 764568865 767410755 770004690 772554934 774920523
3679.4 774920523 777249277 779694259 782214940 784729838 786901891 788562059 790079594 791616380
3695.7 791616380 793189943 794810116 796317101 797591627 798813522 800106525 801313996 802263498
$$ packed form
3579.4D85080421O507426O607116O763905O935716O826460O585956O782472P143795
3595.7E39233267P239044P263601P298946P198334P147372P447660P585525P448971
3612.1E97862720P351399P157803P404506P778048P211030O553292O579518P374704
3628.4F55273020P618070O678104O365061O433725O319941O193041N985916N726874
3644.7G06593752N740046O056846N714476M696667M374862M697561M562139M120171
3661G46556520L835738L663421L563762L564596L384828K841890K593935K550244K365589
3679.4G74920523K328754K444982K520681K514898K172053J660168J517535J536786
3695.7G91616380J573563J620173J506985J274526J221895J293003J207471R49502
$$ plain form
3712 802263498 803135276 804083109 805057704 805951238 806657612 807274163 807925403 808646739 809472084 810442030
3732.4 810442030 811351895 811951458 812428474 812988400 813493788 813847840 814331114 814899921 815291584 815607369
3752.8 815607369 816093028 816631138 816967726 817151725 817456961 817971647 818505287 818839788 819014609 819218338
3773.2 819218338 819557250 820016026 820393026 820594788 820795655 821001172 821151435 821353137 821670711 822029352
3793.6 822029352 822324574 822580278 822834849 823059440 823304296 823448956 823447287 823531449 823759377 824018538
3814 824018538 824315667 824677706 824804187 824701488 824737608 824807405 824807227 824894905 825185120 825634480 825899065
3836.4 825899065 825819075 825734556 825705945 825668931 825791776 826127231 826421738 826203704 825759053 825828195
3856.8 825828195 826063871 826174498 826278150 826496243 826759517 826821089 826707721 826646686 826645494 826715112
$$ packed form
3712H02263498Q71778R47833R74595Q93534P06374O16551O51240P21336Q25345R69946
3732.4H10442030R09865N99563M77016N59926N05388L54052M83274N68807L91663L15785
3752.8H15607369M85659N38110L36588J83999L05236N14686N33640L34501J74821K03729
3773.2H19218338L38912M58776L77000K01762K00867K05517J50263K01702L17574L58641
3793.6H22029352K95222K55704K54571K24591K44856J44660j669Q4162K27928K59161
3814H24018538K97129L62039J26481j02699L6120O9797j78Q7678K90215M49360K64585
3836.4H25899065p9990q4519k8611l7014J22845L35455K94507k18034m44651O9142
3856.8H25828195K35676J10627J03652K18093K63274O1572j13368o1035j192O9618
$$ plain form
3877.2 826715112 826820910 826963305 827118278 827102005 826997757 826930523 826772869 826675594 826875448 827246010
3897.6 827246010 827514112 827457666 827142894 826863229 826743662 826710105 826749623 826903403 827068985 827106714
3918 827106714 827087045 827102244 827036202 826856434 826792181 826955199 827124894 827094853 826997042 827038288 827181220
3940.4 827181220 827214301 827181518 827314079 827508211 827501059 827366471 827363193 827461064 827476859 827478826 827610314
3962.9 827610314 827822983 827984333 828032732 827993929 827930868 827889264 827902436 828030944 828256309 828432381
3983.2 828432381 828449130 828418970 828510702 828620136 828646004 828700185 828832865
3997.5 828832865
$$ packed form
3877.2H26715112J05798J42395J54973j6273j04248o7234j57654r7275J99854L70562
3897.6H27246010K68102n6446l14772k79665j19567l3557L9518J53780J65582L7729
3918H27106714j9669J5199o6042j79768o4253J63018J69695l0041r7811M1246J42932
3940.4H27181220L3081l2783J32561J94132p152j34588l278R7871J5795J967J31488
3962.9H27610314K12669J61350M8399l8803o3061m1604J3172J28508K25365J76072
3983.2H28432381J6749l0160R1732J09434K5868N4181J32680
3997.5H28832865
##END=$$ End of the data block
