##TITLE=$$ Begin of the data block
##JCAMP-DX=5.00 $$ ACD/SpecManager v 10.08
##SPECTROMETER/DATA SYSTEM=Alpha
##DATE=15 Apr 2014 09:00:42
##DATA TYPE=INFRARED SPECTRUM
##DATA CLASS=XYDATA
##ORIGIN=
##OWNER=
##NPOINTS=1765
##FIRSTX=399.75695801
##LASTX=3997.56933594
##MAXX=3997.56933594
##MINX=399.75695801
##MAXY=0.86339116
##MINY=0.21656355
##XFACTOR=1.0000000000
##YFACTOR=1.000000000000000e-9
##FIRSTY=0.62546796
##DELTAX=2.03957629
##XUNITS=1/CM
##YUNITS=ARBITRARY UNITS
##XYDATA=(X++(Y..Y))
399.8F25467956l928959j071334M9531k509534l007174L33190J008749j850724k044976
418.1F12446725P77960J62840k402306j540124R55224m42445l298879k049684O17623
436.5F05226934l30210j982867r7037J738072o75917k806544l14594J760185p80880
454.8F01737142k516449J17719J248718j604438k597690L49283J392842j632393k791106
473.2E93703628l0697N77867k166986k379716Q07226J208186j879930k154649N63443
491.5E88248372L21150k616286k347947M81844r0062k855659j811683R72033j98901
509.9E80102861l058016k036512N83350o00874l106356j842856K97248j289665l478885
528.3E65570295j866400K34544j110792k813518j133859P20441q17120k419591p05242
$$ y = [625467956, 621538997, 620467663, 620517194, 618007660, 615000486, 615333676, 616342425, 614491701, 612446725, 613224685, 613387525, 610985219, 609445095, 610400319, 609957874, 606658995, 604609311, 605226934, 604896724, 602913857, 602816820, 604554892, 603878975, 601072431, 600757837, 602518022, 601737142, 599220693, 599338412, 600587130, 598982692, 596385002, 596734285, 598127127, 596494734, 593703628, 593672931, 594250798, 592083812, 589704096, 590511322, 591719508, 589839578, 587684929, 588248372, 588569522, 585953236, 583605289, 584087133, 583997071, 581141412, 579329729, 580301762, 580102861, 577044845, 575008333, 575591683, 574990809, 571884453, 570041597, 570338845, 569049180, 565570295, 563703895, 563938439, 562827647, 560014129, 558880270, 559600711, 558783591, 556364000, 555658758]
546.6E55658758P69257j333654k999305j033545M71592j539052l236711j703322o56902
565E44397116k760113m133939k328277j213372k982378l948807k149284j304448l012776
583.3E20563722l771901k143801j573264l619194m525900k637923j758039l515631
599.6D97018069m312813k394915r41843j544684j564950j08152K81602o68883M73201
618D86236632L812224M858106K970815K179205L793359M442215L059566K880394M625082
636.3E18857598M533172J591980j74164J551807L601729K932489J593113J096428l57688
654.7E35226464p83026L365576Q216203P782459L534257J701653M538536M396856J591206
673.1E69570184J383364L398061L493070J154483Q02993K829791K830684M85480O8724
$$ y = [555658758, 556428015, 555094361, 552095056, 551061511, 551533103, 549994051, 546757340, 545054018, 544397116, 541637003, 537503064, 535174787, 533961415, 530979037, 527030230, 524880946, 523576498, 520563722, 516791821, 514648020, 513074756, 509455562, 504929662, 502291739, 500533700, 497018069, 492705256, 490310341, 489368498, 487823814, 486258864, 486150712, 486432314, 485763431, 486236632, 490048856, 494906962, 497877777, 500056982, 503850341, 508292556, 511352122, 514232516, 518857598, 523390770, 524982750, 524808586, 526360393, 529962122, 532894611, 534487724, 535584152, 535226464, 534443438, 537809014, 546025217, 553807676, 557341933, 559043586, 563582122, 567978978, 569570184, 570953548, 574351609, 577844679, 578999162, 579802155, 582631946, 585462630, 585948110, 586016834]
691.4E86016834J942456J901090m35770n82099J796961K167940J98841L18170K644360
709.8E95968783K720296N37992M61519K592563K724946Q85904J333177L697276L513217
728.1F14435673J085222R76681K996743K699375L13997L45469K633572K711653N70178
746.5F28768563O63162K982437K970338P17163Q91984L307104L229975R29714J137733
764.8F45598173L526807L221929O25789N73099K544105J788735j124322j291692R20415
783.2F56383038P07030j408875m75288K880991L631115K176106L292203O457567O621778
801.6F80265665M128933M096150O172717N319893K187789K011418M140973L183902
817.9G11507440k80142q91090P55906n82635m064441m331410k113044k534985m904151
$$ y = [586016834, 587959290, 589860380, 589424610, 588842511, 590639472, 592807412, 593006253, 593324423, 595968783, 598689079, 599227071, 599688590, 602281153, 605006099, 605892003, 607225180, 610922456, 614435673, 615520895, 616497576, 619494319, 622193694, 622507691, 622853160, 625486732, 628198385, 628768563, 629431725, 632414162, 635384500, 636101663, 636993647, 640300751, 643530726, 644460440, 645598173, 649124980, 652346909, 652972698, 653545797, 656089902, 657878637, 656754315, 655462623, 656383038, 657090068, 655681193, 655205905, 658086896, 661718011, 663894117, 667186320, 673643887, 680265665, 684394598, 688490748, 694663465, 699983358, 702171147, 704182565, 708323538, 711507440, 711227298, 710336208, 711092114, 710509479, 706445038, 702113628, 700000584, 697465599, 692561448]
836.2F92561448m300237j713932k143979m525423l647506J5974J627684J517594M162371
854.6F83553994Q567869R521723P516980P735968R995460R160877N541980M613698
870.9G46208549O330668N317033J697600J016676L004491J968801j685917k170443
887.2G61687458K09152p8857k600014j887560J566470K208829K32637P93636L490686
905.6G65622437L005385l11851r99987O33478o34492m193186m626990k116024j677990
923.9G54700780l044844j539230K080977K656519M39287M30405K568781K174556m85062
942.3G59982169o28293J465440R14216k079666k810359j570582k867937o266296p380784
960.6G38757908o744504q692324j2690842j4427960j3969242j4637590j5740275j4051736
$$ y = [692561448, 688261211, 686547279, 684403300, 679877877, 676230371, 676246345, 677874029, 679391623, 683553994, 692121863, 701643586, 709160566, 716896534, 726891994, 736052871, 741594851, 746208549, 752539217, 757856250, 759553850, 760570526, 763575017, 765543818, 763857901, 761687458, 761896610, 761817753, 759217739, 757330179, 758896649, 761105478, 761338115, 762131751, 765622437, 768627822, 768315971, 767315984, 767949462, 767314970, 763121784, 758494794, 756378770, 754700780, 751655936, 750116706, 752197683, 754854202, 755293489, 755723894, 758292675, 760467231, 759982169, 759353876, 760819316, 761733532, 759653866, 756843507, 755272925, 752404988, 746138692, 738757908, 732013404, 723321080, 710630238, 696202278, 682233036, 667595446, 651855171, 637803435]
977F37803435j0721504r680629j0070563p920920m595220m174471n535245n090535
993.3E80014348l070593k336085l008127k536535j032114j356960l645777n103350
1009.6E57924807n227864o085753p677794p746815o322563n783618o384491o098986
1025.9E06596923m716694m174144m688978m353851k911538k303034k896517k928436
1042.2D77623731k111852k138466l219962l504634k393097j319319p90089L28422J906365
1060.6D64381099K033651J21712k078235l532201n150348p083356q015245p820547
1076.9D32856530p946491q522630q159697o790847o023019o398797o560743n595118
1093.2C76859188m224986l057629j572638K63989J415282J416117J212209J538516
$$ y = [637803435, 627081931, 617401302, 607330739, 599409819, 594814599, 590640128, 585104883, 580014348, 576943755, 574607670, 571599543, 569063008, 568030894, 566673934, 563028157, 557924807, 552696943, 546611190, 538933396, 531186581, 524864018, 519080400, 512695909, 506596923, 501880229, 497706085, 493017107, 488663256, 485751718, 483448684, 480552167, 477623731, 475511879, 473373413, 470153451, 466648817, 464255720, 462936401, 462146312, 462474734, 464381099, 466414750, 466536462, 464458227, 460926026, 455775678, 448692322, 440677077, 432856530, 424910039, 416387409, 408227712, 401436865, 395413846, 389015049, 382454306, 376859188, 372634202, 369576573, 368003935, 368267924, 369683206, 371099323, 372311532, 373850048]
1109.5C73850048J680523Q91655l96192j899480m144013o162078m986703m61131L117978
1127.9C61490607L091514Q51393j021117q24421Q80330K510369L447563L549069K817124
1146.2C76792431K064437K106726K528727K618074K885670M244327O331951Q145392
1162.6D07717735R707927J1599124J3204455J3344139J2435704J1905641J1684418
1176.8D91599143J0589122Q827687P636428O650686M377365J284003o39081j104474
1193.1E29220879j274824r62794R34243L677070N191148N190849N130649N135536L965258
1211.5E56208014K074183J383066J848042J672864Q06927Q72195J826167J995564J368999
1229.9E70056021J583636K597570K729178J978457J994789K740085K478778J195252
$$ y = [373850048, 375530571, 376422226, 376026034, 374126554, 369982541, 363820463, 358833760, 358372629, 361490607, 364582121, 365433514, 364412397, 363587976, 364468306, 366978675, 370426238, 373975307, 376792431, 378856868, 380963594, 383492321, 386110395, 388996065, 393240392, 399572343, 407717735, 417425662, 429024786, 442229241, 455573380, 468009084, 479914725, 491599143, 502188265, 511015952, 518652380, 525303066, 529680431, 530964434, 530325353, 529220879, 527946055, 526983261, 527917504, 531594574, 536785722, 541976571, 547107220, 552242756, 556208014, 558282197, 559665263, 561513305, 563186169, 563993096, 564865291, 566691458, 568687022, 570056021, 571639657, 574237227, 576966405, 578944862, 580939651, 583679736, 586158514, 587353766]
1246.2E87353766P02143J178503J006961J51217L39388J674414K371073K262294L076673
1264.5F00116432M809081N543053N137027N423188O559968O721079N724490N517662
1280.8F45551980O445884O620646N657136N341411O018817N811215M312634L540576
1297.2F89300299M053235L839493K377390J738608K445340K407194J062631M84586
1313.5G07708776J321912J570821N43534L08276J517355J958430Q91745L71873J065910
1331.8G17258632J016200k59340p31170K31266O23941j58846k46823Q45253J131177
1350.2G19710290n2392o57737P9274K02656j183510k341688j913488j347422j962602
1368.5G10533381k452076k073944k279996k927423k302945j083910r39190j044274
$$ y = [587353766, 588055909, 589234412, 590241373, 590392590, 590731978, 592406392, 594777465, 597039759, 600116432, 604925513, 610468566, 615605593, 621028781, 627588749, 634309828, 640034318, 645551980, 651997864, 658618510, 664275646, 669617057, 675635874, 681447089, 685759723, 689300299, 693353534, 697193027, 699570417, 701309025, 703754365, 706161559, 707224190, 707708776, 709030688, 710601509, 711145043, 711453319, 712970674, 714929104, 715820849, 716192722, 717258632, 718274832, 718015492, 717284322, 717515588, 718139529, 717980683, 717733860, 718579113, 719710290, 719657898, 719000161, 719079435, 719282091, 718098581, 715756893, 713843405, 712495983, 710533381, 708081305, 706007361, 703727365, 700799942, 698496997, 697413087, 696473897, 695429623]
1384.9F95429623j83701O95288M03225r05514j982331j750111j897872l197074l769159
1403.2F82842374l162205k672017l100872l204465j980781q44420j194715j968503
1419.5F64714396j154721k62320q23080j307547p27654k35975m48465n04971K96653
1437.9F59546316R70244O31511K61784J010239J772165J233399P69317J939237M436970
1456.2F72571182N519569M452467M988194O579876P082522P745862J0604262J3344347
1472.6G32888281J0679782O325900N116821M828393L286183J542509J312375J182019
1488.9G67162263o77704k042592j654625j632869l080666l928602l034890k645433
1505.2G48464882n202949o547391n122542m092455m101217m279435l210306k480626
$$ y = [695429623, 695245922, 695941210, 696344435, 695438921, 693456590, 691706479, 689808607, 686611533, 682842374, 679680169, 677008152, 673907280, 670702815, 668722034, 667877614, 666682899, 664714396, 663559675, 663297355, 662474275, 661166728, 660439074, 660203099, 659754634, 659249663, 659546316, 660516560, 661148071, 661409855, 662420094, 664192259, 665425658, 666194975, 668134212, 672571182, 678090751, 682543218, 687531412, 694111288, 701193810, 708939672, 719543934, 732888281, 743568063, 749893963, 755010784, 759839177, 763125360, 764667869, 765980244, 767162263, 766484559, 764441967, 762787342, 761154473, 758073807, 754145205, 751110315, 748464882, 743261933, 736714542, 731592000, 727499545, 723398328, 719118893, 715908587, 713427961]
1521.5G13427961l222764l724813l227651k150476k180279l186285k486289r00387
1537.8F92349017j275421k614140j760066n58614l95656n74648K00987J414656J563966
1556.2F88350081M53890q03709p25568j116037k066851k548635l010571l667414m809618
1574.5F70055568o446063o317914o226837p331729p561624p215739p666111q489310
1590.9F12800241q364916p774711p807910q191467p978201p359147p293820p733047
1607.2E50297022p826388p286727o857872p579566q529484o817460n715847o629944
1623.5D93053734o470173n347371m721046l925025k964884k306432j503289o47425
1639.8D65168089L99232J741200L059387L401548L066927M569501O526530M979431
$$ y = [713427961, 710205197, 706480384, 703252733, 701102257, 698921978, 695735693, 693249404, 692349017, 691073596, 688459456, 686699390, 686140776, 685745120, 685170472, 685371459, 686786115, 688350081, 688803971, 688000262, 687274694, 686158657, 684091806, 681543171, 678532600, 674865186, 670055568, 663609505, 657291591, 651064754, 643733025, 636171401, 628955662, 621289551, 612800241, 604435325, 596660614, 588852704, 580661237, 572683036, 565323889, 558030069, 550297022, 542470634, 535183907, 528326035, 520746469, 512216985, 505399525, 499683678, 493053734, 486583561, 481236190, 476515144, 472590119, 469625235, 467318803, 465815514, 465168089, 465567321, 467308521, 470367908, 473769456, 476836383, 481405884, 487932414, 492911845]
1656.1D92911845M641027O245851P798314P931650P319987Q505583R890914Q892178
1672.4E54137349R052575J0355949J0079861R546459J0460555J2909591J1778772R608686
1688.8F37929797R610295R704650J1077642J1660040J0893762J1832178J0097444Q005797
1705.1G20811605P396520O901025O800592O128669N340397N616844N204857L629267
1721.4G67829776K942502L519297M072308L658593K923966L316283L372371K151668
1737.7G93786764J582742K176702L081620L178656L162503M069626M644215L456057
1754H19138885K327740K448201K865732K232611J151681J497209K360403J874149O44446
1772.4H36541057P69436J586795J326322N18024Q07941J634658J232624M41193Q55506
$$ y = [492911845, 497552872, 503798723, 511597037, 519528687, 526848674, 535354257, 545245171, 554137349, 563189924, 573545873, 583625734, 593172193, 603632748, 616542339, 628321111, 637929797, 647540092, 657244742, 668322384, 679982424, 690876186, 702708364, 712805808, 720811605, 728208125, 735109150, 741909742, 748038411, 753378808, 758995652, 764200509, 767829776, 770772278, 774291575, 778363883, 782022476, 784946442, 788262725, 791635096, 793786764, 795369506, 797546208, 800627828, 803806484, 806968987, 811038613, 815682828, 819138885, 821466625, 823914826, 826780558, 829013169, 830164850, 831662059, 834022462, 835896611, 836541057, 837310493, 838897288, 840223610, 840741634, 841549575, 843184233, 844416857, 844858050, 845713556]
1790.7H45713556J625538R48548M3452M73678J331746Q26478j51038K46883J259744
1809.1H52318585R31442j90616N5969J054108Q23677j11700J49250J129568R13978
1827.4H57074261k03848k56062P23660O79195k84672j63257R60112R47535l08096l61503
1847.8H58807325O59526O93977k68281l02911O74904P23719k83777l27468P59840Q24868
1868.2H61961722m79757o13332N62966P70211k47479m68790M91261O79613k54930m67300
1888.6H61934185M31061O47723l12507o35743L24249O78719k38777n71370L53158P00891
1909H63311589k64824o62386K91526P15256k62618o76692K20895N76735l08454p10190
1929.4H62230837J44303N67854k91705p15077J96516P02500k59995q80420o6877M91441
$$ y = [845713556, 847339094, 848287642, 848331094, 848804772, 850136518, 850962996, 850811958, 851058841, 852318585, 853250027, 853059411, 853115380, 854169488, 854993165, 854881465, 855030715, 856160283, 857074261, 856870413, 856614351, 857338011, 858017206, 857732534, 857569277, 858529389, 859476924, 859168828, 858807325, 859466851, 860160828, 859892547, 859589636, 860264540, 860988259, 860704482, 860377014, 861136854, 861961722, 861481965, 860868633, 861431599, 862201810, 861954331, 861485541, 861976802, 862656415, 862401485, 861934185, 862365246, 863012969, 862700462, 862064719, 862388968, 863067687, 862828910, 862257540, 862610698, 863311589, 863046765, 862384379, 862675905, 863391161, 863128543, 862451851, 862672746, 863249481, 862941027, 862230837, 862375140, 862942994, 862651289, 861936212, 862132728, 862835228, 862575233, 861694813, 861627936, 862119377]
1949.8H62119377k69175q13484n7817M85123k76983q50260p5341N51522k35379r01401
1970.2H59676182j41084N25713k06947q77142j78814M96983j61647q08061j43051N30303
1990.6H58712435j62363r20177l07977M22955j37985q69334l02613M46976j17183q77083
2011H55887651l40759M12881j21236q98003l87967L99888q4579q61884l86357L90411
2031.4H54010046p8500q66174l82543M61697J1623q80241m99129L65555J4961q18432
2051.8H51338863m40061M11570N0247p99656m57704M27187J49250p02680m11152M85897
2072.2H50051761K59638o07670m07517M57823K83897n96344m26591M71831L41236n46097
2092.6H49281967m51207M25994L69549m62532l69072N01215M39167m76062n01871L78907
$$ y = [862119377, 861850202, 861036718, 860978901, 861464024, 861187041, 860336781, 860261440, 860812962, 860577583, 859676182, 859535098, 860060811, 859853864, 858976722, 858797908, 859294891, 859133244, 858325183, 858182132, 858712435, 858550072, 857629895, 857321918, 857744873, 857606888, 856737554, 856434941, 856881917, 856764734, 855887651, 855546892, 855959773, 855838537, 854940534, 854552567, 854952455, 854867876, 854005992, 853619635, 854010046, 853931546, 853065372, 852682829, 853144526, 853156149, 852275908, 851776779, 852142334, 852157295, 851338863, 850898802, 851310372, 851360619, 850560963, 850103259, 850530446, 850679696, 849977016, 849565864, 850051761, 850311399, 849703729, 849296212, 849754035, 850037932, 849441588, 849014997, 849486828, 849828064, 849281967, 848830760, 849256754, 849626303, 849163771, 848794699, 849295914, 849735081, 849259019, 848757148, 849136055]
2113H49136055M18126m15683m00364N01931N69880l03150m27603L96430N16534l09348
2133.4H49682808m15504M55618O33240k21908m42744L88205O13332k18868m60983L72768
2153.8H50385964O41227j67013m48823L53277O69956j08122m43101L19481O76155o4433
2174.2H51814568m34816K85864O57141o8128m57585K47240O41168n9784m94420J79767
2194.6H52311015O20127o2049n37574J14441O03378k6703n12064J17898O06478j788
2215H53233159m95732P2479N57661l576n10812J550M86254l9577n54085k2530N35607
2237.4H53260398M5657n28932j01327M29213r120n38409r1135M50492J1027n25117
2257.8H52402747j17779M07636K1219m96685q0168N20885J86741l82245l3855N28872
$$ y = [849136055, 849554181, 849138498, 848738134, 849240065, 849809945, 849506795, 849079192, 849475622, 849992156, 849682808, 849267304, 849722922, 850356162, 850134254, 849691510, 850079715, 850693047, 850474179, 850013196, 850385964, 851027191, 850860178, 850411355, 850764632, 851434588, 851326466, 850883365, 851202846, 851879001, 851814568, 851379752, 851665616, 852322757, 852254629, 851797044, 852044284, 852685452, 852625668, 852131248, 852311015, 852931142, 852869093, 852331519, 852445960, 853049338, 853022635, 852510571, 852628469, 853234947, 853233159, 852737427, 852809906, 853367567, 853363991, 852853179, 852854729, 853340983, 853301406, 852747321, 852724791, 853260398, 853306055, 852777123, 852675796, 853105009, 853095889, 852557480, 852466345, 852916837, 852927864, 852402747, 852284968, 852692604, 852713823, 852217138, 852136970, 852657855, 852844596, 852462351, 852428496, 852957368]
2278.2H52957368J79410l91960p3731N03659J95742m46022k19881L99768J75476m49479
2298.6H52830350k55167L44455J27614n15700l76343J98245N6564n60164n44608k4497
2319H51280749q0049o18160m88996J20103M1783n33045l82602K93076K53201l26097
2339.4H49559963j65344O98925J023054N66899L7969l36469p64548j180232r13262
2357.7H48526955J0728M79699K73764N25236J303196J369238P90179P93218J304567
2376.1H55376780J224220O22511N12838Q78632P47800N1320j82867K90870M31836o4969
2396.5H59888971k16186K62141M25637o1095k58028K10523M11511n5671k72989J75476
2416.9H60510290L67760j17957l57032Q6665L39150o4492k98738J16944L35813q9825
$$ y = [852957368, 853136778, 852744818, 852671087, 853174746, 853370488, 852924466, 852704585, 853104353, 853279829, 852830350, 852575183, 852919638, 853047252, 852531552, 852155209, 852353454, 852410018, 851849854, 851305246, 851280749, 851200700, 850582540, 850093544, 850213647, 850255430, 849722385, 849339783, 849632859, 849886060, 849559963, 849394619, 850093544, 851116598, 851683497, 851721466, 851384997, 850620449, 849440217, 848526955, 848537683, 849017382, 849291146, 849816382, 851119578, 852488816, 853278995, 854072213, 855376780, 856601000, 857223511, 857736349, 858614981, 859362781, 859414101, 859231234, 859522104, 859953940, 859888971, 859672785, 859934926, 860360563, 860299468, 860041440, 860251963, 860663474, 860607803, 860334814, 860510290, 860878050, 860760093, 860403061, 860489726, 860828876, 860764384, 860465646, 860582590, 860918403, 860828578]
2437.3H60828578l08156R2388K90036j04308l05295P2837L01957m7684k85745M4763
2457.7H60579371K61546j01209l45111J1444K77102m1485l19659k5869K40863p3374
2478.1H60463619l51667m0770K70605n424l35693j13249J49369j10745l46184k3961
2498.5H59555900K84612n007l60548j22488K04564n7042l96192j46091J88827l9100
2518.9H59107435l32713r1970J99675l6716l49760j55688J33038l8505l01420j32859
2539.2H58000517J24931p2956l72171j63734J95682L9518l15070k05756Q8811m3273
2559.6H57276499l48568k58565K2948l9100l12925k68757j0491j20878m49240l31819
2580H55159104M8876k4557m20273m23431j15931j65522m94421m39882p0036j02639
$$ y = [860828578, 860520422, 860612810, 860902846, 860798538, 860493243, 860566080, 860868037, 860820353, 860534608, 860579371, 860840917, 860739708, 860394597, 860406041, 860683143, 860641658, 860321999, 860296130, 860536993, 860463619, 860111952, 860071182, 860341787, 860336363, 860000670, 859887421, 860036790, 859926045, 859579861, 859555900, 859840512, 859835505, 859474957, 859352469, 859557033, 859499991, 859103799, 858957708, 859146535, 859107435, 858774722, 858682752, 858882427, 858845711, 858495951, 858340263, 858473301, 858434796, 858133376, 858000517, 858125448, 858052492, 857680321, 857516587, 857712269, 857751787, 857436717, 857230961, 857319772, 857276499, 856927931, 856669366, 856692314, 856653214, 856340289, 856071532, 856061041, 855940163, 855490923, 855159104, 855207980, 855183423, 854763150, 854339719, 854223788, 854058266, 853563845, 853123963, 853053927, 852951288]
2600.4H52951288m81784m68612j36614j88529n44310n29408j86861j78993n04911n12957
2620.8H49218309k12073k54512n89967n43475j60515j43707m86493n09978k22623k54154
2641.2H45840812n78940n70834k03907j30296m73976n80192k97844k52605n53310n87403
2661.6H41611505k40207j27673m47393n83768l01659k12729m66048n13912k50160j46866
2682H38321090m04358n51880l26395k24292n02765o31034l26515j55806m48048o37770
2702.4H34112227m00543l07620o26385p70450m68790l00825n90503p78139n18441l34263
2722.8H29016268n85019p79868n22017k74301m31776n41150k98619k11895n12123o65009
2743.2H24194491l97325k02119m60505p18952n63323m08888o31809q27730o01947l78847
$$ y = [852951288, 852469504, 852000892, 851864278, 851675749, 851131439, 850602031, 850415170, 850236177, 849731266, 849218309, 849006236, 848751724, 848161757, 847618282, 847457767, 847314060, 846827567, 846317589, 846094966, 845840812, 845261872, 844691038, 844487131, 844356835, 843882859, 843302667, 843004823, 842752218, 842198908, 841611505, 841371298, 841243625, 840796232, 840212464, 839910805, 839698076, 839232028, 838718116, 838467956, 838321090, 837916732, 837364852, 837038457, 836814165, 836311400, 835680366, 835353851, 835198045, 834749997, 834112227, 833711684, 833404064, 832777679, 832007229, 831538439, 831237614, 830647111, 829868972, 829350531, 829016268, 828431249, 827651381, 827129364, 826855063, 826423287, 825882137, 825583518, 825371623, 824859500, 824194491, 823797166, 823595047, 823134542, 822415590, 821852267, 821443379, 820811570, 819983840, 819381893, 819003046]
2763.6H19003046o03557q33929o50048m73559o99282r72986q57115o62565q20935j033127
2784H11395943r10640p31885r30905j213074j086593q53598j003623j294553j267016
2802.3H02104056j116514j278222j512766j403808j252652j479089j814008j824617
2818.7G90422380j750767k027393k397477k512336k684474l277957m083753m794896
2835G66893327n678832p190228r028733j0601341j2102425j3595641j3831258j1412680
2851.3F83452189o489277q52466L524006N730510N681097L844559J366198m94301j097619
2869.7F94664896n48363N60164J461208J501203N31316r00031k159237l154517m064321
2888F87892318m787743n047560m987478n084217n407751n589365n664528o120503p009625
$$ y = [819003046, 818399489, 817565560, 816915512, 816441953, 815742671, 814769685, 813912570, 813250005, 812429070, 811395943, 810485303, 809753418, 808822513, 807609439, 806522846, 805669248, 804665625, 803371072, 802104056, 800987542, 799709320, 798196554, 796792746, 795540094, 794061005, 792246997, 790422380, 788671613, 786644220, 784246743, 781734407, 779049933, 775771976, 771688223, 766893327, 761214495, 754024267, 744995534, 734394193, 722291768, 708696127, 694864869, 683452189, 676962912, 676110446, 679634452, 685364962, 691046059, 694890618, 696256816, 695762515, 694664896, 694116533, 694676697, 696137905, 697639108, 698170424, 697270393, 695111156, 691956639, 687892318, 683104575, 678057015, 673069537, 667985320, 662577569, 656988204, 651323676, 645203173, 638193548]
2906.4F38193548q011043r225786j0985434j2963534j4212727j4073134j2373030q925974
2922.7E47422886l952861J376748N673170Q362413R909749J0810733J0915875J0108292
2939F00627005Q683622O782770M275262J481474o96421j623511j418173l44098J509011
2957.4F19276941L664791N375207O455958P221102P639707P392048O578088N620301
2973.7F69224143M737854L943980L191054K478122J970590J622974J193285Q58605
2990F89220607P03454L19362k46048o48916q83460j059949j282275j359165j093685
3008.3F83669925q51155r90986j264871j348018j386523j533747j589239j511872j549720
3026.7F71643794j737774j868248j841008j901389k156734k227426k050936k075136
$$ y = [638193548, 630182505, 620956719, 609971285, 597007751, 582795024, 568721890, 556348860, 547422886, 543470025, 544846773, 550519943, 558882356, 568792105, 579602838, 590518713, 600627005, 609310627, 616093397, 620368659, 621850133, 621153712, 619530201, 618112028, 617767930, 619276941, 622941732, 628316939, 634772897, 641993999, 649633706, 657025754, 663603842, 669224143, 673961997, 677905977, 681097031, 683575153, 685545743, 687168717, 688362002, 689220607, 689924061, 690243423, 689997375, 689348459, 688464999, 687405050, 686122775, 684763610, 683669925, 682818770, 681827784, 680562913, 679214895, 677828372, 676294625, 674705386, 673193514, 671643794, 669906020, 668037772, 666196764, 664295375, 662138641, 659911215, 657860279, 655785143]
3043F55785143k389788k575279k441823k345800k510071k626479k541363k452493k457440
3061.4F33444607k459049k352416k311528k504349k646685k475440k202928k181471
3077.7F14310741k411365k544820k502740k584159k712429k624273k535880k644062
3094E93751013k725601k662718k682209k897084l004253k810538k686381k907515l066301
3112.4E68308413k894282k820909l084660l383160l439068l318072l271103l311753
3128.7E42785406l357708l436208l472149l399134l344774l433407l591239l705323
3145E15045464l697216l548444l505766l735662l918051l827155l748924l807127l823102
3163.4D81434017l817915l897310l956586l872931l777534l822028l916085l926665
$$ y = [655785143, 653395355, 650820076, 648378253, 646032453, 643522382, 640895903, 638354540, 635902047, 633444607, 630985558, 628633142, 626321614, 623817265, 621170580, 618695140, 616492212, 614310741, 611899376, 609354556, 606851816, 604267657, 601555228, 598930955, 596395075, 593751013, 591025412, 588362694, 585680485, 582783401, 579779148, 576968610, 574282229, 571374714, 568308413, 565414131, 562593222, 559508562, 556125402, 552686334, 549368262, 546097159, 542785406, 539427698, 535991490, 532519341, 529120207, 525775433, 522342026, 518750787, 515045464, 511348248, 507799804, 504294038, 500558376, 496640325, 492813170, 489064246, 485257119, 481434017, 477616102, 473718792, 469762206, 465889275, 462111741, 458289713, 454373628, 450446963]
3179.7D50446963l892690l901362l909737l828883l727973l718763l769338l783644
3196D19914573l730952l681988l648937l546893l413707l393114l418833l369540l304392
3214.3C88406217l295302l291935l202915l095687l068864l065258k980024k834767
3230.7C63571465k771944k881884k936930k748281k581715k535582k450138k405793
3247C42259198k470225k465427k314716k163470k155304k220899k230555k193212k143502
3265.3C21901888k092004k044350k076358k152115k165705k157211k118170k080322
3281.6C05015653k132147k180368k101719j961589j958043k107322k187848k183288
3298B88203329k178252k069086j898259j899629k095104k289653k326726k212853k113253
$$ y = [450446963, 446554273, 442652911, 438743174, 434914291, 431186318, 427467555, 423698217, 419914573, 416183621, 412501633, 408852696, 405305803, 401892096, 398498982, 395080149, 391710609, 388406217, 385110915, 381818980, 378616065, 375520378, 372451514, 369386256, 366406232, 363571465, 360799521, 357917637, 354980707, 352232426, 349650711, 347115129, 344664991, 342259198, 339788973, 337323546, 335008830, 332845360, 330690056, 328469157, 326238602, 324045390, 321901888, 319809884, 317765534, 315689176, 313537061, 311371356, 309214145, 307095975, 305015653, 302883506, 300703138, 298601419, 296639830, 294681787, 292574465, 290386617, 288203329, 286025077, 283955991, 282057732, 280158103, 278062999, 275773346, 273446620, 271233767, 269120514]
3316.3B69120514k095759k062499j970440j933187k040118k102971j991720j875728
3332.6B53048092j790792j695111j720443j828477j841054j806154j721263j550421
3348.9B39094377j549468j736984j776650j581773j388178j359805j370877j228690
3365.3B27101952j050472j110852j343757j363352j111046q93026p82386p15121o39811
3383.6B18092129n30124l18796k8967l5167l16531k98991R2864L24860O7636k60278
3404B16788635p4029L16992M34429L76209K94402K90186M98667P31975P47666P91803
3424.4B21196935J008838J192212J208484J274303J463100J393065J088798J087412
3440.7B30913147J411617J661077J753956J755730J815572J983225K142758K241030
$$ y = [269120514, 267024755, 264962256, 262991816, 261058629, 259018511, 256915540, 254923820, 253048092, 251257300, 249562189, 247841746, 246013269, 244172215, 242366061, 240644798, 239094377, 237544909, 235807925, 234031275, 232449502, 231061324, 229701519, 228330642, 227101952, 226051480, 224940628, 223596871, 222233519, 221122473, 220229447, 219447061, 218731940, 218092129, 217562005, 217243209, 217214242, 217179075, 216862544, 216563553, 216656417, 216981277, 217048913, 216788635, 216714606, 217031598, 217466027, 217842236, 218136638, 218426824, 218925491, 219657466, 220405132, 221196935, 222205773, 223397985, 224606469, 225880772, 227343872, 228736937, 229825735, 230913147, 232324764, 233985841, 235739797, 237495527, 239311099, 241294324, 243437082, 245678112]
3457B45678112K302885K258465K267360K600372K876431K609134K157062K178907K521277
3475.4B67450005K855927K965986K734334K667814K938330L039688K954960L013104
3491.7B90620148L182292L330767L301353L285735L434658L364683L143847L254741
3508C16918224L579468L813922L800869L608733L629715L928542M259795M194855L871680
3526.4C51605803L881752M135400M326254M561365M705876M538328M533529M834145
3542.7C87122452N011261M782676M558653M766226N054027N101651N149036N356938
3559D26902920N450815N333662N440980N974233O111950N787551N747468N989760O205171
3577.4D78944510O397218O579816O640464O763548O970107O866098O626248O834626
$$ y = [245678112, 247980997, 250239462, 252506822, 255107194, 257983625, 260592759, 262749821, 264928728, 267450005, 270305932, 273271918, 276006252, 278674066, 281612396, 284652084, 287607044, 290620148, 293802440, 297133207, 300434560, 303720295, 307154953, 310519636, 313663483, 316918224, 320497692, 324311614, 328112483, 331721216, 335350931, 339279473, 343539268, 347734123, 351605803, 355487555, 359622955, 363949209, 368510574, 373216450, 377754778, 382288307, 387122452, 392133713, 396916389, 401475042, 406241268, 411295295, 416396946, 421545982, 426902920, 432353735, 437687397, 443128377, 449102610, 455214560, 461002111, 466749579, 472739339, 478944510, 485341728, 491921544, 498562008, 505325556, 512295663, 519161761, 525788009, 532622635]
3593.7E32622635P141233P206142P272661P323443P233918P192791P461547P610441
3610E91064811P484078P345915P153034P377029P739365P246136O626428O630003P337391
3628.4F56004190P519484O665587O422699O446242O276965O175518O008923N773366
3644.7G07292974N790412O100178N756259M708767M366815M671753M497647M015326
3661G47200131L728688L627598L620863L644526L420949K916456K685547K455473K172231
3679.4G75472462K235592K476036K620518K611339K196432J587033J416921J499594
3695.7G92115927J569271J598954J505792J291752J232386J314878J243293R82166
3712H02854419Q62658Q87096R35971R25005P75874O66260O20961O61314Q65281J107335
$$ y = [532622635, 539763868, 546970010, 554242671, 561566114, 568800032, 575992823, 583454370, 591064811, 598548889, 605894804, 613047838, 620424867, 628164232, 635410368, 642036796, 648666799, 656004190, 663523674, 670189261, 676611960, 683058202, 689335167, 695510685, 701519608, 707292974, 713083386, 719183564, 724939823, 729648590, 734015405, 738687158, 743184805, 747200131, 750928819, 754556417, 758177280, 761821806, 765242755, 768159211, 770844758, 773300231, 775472462, 777708054, 780184090, 782804608, 785415947, 787612379, 789199412, 790616333, 792115927, 793685198, 795284152, 796789944, 798081696, 799314082, 800628960, 801872253, 802854419, 803717077, 804604173, 805540144, 806465149, 807241023, 807907283, 808528244, 809189558, 810054839, 811162174]
3732.4H11162174J010954N83351L92496N24283N72920L99649M14192N14865M12763
3750.7H15987647L38852M02868L97324K92778K59042L60608M54962M49181L42131J74463
3771.1H19459856J59680L49641M81189L37600J85728K33770K00093R4711J71066L71515
3791.5H22044849M44353L64721L05116K31683J55449K21610J54495K563Q2374K47181
3811.9H24254394L34680L36647K86042Q5831r8288K1935Q3208Q940P5996L03507M74870
3834.4H26167762K86043r0957j72615j00434k5153J70112M21703M30524q0466m12345
3854.8H26594174j5915J48833P8619J23918K04146J37865o7651j16229J2040L7253
3875.2H27137053Q8453J40488J41383J02102j01029j51277j4663j06394j50681J24038
$$ y = [811162174, 812173128, 812756479, 813148975, 813673258, 814246178, 814645827, 815060019, 815574884, 815987647, 816326499, 816729367, 817126691, 817419469, 817678511, 818039119, 818494081, 818943262, 819285393, 819459856, 819619536, 819969177, 820450366, 820787966, 820973694, 821207464, 821407557, 821502268, 821673334, 822044849, 822489202, 822853923, 823159039, 823390722, 823546171, 823767781, 823922276, 823924839, 824007213, 824254394, 824589074, 824925721, 825211763, 825297594, 825199306, 825221241, 825304449, 825313389, 825389385, 825692892, 826167762, 826453805, 826362848, 826190233, 826089799, 826064646, 826234758, 826656461, 827086985, 827006519, 826594174, 826578259, 826727092, 826805711, 826929629, 827133775, 827271640, 827203989, 827087760, 827099800, 827137053, 827225506, 827365994, 827507377, 827609479, 827508450, 827357173, 827342510, 827236116, 827085435, 827209473]
3895.5H27209473L74853L43919L4750k52963k70783j64390r4235N305J65045K10643
3915.9H27561617K5809j02103J0550K5332j11342n1796J01686Q4638k5451p0453N722
3938.4H27454209J11580O1095n245J44958K08140k0802j66178o0141N0783P6532R9898
3960.8H27954829J28090J14024O1512J2159l1531k5928O318L1770J26719K37644K24709
3983.2H28840315N7280o5922n067N8055L7849O7592J86980
3997.5H29177082
$$ y = [827209473, 827584326, 827928245, 827962995, 827710032, 827439249, 827274859, 827180624, 827185929, 827350974, 827561617, 827587426, 827485323, 827495873, 827521205, 827409863, 827358067, 827459753, 827544391, 827518940, 827448487, 827454209, 827565789, 827626884, 827621639, 827766597, 827974737, 827953935, 827787757, 827727616, 827778399, 827854931, 827954829, 828082919, 828196943, 828258455, 828270614, 828239083, 828213155, 828219473, 828251243, 828377962, 828615606, 828840315, 828897595, 828831673, 828826606, 828884661, 828922510, 828990102, 829177082]
##END=$$ End of the data block
