##TITLE=$$ Begin of the data block
##JCAMP-DX=5.00 $$ ACD/SpecManager v 10.08
##SPECTROMETER/DATA SYSTEM=Alpha
##DATE=15 Apr 2014 09:00:42
##DATA TYPE=INFRARED SPECTRUM
##DATA CLASS=XYDATA
##ORIGIN=
##OWNER=
##NPOINTS=1765
##FIRSTX=399.75695801
##LASTX=3997.56933594
##MAXX=3997.56933594
##MINX=399.75695801
##MAXY=0.86361152
##MINY=0.21632439
##XFACTOR=1.0000000000
##YFACTOR=1.000000000000000e-9
##FIRSTY=0.62758887
##DELTAX=2.03957629
##XUNITS=1/CM
##YUNITS=ARBITRARY UNITS
##XYDATA=(X++(Y..Y))
399.8F27588868m264295q72195L68238k434671l117144O8307R76741j394451j795232
418.1F15124166L20137n35787k891838j659274J081407j37448k960206j882791P06851
436.5F07165217k57969k100050n04851J420438n26190k540588l68536J694858m66585
454.8F03515744k296567k65360Q19385j576662k521872j6511Q65460j773119k692461
473.2E94058037p6950N39839j948416k019286Q55804Q98838j936615j848400P70987
491.5E89293838K34723k822221k510190M23730o855k862751j987994Q49307k53737
509.9E80357850l038049j982212N71430o22333l082692j820624K69294j247943l380835
528.3E66023886j854241J56045j276016k901554j053035Q32259p18832k336383p04467
$$ plain form
399.8 627588868 623324573 622452378 622820616 620385945 617268801 617337108 618313849 616919398 615124166
418.1 615124166 615444303 614908516 612016678 610357404 611438811 611301363 608341157 606458366 607165217
436.5 607165217 606907248 604807198 604302347 605722785 605196595 602656007 602287471 603982329 603515744
454.8 603515744 601219177 600953817 601773202 600196540 597674668 597658157 598523617 596750498 594058037
473.2 594058037 593981087 594520926 592572510 590553224 591409028 592307866 590371251 588522851 589293838
491.5 589293838 589528561 586706340 584196150 584619880 584613025 581750274 579762280 580611587 580357850
509.9 580357850 577319801 575337589 575909019 575286686 572203994 570383370 570652664 569404721 566023886
528.3 566023886 564169645 564325690 563049674 560148120 559095085 559927344 559208512 556872129 556167662
546.6E56167662O88315j286745k767981r30070L15725j690566l212333j635432n92113
565E45056462k647340m063129k356768j323581l176570m185259k193868j126707k943992
583.3E21039248l831268k189278j578749l530502m390955k583265j798213l476858
599.6D97660160m188120k385348j051814j656204j645386j23203L43859o22988M24057
618D86755013L686369M799724L022223K181381L713250M433871L173411K939581M529775
636.3E19234598M439115J640618r1612J537740L609836L008246J565159R75787m17709
654.7E35501778p52568L455460Q238435P701814L606021J970172M574716M244149J556337
673.1E70096314J378417L388643L506840J179456Q12888K815843K813041M64201Q6188
$$ plain form
546.6 556167662 556855977 555569232 552801251 551871181 552186906 550496340 547284007 545648575 545056462
565 545056462 542409122 538345993 535989225 534665644 531489074 527303815 525109947 523983240 521039248
583.3 521039248 517207980 515018702 513439953 509909451 505518496 502935231 501137018 497660160
599.6 497660160 493472040 491086692 490034878 488378674 486733288 486610085 486953944 486330956 486755013
618 486755013 490441382 495241106 498263329 500444710 504157960 508591831 511765242 514704823 519234598
636.3 519234598 523673713 525314331 525222719 526760459 530370295 533378541 534943700 535919487 535501778
654.7 535501778 534749210 538204670 546443105 554144919 557750940 559721112 564295828 568539977 570096314
673.1 570096314 571474731 574863374 578370214 579549670 580362558 583178401 585991442 586455643 586541831
691.4E86541831K005041J866698n65886o14584J864732K165258J55508L85106K768934
709.8E96572638K779662N21779L98636K495408K668500R14216J365662L740668L588378
728.1F15045547J109958R11355K911568K651095L01838M30942K750575K656162M29332
746.5F29198372O30379K947152K857029O95527J012027L392577L202021R21905J169324
764.8F46026313L462673L115356N90324N36442K499819J811981j073242j257896R77635
783.2F56689405Q05796j316548m40478K837658L553212K148211L356993O519556O616652
801.6F80770457M113078M062533O120920N286873K207100K081156M180193L128350
817.9G11950660l29256q64029P00950p47263m132688m230738k002120k524137m898370
$$ plain form
691.4 586541831 588546872 590413570 589847684 589233100 591097832 593263090 593418598 593803704 596572638
709.8 596572638 599352300 599874079 600272715 602768123 605436623 606350839 607716501 611457169 615045547
728.1 615045547 616155505 617066860 619978428 622629523 622931361 623362303 626112878 628769040 629198372
746.5 629198372 629828751 632775903 635632932 636328459 637340486 640733063 643935084 644856989 646026313
764.8 646026313 649488986 652604342 653194666 653731108 656230927 658042908 656969666 655711770 656689405
783.2 656689405 657495201 656178653 655738175 658575833 662129045 664277256 667634249 674153805 680770457
801.6 680770457 684883535 688946068 695066988 700353861 702560961 704642117 708822310 711950660
817.9 711950660 711621404 710757375 711458325 710711062 706578374 702347636 700345516 697821379 692923009
836.2F92923009m217922j658619k171039m515171l582061L4929J619458J527428M099131
854.6F84059143Q424163R431302P542015P795274R973824R068429N471945M618526
870.9G46384621O340801N283058J728773J119197L029942J928032j678586k107144
887.2G62028694K65658j06692k681196j925647J566529K216518K57671Q09908L452480
905.6G65883923K946317l23415r71675O49869o30259m164815m585087k108753j689672
923.9G55006433l062368j603126K012491K615094L88861M15980K588749K132714n42938
942.3G59951890n90384J559555R61065k090275k810836j545787k867639o287694p395088
960.6G38884807o768227q701682j2649953j4386833j3968826j4637470j5696048j3986469
$$ plain form
836.2 692923009 688705087 687046468 684875429 680360258 676778197 676813126 678432584 679960012 684059143
854.6 684059143 692483306 701914608 709456623 717251897 727225721 736294150 741766095 746384621
870.9 746384621 752725422 758008480 759737253 760856450 763886392 765814424 764135838 762028694
887.2 762028694 762294352 762187660 759506464 757580817 759147346 761363864 761621535 762431443 765883923
905.6 765883923 768830240 768506825 767535150 768185019 767554760 763389945 758804858 756696105 755006433
923.9 755006433 751944065 750340939 752353430 754968524 755357385 755773365 758362114 760494828 759951890
942.3 759951890 759361506 760921061 761882126 759791851 756981015 755435228 752567589 746279895 738884807
960.6 738884807 732116580 723414898 710764945 696378112 682409286 667771816 652075768 638089299
977F38089299j0702371r708763j0093510p945001m637539m199326n517006n082667
993.3E80203116l115356k367258k995849k554893j102865j408935l653884n083918
1009.6E57920158n201161o105661p712245p709921o254792n767405o384432o052554
1025.9E06731987m661441m136354m632353m312575k940119k352356k895624k879113
1042.2D77922052k039313k059847l183514l536523k438962j342922q28326K74420J859664
1060.6D64626729J994849J19567k028793l466189n132914p117003q032292p806808
1076.9D33157146p934392q540183q205890o813229n995094o377727o573498n585581
1093.2C77131552m180700l037363j591385K54423J440018J449257J214951J500428
$$ plain form
977 638089299 627386928 617678165 607584655 599639654 595002115 590802789 585285783 580203116
993.3 580203116 577087760 574720502 571724653 569169760 568066895 566657960 563004076 557920158
1009.6 557920158 552718997 546613336 538901091 531191170 524936378 519168973 512784541 506731987
1025.9 506731987 502070546 497934192 493301839 488989264 486049145 483696789 480801165 477922052
1042.2 477922052 475882739 473822892 470639378 467102855 464663893 463320971 462492645 462767065 464626729
1060.6 464626729 466621578 466741145 464712352 461246163 456113249 448996246 440963954 433157146
1076.9 433157146 425222754 416682571 408476681 401663452 395668358 389290631 382717133 377131552
1093.2 377131552 372950852 369913489 368322104 368576527 370016545 371465802 372680753 374181181
1109.5C74181181J659155R34273l60072j910448m142850o146074n002677n21392L042311
1127.9C61733407L051758Q68618r83357q00223Q89481K520263L458828L527998K769113
1146.2C77035886K036005K099306K512902K593368K863765M220634O307275Q144885
1162.6D07814026R743333J1632353J3211459J3343870J2430489J1881948J1657149
1176.8D91714627J0580748Q832216P632017O631494M363000J272381o40274j072585
1193.1E29313624j257122r73582R43422L691197N183697N192697N126059N082249L921330
1211.5E56223571K097071J418411J830876J636922Q11041R06765J856029J995266J353145
1229.9E70129097J610100K669573K770662J964867J967967K703905K436518J192093
$$ plain form
1109.5 374181181 375840336 376774609 376414537 374504089 370361239 364215165 359212488 358691096 361733407
1127.9 361733407 364785165 365653783 364670426 363870203 364759684 367279947 370738775 374266773 377035886
1146.2 377035886 379071891 381171197 383684099 386277467 389141232 393361866 399669141 407814026
1162.6 407814026 417557359 429189712 442401171 455745041 468175530 480057478 491714627
1176.8 491714627 502295375 511127591 518759608 525391102 529754102 531026483 530386209 529313624
1193.1 529313624 528056502 527082920 528026342 531717539 536901236 542093933 547219992 552302241 556223571
1211.5 556223571 558320642 559739053 561569929 563206851 564017892 564924657 566780686 568775952 570129097
1229.9 570129097 571739197 574408770 577179432 579144299 581112266 583816171 586252689 587444782
1246.2E87444782P57575J247347J037597J42753L10004J640976K363085K268911L050625
1264.5F00263655M756272N514443N133092N392373O521881O735205N755365N492628
1280.8F45564914O377637O582439N665422N371511O063640N855858M343152L560126
1297.2F89384699M063189L832698K358556J735270K464771K416491J054049M85599
1313.5G07795322J324773J549899N26607L19839J546979J987755Q99553L71635J064897
1331.8G17387259J003861k62558p02918K75731O40512j80066k77578Q32259J129151
1350.2G19845653o5625o49989J19627K18808j197934k358794j921415j341343j960993
1368.5G10687995k446830k039075k251864k944171k340734j118899r58740j040101
$$ plain form
1246.2 587444782 588202357 589449704 590487301 590630054 590940058 592581034 594944119 597213030 600263655
1264.5 600263655 605019927 610534370 615667462 621059835 627581716 634316921 640072286 645564914
1280.8 645564914 651942551 658524990 664190412 669561923 675625563 681481421 685824573 689384699
1297.2 689384699 693447888 697280586 699639142 701374412 703839183 706255674 707309723 707795322
1313.5 707795322 709120095 710669994 711196601 711516440 713063419 715051174 715950727 716322362 717387259
1331.8 717387259 718391120 718128562 717425644 717701375 718341887 718161821 717884243 718716502 719845653
1350.2 719845653 719780028 719130039 719249666 719468474 718270540 715911746 713990331 712648988 710687995
1368.5 710687995 708241165 706202090 703950226 701006055 698665321 697546422 696587682 695547581
1384.9F95547581j64986P03037L92735q93653j927077j698316j902222l253102l805280
1403.2F82998717l156543k676368l123820l215432j966536q09073j142323j948476
1419.5F64960146j198292l10361q44717j294494o92844k15829m52757n16772K69771
1437.9F59703851R19223N90384K61306J053751J809180J212000P44522J965046M470050
1456.2F72729313N482316M375399M942596O582856P083237P741332J0653376J3429821
1472.6G33020246J0729313O322443N080700M786432L261805J551091J347542J208961
1488.9G67308533o96897k070666j646280j640975l143788l956675k974511k529084
1505.2G48649657n129278o576955n162120m104555m103482m257142l177345k493381
$$ plain form
1384.9 695547581 695382595 696085632 696478367 695584714 693657637 691959321 690057099 686803997 682998717
1403.2 682998717 679842174 677165806 674041986 670826554 668860018 668050945 666908622 664960146
1419.5 664960146 663761854 663451493 662606776 661312282 660619438 660403609 659950852 659434080 659703851
1437.9 659703851 660623074 661213458 661474764 662528515 664337695 665549695 666294217 668259263 672729313
1456.2 672729313 678211629 682587028 687529624 694112480 701195717 708937049 719590425 733020246
1472.6 733020246 743749559 750072002 755152702 759939134 763200939 764752030 766099572 767308533
1488.9 767308533 766611636 764540970 762894690 761253715 758109927 754153252 751178741 748649657
1505.2 748649657 743520379 736943424 731781304 727676749 723573267 719316125 716138780 713645399
1521.5G13645399l246844l708184l205478k154946k178789l167987k462089q40485
1537.8F92680597j205206k616942j808404o04570m11868n66781K18928J453340J621246
1556.2F88760340M84586q64863p94769j166224k106726k538443k979100l663122m807413
1574.5F70324266o433010o309450o235361p363915p605672p245720p677078q502602
1590.9F12951458q377910p777453p827460q223236p987738p356047p296861p738173
1607.2E50366580p839322p309675o875574p577241q503377o790340n685658o618648
1623.5D93166745o509751n374194m718303l940851k970934k277940j496434o63042
1639.8D65215296L87668J757264L121138L444970L071785M581481O522000M968792
$$ plain form
1521.5 713645399 710398555 706690371 703484893 701329947 699151158 695983171 693521082 692680597
1537.8 692680597 691475391 688858449 687050045 686445475 686033607 685466826 685685754 687139094 688760340
1556.2 688760340 689244926 688380063 687585294 686419070 684312344 681773901 678794801 675131679 670324266
1574.5 670324266 663891256 657581806 651346445 643982530 636376858 629131138 621454060 612951458
1590.9 612951458 604573548 596796095 588968635 580745399 572757661 565401614 558104753 550366580
1607.2 550366580 542527258 535217583 528342009 520764768 512261391 505471051 499785393 493166745
1623.5 493166745 486656994 481282800 476564497 472623646 469652712 467374772 465878338 465215296
1639.8 465215296 465602964 467360228 470481366 473926336 476998121 481579602 488101602 493070394
1656.1D93070394M646569O265283P842362P937610P283092Q514881R944498Q939505
1672.4E54444194R069681J0334075J0076701R583175J0484875J2868225J1716366R583116
1688.8F38160408R602725R711862J1115193J1698127J0926962J1849761J0036170P915080
1705.1G21016288P365048O929755O820977O137550N370140N638480N176902L591060
1721.4G68046200K940655L557384M117906L674448K935230L355563L377020K139390
1737.7G94143796J602888K186477L068984L186524L187895M049181M573644L431797
1754H19431186K368211K477825K842665K177954J118302J520991K400160J875579O14048
1772.4H36826921P27772J565933J357675N60463Q03113J600563J204729M45426Q94427
$$ plain form
1656.1 493070394 497716963 503982246 511824608 519762218 527045310 535560191 545504689 554444194
1672.4 554444194 563513875 573847950 583924651 593507826 603992701 616860926 628577292 638160408
1688.8 638160408 647763133 657474995 668590188 680288315 691215277 703065038 713101208 721016288
1705.1 721016288 728381336 735311091 742132068 748269618 753639758 759278238 764455140 768046200
1721.4 768046200 770986855 774544239 778662145 782336593 785271823 788627386 792004406 794143796
1737.7 794143796 795746684 797933161 801002145 804188669 807376564 811425745 815999389 819431186
1754 819431186 821799397 824277222 827119887 829297841 830416143 831937134 834337294 836212873 836826921
1772.4 836826921 837554693 839120626 840478301 841038764 841841877 843442440 844647169 845092595 845987022
1790.7H45987022J642644R19462L3140M98235J334012P93457j78576K38001J257122
1809.1H52524519R31442j87218O3479J074850Q44717j00970J51515J105845Q89778
1827.4H57297957j98186k64108P03752O83546k72095j36196R99808R55939l29375l78251
1847.8H59062791O38723O47247l20852l08573P17759P60377k62738k83956Q10265Q30830
1868.2H62291873n20170o64115N35071P55489k81573n08785M67420O99043j92523m17590
1888.6H62164140M40359O29246l36707o37769L42846O76155k69115n77569L81410P00533
1909H63513529l01599o62327L28779P33137k79188o82831K49327N96642l06308p07388
1929.4H62481773J46866N73754k99334p40767J80125O81162l06010r19223o5148N28574
$$ plain form
1790.7 845987022 847629666 848549128 848582268 849080503 850414515 851207972 851029396 851267397 852524519
1809.1 852524519 853455961 853268743 853332222 854407072 855251789 855150819 855302334 856408179 857297957
1827.4 857297957 857099771 856835663 857539415 858222961 857950866 857814670 858814478 859770417 859441042 859062791
1847.8 859062791 859701514 860348761 860027909 859719336 860437095 861197472 860934734 860650778 861461043 862291873
1868.2 862291873 861771703 861107588 861642659 862398148 862116575 861607790 862075210 862774253 862581730 862164140
1888.6 862164140 862604499 863233745 862897038 862259269 862602115 863278270 863009155 862431586 862812996 863513529
1909 863513529 863211930 862549603 862878382 863611519 863332331 862649500 862898827 863495469 863189161 862481773
1929.4 862481773 862628639 863202393 862903059 862162292 862342417 863023579 862717569 861798346 861733198 862261772
1949.8H62261772k34723q04126o7651M78804k60771q20040m9234N45740k77161r31919
1970.2H59840691j42574N25594k05815q66354j74582M89235j61350p85291j18792N28812
1990.6H58929574j81555r20713k64943M56572j64986q96037k86459M58240j36614r00984
2011H56092095l50177M05490j34944r10223l88801M09305p7307q67427l94523L96490
2031.4H54179978p2896q66771l83019M54962J2755q62896m78506L68893P093q22842
2051.8H51536751m52876L90410K8849q13008m53472M34935J35839p22348l94523N23567
2072.2H50214124K65419o22034m02570M65870K91944n64516l99530M64976L21746n53966
2092.6H49481463m48167M29034L55840m96566l83079N22196M43459m96090m98056M01675
$$ plain form
1949.8 862261772 862027049 861222923 861155272 861634076 861373305 860553265 860504031 861049771 860772610 859840691
1970.2 859840691 859698117 860223711 860017896 859151542 858976960 859466195 859304845 858519554 858400762 858929574
1990.6 858929574 858748019 857827306 857562363 858018935 857853949 856957912 856671453 857129693 856993079 856092095
2011 856092095 855741918 856147408 856012464 855102241 854713440 855122745 855045438 854178011 853783488 854179978
2031.4 854179978 854107082 853240311 852857292 853312254 853325009 852462113 851983607 852352500 852359593 851536751
2051.8 851536751 851083875 851474285 851503134 850690126 850236654 850671589 850807428 850085080 849690557 850214124
2072.2 850214124 850479543 849857509 849454939 849920809 850212753 849648237 849248707 849713683 850035429 849481463
2092.6 849481463 849033296 849462330 849818170 849321604 848938525 849460721 849904180 849408090 848910034 849311709
2113H49311709M19379m33743m12464N04970N86391k81990m01914M26054N26428l30567
2133.4H49914253m31180M61519O07371k69473m49419L88324O00994k02834m31538L83258
2153.8H50571275O33836j77324m51923L50654O62446j18136m58479L08335O82116m7565
2174.2H51955235m09663L01898O32405r9778m52161K59936O42598m4585m65929J80662
2194.6H52500618N76674r4771n15521J55628O12438l5942n11169J12951O02841O139
2215H53409886m88281Q7142N57840l6538n25951L2306N24044k4855n63086l0457N31971
2237.4H53474021K8849n32508q1778M38810k9088n71787r7334M69982J7882n29111
2257.8H52587938j12116M12583K1816m93586o1095N52356J93298m03404m8280N32329
$$ plain form
2113 849311709 849731088 849297345 848884881 849389851 849976242 849694252 849292338 849718392 850244820 849914253
2133.4 849914253 849483073 849944592 850551963 850282490 849833071 850221395 850822389 850619555 850188017 850571275
2153.8 850571275 851205111 851027787 850575864 850926518 851588964 851470828 851012349 851320684 852002800 851955235
2174.2 851955235 851545572 851847470 852479875 852380097 851927936 852187872 852830470 852785885 852319956 852500618
2194.6 852500618 853077292 852982521 852467000 852622628 853235066 853199124 852687955 852800906 853403747 853409886
2215 853409886 852921605 853008747 853566587 853530049 853004098 853036404 853560448 853535593 852972507 852942050 853474021
2237.4 853474021 853502870 852970362 852888584 853327394 853298306 852726519 852629185 853099167 853117049 852587938
2257.8 852587938 852475822 852888405 852910221 852416635 852355540 852907896 853101194 852697790 852649510 853181839
2278.2H53181839J67906m07397o0916N14626J95265m33922k05696L88444J52647m58419
2298.6H53034377k39491L93808J62899n41985m15444K13444J07765n16891n04315n544
2319H51688623j05738o29962m31120K11120R9062n19871l90828K66552K28286l11256
2339.4H50104868j13546P32302R97305N23865R954l21746o72936j096427q83639K3901
2359.8H49303901M28856K08973M68910J207769J302421P71046P82609J318753J246392
2378.1H57039630N83411M13239Q08835P35879O1810j65880L00884M25935r7573k42770
2398.5H59863400K67447M11808q8930k43902K46644M07636r2089k84970J74224L57092
2418.9H61018360q8871l00825J02997L22998o7353k98620R8527L38495p3493l32653
$$ plain form
2278.2 853181839 853349745 852942348 852881432 853396058 853591323 853157401 852951705 853340149 853492796 853034377
2298.6 853034377 852794886 853188694 853351593 852809608 852394164 852607608 852715373 852198482 851694167 851688623
2319 851688623 851582885 850952923 850521803 850732923 850831985 850312114 849921286 850187838 850416124 850104868
2339.4 850104868 849991322 850723624 851720929 852244794 852254748 851933002 851260066 850163639 849280000 849303901
2359.8 849303901 849732757 849941730 850410640 851618409 852920830 853691876 854474485 855793238 857039630
2378.1 857039630 857623041 858036280 858845115 859580994 859642804 859476924 859777808 860203743 860106170 859863400
2398.5 859863400 860130847 860542655 860453725 860209823 860456467 860864103 860772014 860487044 860661268 861018360
2418.9 861018360 860929489 860628664 860731661 861054659 860987306 860688686 860787213 861125708 861052215 860719562
2439.3H60719562O6280L14891r0956l44694O1154L42727l2604l23474J3709K67625
2459.7H60994220r1553l48926J7703K92122l8862l07321j9431K04980j18137l69012
2480.1H60215783l2902K68877j8597l15845p1048J69873j05739l30388j5498K54691
2500.5H60019207m6194l65138j09315J92941o0320l63052j20282J93357k5332l13282
2520.9H59002590j07109J48594p4685l56018j23501J90675k3663l38018j64091J11639
2541.3H58266413p8618l66748j56283K01642N9486k90156j84655J06156p8857m35233
2561.7H57043147k68519J16110K5094l24130l06011m4167j25050m45545l73304K265
2582.1H55299890k7358l96491l82125p4208j54614m97341m32611q1837j30236m82857
$$ plain form
2439.3 860719562 860785842 861100733 861009777 860665083 860726237 861068964 861036360 860712886 860726595 860994220
2459.7 860994220 860902667 860553741 860571444 860863566 860824704 860517383 860497952 860702932 860584795 860215783
2480.1 860215783 860182881 860451758 860433161 860117316 860046268 860216141 860110402 859780014 859764516 860019207
2500.5 860019207 859973013 859607875 859498560 859691501 859631181 859268129 859147847 859341204 859315872 859002590
2520.9 859002590 858895481 859044075 858969390 858613372 858489871 858680546 858656883 858318865 858154774 858266413
2541.3 858266413 858187795 857821047 857664764 857866406 857925892 857635736 857451081 857557237 857478380 857043147
2561.7 857043147 856774628 856890738 856915832 856591702 856285691 856241524 856116474 855670929 855297625 855299890
2582.1 855299890 855272532 854876041 854493916 854419708 854265094 853767753 853335142 853253305 853123069 852640212
2602.5H52640212m54605j28806j83999n40793n20945j77622j83582n09560n00858k05695
2622.9H49233747k55824n85019n58675j83999j50740n07832n26666j86444k12073n90265
2643.3H45476210n94020j91152j09136m60923n56111k85864k75552n85795o02781k31922
2663.7H41582954j12593m23610n59211l11554k40385m91023n10097k02358j45375m70758
2684.1H38115990n90980l22699k04087m57942n70357k94685j73569m76897o58870m12225
2704.5H33953679k94865o17325p96020n04434l04878n69939p82073n36442l45289o08385
2724.8H28594029p85291m93229k40206l95656n43714l63111k50578m95136o47723l80874
2745.2H23998511j94192m75168p19190n33104l79324o38842q48473n78403l40402n98490
$$ plain form
2602.5 852640212 852185607 852056801 851872802 851332009 850811064 850633442 850449860 849940300 849439442 849233747
2622.9 849233747 848977923 848392904 847834229 847650230 847499490 846991658 846464992 846278548 846066475 845476210
2643.3 845476210 844882190 844691038 844581902 844120979 843564868 843279004 843003452 842417657 841814876 841582954
2663.7 841582954 841470361 841046751 840487540 840175986 839935601 839444578 838934481 838732123 838586748 838115990
2684.1 838115990 837525010 837202311 836998224 836540282 835969925 835675240 835501671 835024774 834365904 833953679
2704.5 833953679 833658814 833041489 832245469 831741035 831436157 830866218 830084145 829547703 829202414 828594029
2724.8 828594029 827808738 827315509 827075303 826679647 826135933 825772822 825522244 825027108 824379385 823998511
2745.2 823998511 823804319 823329151 822609961 822076857 821697533 821058691 820210218 819631815 819291413 818692923
2765.6H18692923q47578o88971n33938p30932r48727q09789o52253q65162j077771
2784H11537802q97228o88434r10282j211643j076818q39949j021027j323104j248896
2802.3H02320421j082003j278818j520693j394511j255512j501858j814842j807988
2818.7G90664196j740038k015353k426684k571463k689123l229380m048645m794002
2835G67149508n688667p198990r037912j0628521j2137234j3605297j3823747j1385739
2851.3F83643401o450057q37505L524124N723417N674362L854752J372874m96388j101494
2869.7F94907486n59389N63979J481116J510143N34654r12667k208769l190815m038811
2888F88086927m740715n040586n024016n115747n385995n546928n672157o150007p004559
$$ plain form
2765.6 818692923 817845345 817156374 816622436 815891504 814942777 814132988 813480735 812615573 811537802
2784 811537802 810640574 809952140 809041858 807830215 806753397 805913448 804892421 803569317 802320421
2802.3 802320421 801238418 799959600 798438907 797044396 795788884 794287026 792472184 790664196
2818.7 790664196 788924158 786908805 784482121 781910658 779221535 775992155 771943510 767149508
2835 767149508 761460841 754261851 745223939 734595418 722458184 708852887 695029140 683643401
2851.3 683643401 677193344 676355839 679879963 685603380 691277742 695132494 696505368 696008980 694907486
2869.7 694907486 694348097 694912076 696393192 697903335 698437989 697525322 695316553 692125738 688086927
2888 688086927 683346212 678305626 673281610 668165863 662779868 657232940 651560783 645410776 638406217
2906.4F38406217q004606r245872j0996938j2962758j4225841j4096856j2385249q898914
2922.7E47589183l880382J446784N685031Q346975R922445J0834575J0918140J0082483
2939F00945234Q648396O757200M253983J493335o46532j604855j440048l53158J532078
2957.4F19585633L690899N387008O470382P221103P617116P378042O580650N627096
2973.7F69557929M760146L980041L183901K436519J955270J624167J188338Q41975
2990F89528286P02620L61443k30611o95765r24051j048445j242876j334012j081169
3008.3F84035420q48352j009286j278043j326918j341462j484514j572370j557529
3024.7F73616946j629412j793802j855016j791000j877725k152741k230227k067745
$$ plain form
2906.4 638406217 630401611 621155739 610158801 597196043 582970202 568873346 556488097 547589183
2922.7 547589183 543708801 545155585 550840616 559187591 569110036 579944611 590862751 600945234
2939 600945234 609593630 616350830 620604813 622098148 621451616 619846761 618406713 618053555 619585633
2957.4 619585633 623276532 628663540 635133922 642355025 649972141 657350183 663930833 669557929
2973.7 669557929 674318075 678298116 681482017 683918536 685873806 687497973 688686311 689528286
2990 689528286 690230906 690592349 690361738 689665973 688741922 687693477 686450601 685116589 684035420
3008.3 684035420 683187068 682177782 680899739 679572821 678231359 676746845 675174475 673616946
3024.7 673616946 671987534 670193732 668338716 666547716 664669991 662517250 660287023 658219278
3041F58219278k077162k371133k575755k447545k343357k499342k587318k515078k473235
3059.3F36329353k488792k483010k380014k326965k490759k614021k446235k201318
3075.6F16898239k202154k420127k523601k504826k638697k728224k582133k543270
3092E96755207k694965k743423k641260k636970k866923l011406k826750k681553k887667
3110.3E71764290l084302k965510k863526l030956l301203l424406l356337l302694
3126.6E46435356l325343l367603l431022l444016l398061l393292l495991l644824
3143E18935204l708184l644169l508865l502787l725349l869921l772378l720910l803372
3161.3D85679269l852159l869235l948838m007131l900945l775865l825545l938675
$$ plain form
3041 658219278 656142116 653770983 651195228 648747683 646404326 643904984 641317666 638802588 636329353
3059.3 636329353 633840561 631357551 628977537 626650572 624159813 621545792 619099557 616898239
3075.6 616898239 614696085 612275958 609752357 607247531 604608834 601880610 599298477 596755207
3092 596755207 594060242 591316819 588675559 586038589 583171666 580160260 577333510 574651957 571764290
3110.3 571764290 568679988 565714478 562850952 559819996 556518793 553094387 549738050 546435356
3126.6 546435356 543110013 539742410 536311388 532867372 529469311 526076019 522580028 518935204
3143 518935204 515227020 511582851 508073986 504571199 500845850 496975929 493203551 489482641 485679269
3161.3 485679269 481827110 477957875 474009037 470001906 466100961 462325096 458499551 454560876
3177.6D54560876l933370l885836l904223l909737l836662l751903l742725l793001
3193.9D23803419l800750l717422l632307l615499l587633l456176l367752l413110
3210.3C95212770l410459l330261l294408l296852l239721l116399l038585l046722
3226.6C69439363l029763k904952k777457k819598k888322k778947k631485k541125
3242.9C47067714k457857k407790k421856k402722k298385k205074k195209k214730
3259.2C28464091k178669k137453k167463k173781k059251k009899k121299k210558
3275.5C11405718k207964k156616k107828k103776k122551k097100j996845j955510
3291.8B94657528k064347k189249k235442k184093k051383j946181j973987k129674
$$ plain form
3177.6 454560876 450627506 446741670 442837447 438927710 435091048 431339145 427596420 423803419
3193.9 423803419 420002669 416285247 412652940 409037441 405449808 401993632 398625880 395212770
3210.3 395212770 391802311 388472050 385177642 381880790 378641069 375524670 372486085 369439363
3226.6 369439363 366409600 363504648 360727191 357907593 355019271 352240324 349608839 347067714
3242.9 347067714 344609857 342202067 339780211 337377489 335079104 332874030 330678821 328464091
3259.2 328464091 326285422 324147969 321980506 319806725 317747474 315737575 313616276 311405718
3275.5 311405718 309197754 307041138 304933310 302829534 300706983 298609883 296613038 294657528
3291.8 294657528 292593181 290403932 288168490 285984397 283933014 281986833 280012846 277883172
3308.2B77883172k268493k267301k169848k093345k085030k089977k006084j914948
3324.5B60988146j986086k056361j988738j947165j884758j733646j713455j812264
3340.8B45865673j827613j811489j741812j569509j555607j704097j729578j598090
3357.1B32327878j455038j389563j307846j139581j081451j235962j427457j372486
3373.4B21918494j051203q13395p64921p75725p19681n37559k63066Q047k1115l23832
3393.8B16656044l31655R2149L64512R5874k53156q6248K99946M44874M11972L46184
3414.2B18040496L34770M77790O73607P52137Q06286R73419J183182J224398J299546
3432.6B25765631J492112J384780J115486J153112J399383J615777J784027J808599
$$ plain form
3308.2 277883172 275614679 273347378 271177530 269084185 266999155 264909178 262903094 260988146
3324.5 260988146 259002060 256945699 254956961 253009796 251125038 249391392 247677937 245865673
3340.8 245865673 244038060 242226571 240484759 238915250 237359643 235655546 233925968 232327878
3357.1 232327878 230872840 229483277 228175431 227035850 225954399 224718437 223290980 221918494
3373.4 221918494 220867291 220053896 219288975 218513250 217793569 217256010 216992944 217000991 216979876 216656044
3393.8 216656044 216324389 216416538 216781050 216876924 216623768 216537520 216837466 217282340 217694312 218040496
3414.2 218040496 218375266 218853056 219526663 220278800 221085086 222058505 223241687 224466085 225765631
3432.6 225765631 227257743 228642523 229758009 230911121 232310504 233926281 235710308 237518907
3448.9B37518907J806765J946524K107412K220526K311260K268046K295792K628267
3465.2B55103499K846420K581894K203405K249479K546847K824366K887905K674341
3481.5B75918156K688408L020227L113478K971679L012955L173650L274828L257215
3497.8C00430596L291130L429830L356785L181517L300875L597975L803492L753632
3514.2C28145832L566891L654599M008830M331827M214197L880650L928095M158020
3530.5C59888941M302740M545123M688620M529327M588306M904419N008608M735679
3546.8C97191763M531860M773706N080939N111545N118609N302429N419910N357921
3563.1D37888682N486458O014646O164014N813002N725652N959899O196409O408364
$$ plain form
3448.9 237518907 239325672 241272196 243379608 245600134 247911394 250179440 252475232 255103499
3465.2 255103499 257949919 260531813 262735218 264984697 267531544 270355910 273243815 275918156
3481.5 275918156 278606564 281626791 284740269 287711948 290724903 293898553 297173381 300430596
3497.8 300430596 303721726 307151556 310508341 313689858 316990733 320588708 324392200 328145832
3514.2 328145832 331712723 335367322 339376152 343707979 347922176 351802826 355730921 359888941
3530.5 359888941 364191681 368736804 373425424 377954751 382543057 387447476 392456084 397191763
3546.8 397191763 401723623 406497329 411578268 416689813 421808422 427110851 432530761 437888682
3563.1 437888682 443375140 449389786 455553800 461366802 467092454 473052353 479248762 485657126
3579.4D85657126O594240O696403O874949P046580O850481O585420O853640P192552
3595.7E40351391P196963P240057P332325P238924P183969P490099P654786P515490
3612.1E99204004P412195P264435P454753P661343P083833O588757O746411P487178
3628.4F56902909P512450O547452O375432O449103O255686O149233O006419N782426
3644.7G07981110N788028O109714N776286M664660M283667M638671M542351M086972
3661G47871459L756642L617227L652513L710389L418982K864421K635717K417684K157867
3679.4G76102901K201616K409458K558291K614439K266586J631021J412869J457512
3695.7G92654693J506329J570761J552462J337469J223683J340807J334965R89735
$$ plain form
3579.4 485657126 492251366 498947769 505822718 512869298 519719779 526305199 533158839 540351391
3595.7 540351391 547548354 554788411 562120736 569359660 576543629 584033728 591688514 599204004
3612.1 599204004 606616199 613880634 621335387 628996730 636080563 642669320 649415731 656902909
3628.4 656902909 664415359 670962811 677338243 683787346 690043032 696192265 702198684 707981110
3644.7 707981110 713769138 719878852 725655138 730319798 734603465 739242136 743784487 747871459
3661 747871459 751628101 755245328 758897841 762608230 766027212 768891633 771527350 773945034 776102901
3679.4 776102901 778304517 780713975 783272266 785886705 788153291 789784312 791197181 792654693
3695.7 792654693 794161022 795731783 797284245 798621714 799845397 801186204 802521169 803510904
3712H03510904P41065Q14855R62138R78470Q21173O89268N97418N91874Q33034J161099
3732.4H11701298J072049N84602L80814N23091N77688M79996N12660M73320K36750
3750.7H16542268K08020M43220N32389L69191J91092K81871M58121M49777K94328J31905
3771.1H19902182J64866L50416M43578K96831J53899K41577K51055J39892J95146L53634
3791.5H22493076M02034L84628L87490L12209J81914J72317J08957n0902j9014J88052
3811.9H24560761L46542L84867L58224J34885r9659n662M3928j6450R8526L59416N11587
3834.4H26676965L06189l8147j44124j62363j18315J04069M03881M97818k0384n10931
3854.8H26994658j24455J39952J41978J88768K38120K13981K8432j30654q0645j7464
$$ plain form
3712 803510904 804251969 805066824 806028962 807007432 807828605 808517873 809115291 809707165 810540199 811701298
3732.4 811701298 812773347 813357949 813738763 814261854 814839542 815319538 815832198 816305518 816542268
3750.7 816542268 816750288 817193508 817725897 818095088 818286180 818568051 819026172 819475949 819770277 819902182
3771.1 819902182 820067048 820417464 820861042 821157873 821311772 821553349 821804404 821944296 822139442 822493076
3791.5 822493076 822895110 823279738 823667228 823979437 824161351 824333668 824442625 824391723 824372709 824560761
3811.9 824560761 824907303 825292170 825650394 825785279 825685620 825679958 825723886 825707436 825805962 826165378 826676965
3834.4 826676965 826983154 826945007 826800883 826638520 826520205 826624274 827028155 827525973 827505589 826994658
3854.8 826994658 826870203 827010155 827152133 827340901 827579021 827793002 827821434 827690780 827610135 827592671
3875.2H27592671N7518R8288J18614J63495R179j50263r5904j32263j38819J37329
3895.5H27659845L92735L39628K3782k67804l14593k28763j52886K2769K68400K91705
3915.9H28034818N6684q2791m7624n5611p8380K1756R8884j7643r9361j2636Q3863
3938.4H27901959J37151P7009J5795J18733J16050o4194j12474k3663K8908L8087M5061
3960.8H28278422R8586J77145J49310L0875k7060k3723l278R5606J93834J78635J15752
3983.2H29264104J1862m6671K4677L5047K0266J14560J84595
3997.5H29608440
$$ plain form
3875.2 827592671 827650189 827748477 827867091 828030586 828039765 827889502 827793598 827661335 827522516 827659845
3895.5 827659845 828052580 828392208 828415990 828148186 827833593 827604830 827451944 827474713 827743113 828034818
3915.9 828034818 828091502 828008711 827961087 827905476 827827096 827848852 827947736 827930093 827830732 827818096 827901959
3938.4 827901959 828039110 828116119 828131914 828250647 828366697 828302503 828190029 828166366 828195274 828233361 828278422
3960.8 828278422 828377008 828554153 828703463 828734338 828707278 828683555 828680277 828775883 828969717 829148352 829264104
3983.2 829264104 829275966 829229295 829253972 829289019 829309285 829423845 829608440
3997.5 829608440
##END=$$ End of the data block
