##TITLE=$$ Begin of the data block
##JCAMP-DX=5.00 $$ ACD/SpecManager v 10.08
##SPECTROMETER/DATA SYSTEM=Alpha
##DATE=15 Apr 2014 09:00:42
##DATA TYPE=INFRARED SPECTRUM
##DATA CLASS=XYDATA
##ORIGIN=
##OWNER=
##NPOINTS=1765
##FIRSTX=399.75695801
##LASTX=3997.56933594
##MAXX=3997.56933594
##MINX=399.75695801
##MAXY=0.86353177
##MINY=0.21584840
##XFACTOR=1.0000000000
##YFACTOR=1.000000000000000e-9
##FIRSTY=0.62371767
##DELTAX=2.03957629
##XUNITS=1/CM
##YUNITS=ARBITRARY UNITS
##XYDATA=(X++(Y..Y))
399.8 623717666 619938433 618808627 618778825 616228044 613401830 613854110 614865184 613041878 611014187
418.1 611014187 612019539 612151206 609076738 606912971 608020961 608401597 605725229 603713393 604331791
436.5 604331791 604053915 601971149 601844847 603582382 602739811 599720061 599219143 601090968 600969195
454.8 600969195 598947346 598869085 599832952 598143041 595504522 595676482 596715629 594840586 592095077
473.2 592095077 592193425 592861950 590977788 589024782 589927912 590805531 588635683 586501241 587246597
491.5 587246597 587615252 584835410 582364976 582932055 583098590 580427647 578532398 579167306 578567803
509.9 578567803 575429678 573618054 574354947 573725581 570529521 568699837 569178402 568081915 564606786
528.3 564606786 562658191 562881112 561722934 558873475 557885706 558777392 557954431 555463850 554726422
546.6 554726422 555557132 554525137 551771283 550581396 550654113 548787117 545580268 544116497 543598890
565 543598890 540944636 536925018 534660161 533439159 530304313 526156843 524046540 522878110 519797504
583.3 519797504 515913844 513727725 512143910 508636296 504313946 501815856 500054479 496523976
599.6 496523976 492298335 490012825 489138901 487597048 486042261 486008018 486319989 485606641 485996932
618 485996932 489711583 494558364 497587740 499798059 503609419 508028448 510997653 513805747 518407166
636.3 518407166 522926450 524564207 524494946 526129782 529813170 532824516 534481704 535633206 535273969
654.7 535273969 534483790 537906229 546093047 553695679 557193398 559161842 563878000 568118155 569563091
673.1 569563091 570928693 574386775 577901185 579056203 579901338 582783163 585655689 586138666 586198509
691.4 586198509 588171303 590036094 589547873 589049101 590936601 593078613 593266845 593614280 596215248
709.8 596215248 598858416 599368691 599862456 602490425 605177045 606009662 607351840 611060739 614535630
728.1 614535630 615578353 616579115 619647980 622359276 622646987 623056710 625764072 628394783 628824472
746.5 628824472 629440606 632377684 635230303 635901511 636921942 640392065 643636227 644470036 645560503
764.8 645560503 649100482 652281225 652832568 653379679 655934513 657718062 656567395 655297160 656276226
783.2 656276226 657042682 655741274 655404210 658301592 661770940 663831115 667243540 673859358 680432439
801.6 680432439 684427619 688498139 694708526 700011075 702165484 704172671 708276749 711395860
817.9 711395860 711127698 710321903 711080670 710438192 706384599 702115536 700062275 697571516 692693651
836.2 692693651 688418627 686736166 684622884 680156887 676593304 676632285 678232729 679758847 683916450
854.6 683916450 692394495 701768816 709174573 716891050 726861119 735942781 741446495 746120274
870.9 746120274 752531052 757847905 759543598 760634243 763651967 765537739 763877630 761858046
887.2 761858046 762114286 761912644 759184361 757275522 758863449 761058331 761287689 762130320 765631616
905.6 765631616 768571019 768225253 767257214 767917275 767290771 763139546 758607388 756550670 754823089
923.9 754823089 751684129 750079393 752109647 754680753 755015790 755408764 757998109 760163665 759662867
942.3 759662867 759080529 760604143 761531115 759459913 756666660 755093277 752212286 745935977 738534689
960.6 738534689 731757939 723055184 710406184 696072340 682195187 667616546 651945949 637958586
977 637958586 627231002 617482662 607340872 599399209 594815791 590595305 584966779 579839468
993.3 579839468 576772451 574381709 571278155 568668246 567576885 566168606 562473893 557341278
1009.6 557341278 552150130 546130359 538500965 530805349 524527669 518764019 512420595 506412089
1025.9 506412089 501787841 497683287 493094116 488855630 485980272 483652204 480742395 477815479
1042.2 477815479 475733399 473648995 470462739 466986150 464624435 463306963 462488294 462775260 464643031
1060.6 464643031 466633469 466697067 464593023 461100578 455990881 448899299 440853447 433023095 425104529
1078.9 425104529 416603267 408433437 401662111 395711809 389362425 382798016 377199799 373000562
1095.2 373000562 369972497 368399173 368644595 370067328 371534526 372787297 374291807 375894547
1111.6 375894547 376742244 376372963 374536484 370412081 364212006 359168112 358621001 361627519 364663363
1129.9 364663363 365585506 364691079 363903910 364732116 367224455 370701879 374233395 376988560 379024684
1148.3 379024684 381144971 383686334 386289746 389141500 393369406 399701983 407824785 417505443
1164.6 417505443 429095984 442288756 455616176 468042433 479947895 491626292 502187133
1178.9 502187133 510980129 518599033 525230885 529573441 530840278 530219257 529144168 527881265
1195.2 527881265 526913822 527857304 531551659 536722720 541870117 546978176 552083611 556002676 558091283
1213.5 558091283 559553683 561432481 563060522 563847601 564752400 566592634 568563163 569933772 571583450
1231.9 571583450 574266255 577049375 579041362 581023991 583745003 586229205 587472618 588245034
1248.2 588245034 589475632 590497315 590653598 590988934 592619002 594919503 597119212 600141406 604896069
1266.6 604896069 610400796 615506291 620878875 627385497 634065688 639763117 645274758 651709735
1282.9 651709735 658309340 663974404 669361055 675426960 681258261 685587764 689162970 693244219
1299.2 693244219 697085440 699456751 701211214 703677416 706081092 707149029 707682550 709037602
1315.5 709037602 710578024 711100996 711461306 713041306 714984596 715828300 716217756 717322886 718327761
1333.9 718327761 718048275 717345774 717618346 718236506 718059421 717816114 718660653 719771385 719697297 719050944
1354.3 719050944 719165921 719386578 718204618 715868533 713957369 712606907 710634172 708172441 706113815
1372.6 706113815 703834891 700887263 698599935 697526276 696554542 695500791 695360959 696103096 696520984
1391 696520984 695619226 693652749 691903472 689964652 686726928 682969213 679832339 677124918 673966646
1409.3 673966646 670751929 668783486 667957425 666814387 664896607 663730860 663417578 662568688 661284208
1427.7 661284208 660591960 660366774 659897864 659378052 659651816 660540521 661077023 661303043 662347078
1446 662347078 664145410 665343583 666080236 668028355 672468960 677945852 682360888 687350929 693941653
1464.4 693941653 701027274 708806455 719478250 732890248 743622482 749958277 755028188 759802163
1480.7 759802163 763065815 764622927 765966594 767169893 766478181 764407337 762749672 761092484
1497 761092484 757948458 754000664 751030684 748492122 743320346 736747444 731644094 727586508 723492384
1515.4 723492384 719211638 716026247 713568091 710356176 706667542 703475595 701311648 699112594
1531.7 699112594 695965946 693558037 692741811 691519916 688896120 687114060 686534941 686123312 685556471
1550.1 685556471 685791254 687236249 688828349 689304292 688445926 687643886 686475933 684392452 681868732
1568.4 681868732 678865850 675172806 670362473 663949072 657657325 651435435 644074798 636461914
1584.7 636461914 629189849 621464789 612939775 604570210 596783161 588918865 580655813 572648466
1601.1 572648466 565276325 557931244 550160110 542364776 535109997 528225601 520603776 512061656
1617.4 512061656 505240679 499524385 492912471 486461908 481123060 476381749 472404867 469410956
1633.7 469410956 467100859 465575516 464929044 465365440 467149079 470252603 473701537 476812661 481435925
1652 481435925 487983197 492943525 497598022 503906965 511781871 519721746 527013004 535552561 545530558
1670.4 545530558 554476261 563525319 573856831 583927631 593481600 603949964 616828740 628551662
1686.7 628551662 638132632 647729456 657428980 668504536 680140913 691032827 702866197 712905467
1703 712905467 720839679 728214264 735169530 742042124 748203337 753553391 759166539 764335454 767948866
1721.4 767948866 770941377 774549186 778678536 782334805 785254478 788615108 792019069 794164836
1737.7 794164836 795761108 797990978 801128328 804323733 807473660 811511636 816076338 819459140
1754 819459140 821776152 824246049 827128410 829345167 830472112 831988811 834384441 836263239 836880028
1772.4 836880028 837605894 839167893 840503156 841043234 841857791 843456745 844613492 845024884 845944524
1790.7 845944524 847617388 848528802 848556399 849062264 850400329 851190746 851007521 851258934 852543771
1809.1 852543771 853466570 853241742 853306472 854390681 855197787 855074167 855279922 856455028 857346237
1827.4 857346237 857120574 856879950 857612252 858262002 857933521 857765973 858761609 859712005 859375834 859030485
1847.8 859030485 859707892 860354185 860030532 859746635 860471666 861192226 860875249 860569894 861390352 862230659
1868.2 862230659 861726761 861093998 861647248 862393796 862108469 861629903 862131894 862813652 862572789 862139821
1888.6 862139821 862591684 863229096 862897038 862274766 862636626 863299727 862989187 862392187 862787187 863505244
1909 863505244 863204300 862521470 862822413 863531768 863267481 862635553 862904549 863480031 863152623 862432241
1929.4 862432241 862566054 863129795 862828434 862099946 862298906 862986982 862683058 861789525 861750662 862245560
1949.8 862245560 861941755 861108840 861083388 861628592 861380875 860528886 860463858 861009181 860724330 859802067
1970.2 859802067 859684408 860228062 860031664 859164953 858983338 859447539 859253049 858466625 858376145 858903289
1990.6 858903289 858668089 857706308 857436180 857882440 857710421 856860578 856636345 857078791 856890738 856010735
2011 856010735 855729520 856164038 856006980 855084240 854696453 855068922 854945421 854069352 853678346 854058743
2031.4 854058743 853968918 853114724 852766693 853238225 853230596 852361977 851907730 852276802 852252007 851410627
2051.8 851410627 850966334 851378679 851433635 850632846 850176394 850597024 850729048 850038648 849671125 850174010
2072.2 850174010 850377500 849691808 849282622 849785805 850075841 849485397 849109232 849612057 849918783 849330306
2092.6 849330306 848901212 849364281 849710345 849210083 848858237 849385619 849793136 849291027 848827958 849248707
2113 849248707 849656343 849197626 848784685 849321723 849905789 849579751 849168241 849610388 850133359 849819362
2133.4 849819362 849438190 849907815 850476861 850185752 849743009 850167036 850787103 850554049 850105047 850490749
2153.8 850490749 851108551 850912809 850464165 850838900 851529717 851416528 850941539 851241946 851929188 851893425
2174.2 851893425 851479709 851747632 852358103 852265775 851841211 852141798 852783442 852689326 852214515 852439404
2194.6 852439404 853032589 852920532 852402449 852569759 853188634 853146791 852635384 852759898 853360116 853367269
2215 853367269 852892578 852969766 853503287 853453994 852930605 852970183 853465140 853392422 852844715 852859139 853388131
2237.4 853388131 853399694 852871180 852798760 853239715 853214860 852661848 852575719 853044808 853073597 852552652
2257.8 852552652 852448344 852882445 852896333 852365315 852271676 852804065 853001356 852603316 852544904 853058696
2278.2 853058696 853209078 852812707 852782011 853302598 853479445 853038013 852862656 853308320 853487611 853019536
2298.6 853019536 852783859 853183031 853328705 852787733 852418840 852671504 852746129 852172434 851690114 851756990
2319 851756990 851687670 851046443 850563586 850698531 850723982 850171566 849809945 850113690 850356460 850079894
2339.4 850079894 850010812 850708663 851599097 852069676 852136254 851884127 851144433 849901974 848981500 849091470
2359.8 849091470 849604547 849810004 850305974 851625621 852980852 853707910 854427636 855704188 856930673
2378.1 856930673 857525349 857985556 858839571 859579623 859620631 859446645 859733343 860119462 860012352 859796345
2398.5 859796345 860067308 860485375 860445380 860228658 860443592 860825121 860745490 860480607 860671461 861030638
2418.9 861030638 860923588 860612333 860715568 861025095 860929310 860619605 860730648 861063004 860969841 860648930
2439.3 860648930 860744476 861074090 860993683 860667765 860737383 861051381 860980749 860679328 860736191 860977888
2459.7 860977888 860819280 860452116 860520601 860858798 860811472 860466659 860420406 860625148 860512793 860139787
2480.1 860139787 860092103 860350072 860335112 860010266 859926701 860108972 860008061 859653652 859626472 859912753
2500.5 859912753 859918475 859574080 859463930 859667182 859595656 859209299 859089196 859283328 859233558 858888686
2520.9 858888686 858802974 859018087 858971298 858593047 858439207 858608842 858574986 858239174 858103275 858250201
2541.3 858250201 858165205 857763112 857606530 857835948 857885718 857558191 857366741 857495606 857434988 857011855
2561.7 857011855 856731236 856789351 856755257 856429696 856198549 856227219 856095374 855633020 855284810 855275393
2582.1 855275393 855181158 854751408 854358017 854245603 854072213 853592992 853192449 853155792 853053272 852551222
2602.5 852551222 852073669 851937234 851725876 851159632 850655615 850524902 850386679 849894226 849374950 849135518
2622.9 849135518 848845482 848242879 847702265 847552538 847422123 846925735 846395671 846162200 845915198 845361352
2643.3 845361352 844820857 844643533 844503641 843980610 843369901 843075812 842809677 842232466 841666520 841456354
2663.7 841456354 841320992 840887070 840354204 840073407 839829504 839305103 838755190 838528812 838410437 837983906
2684.1 837983906 837411821 837114990 836929739 836433768 835805953 835496485 835315943 834808290 834149003 833760738
2704.5 833760738 833461523 832847655 832093835 831630170 831338465 830764592 829973161 829410553 829025567 828425825
2724.8 828425825 827711284 827261269 826988161 826543510 826002479 825664818 825397372 824863076 824219465 823865592
2745.2 823865592 823668540 823184013 822475314 821959615 821591675 820948839 820083857 819496036 819168627 818611622
2765.6 818611622 817825019 817192733 816663444 815864146 814839661 814004779 813372076 812535465 811467469
2784 811467469 810550392 809821069 808887661 807684481 806635559 805817068 804793596 803467929 802212596
2802.3 802212596 801106811 799826622 798327565 796938479 795680225 794185758 792389393 790597916
2818.7 790597916 788839996 786768317 784306169 781755507 779105008 775885105 771824121 767023385
2835 767023385 761320412 754097819 745037854 734394729 722245038 708611846 694764018 683385611
2851.3 683385611 676959217 676148295 679700494 685432851 691094220 694953382 696342707 695849478 694761872
2869.7 694761872 694234312 694814920 696288824 697793722 698322415 697396398 695215464 692085385 688060880
2888 688060880 683291078 678238750 673206389 668064713 662662685 657118320 651469707 645332754 638292372
2906.4 638292372 630248964 620988727 609972060 597005486 582780957 568643630 556239903 547406137
2922.7 547406137 543610811 545097172 550812662 559199691 569137096 579971731 590887129 600971162
2939 600971162 609642208 616407752 620639741 622110963 621433020 619779825 618312895 617990971 619578898
2957.4 619578898 623298407 628678560 635101259 642278969 649923086 657366574 663975656 669601440
2973.7 669601440 674351394 678299367 681461215 683886051 685811341 687411070 688603997 689490974
2990 689490974 690240622 690600991 690379560 689732254 688849568 687813997 686552525 685193300 684094369
3008.3 684094369 683248222 682262123 680984795 679631948 678274512 676777244 675183058 673620999 672012389
3026.7 672012389 670264423 668453693 666674435 664784014 662613928 660389900 658325493 656215668
3043 656215668 653823793 651263714 648817003 646445155 643909991 641287744 638754189 636277795 633784473
3061.4 633784473 631313860 628998876 626729190 624220073 621566355 619103372 616888762 614666641
3077.7 614666641 612242758 609728217 607220531 604599535 601916015 599342465 596778989 594088435
3094 594088435 591354012 588702261 586061835 583212674 580203474 577370644 574690640 571754932 568619311
3112.4 568619311 565688670 562879264 559859037 556565583 553140700 549756706 546428323 543072522
3128.7 543072522 539677203 536245525 532798529 529404998 526061714 522626817 519007146 515285850
3145 515285850 511609495 508059323 504512668 500773311 496917069 493127018 489350498 485511512 481674969
3163.4 481674969 477839589 473898888 469886065 465971410 462171823 458345592 454418659 450490117
3179.7 450490117 446606219 442665815 438712329 434906036 431217045 427482545 423657835 419846535
3196 419846535 416121066 412427843 408766299 405238599 401828349 398401439 394962579 391575426 388236940
3214.3 388236940 384956121 381721795 378530324 375368774 372226417 369145036 366141319 363228530
3230.7 363228530 360403210 357541472 354649633 351902097 349282056 346722186 344265789 341889322
3247 341889322 339480221 337054342 334725738 332491010 330283314 328062057 325841397 323661834 321509570
3265.3 321509570 319394201 317380130 315373391 313240349 311031848 308845878 306733787 304639667
3281.6 304639667 302475184 300281167 298168242 296178490 294206172 292127252 289977580 287822425
3298 287822425 285658777 283534110 281520903 279563725 277486891 275228113 272919357 270691186 268552303
3316.3 268552303 266460359 264435679 262487233 260537595 258538306 256520212 254517555 252548873
3332.6 252548873 250690013 248973474 247251779 245415822 243559569 241739854 240007564 238451630
3348.9 238451630 236886621 235146075 233418226 231848568 230366886 228936091 227596208 226418704
3365.3 226418704 225386545 224276319 222905025 221493840 220385104 219534561 218741804 217948914 217259720
3383.6 217259720 216791108 216567576 216558650 216523126 216203958 215848401 215923369 216295674 216374800 216098994
3404 216098994 216018409 216323137 216762498 217179596 217526481 217857152 218339682 218993336 219740048 220646471
3424.4 220646471 221739650 222954154 224157289 225408956 226863250 228246197 229334936 230441347
3440.7 230441347 231850877 233515650 235293418 237055659 238857493 240816787 242950395 245239869
3457 245239869 247618288 249908417 252169877 254751295 257586628 260182828 262376755 264579087 267110825
3475.4 267110825 269961119 272887677 275624126 278342843 281314760 284362167 287320226 290346503
3491.7 290346503 293528795 296830922 300109684 303403229 306873083 310312837 313546300 316850007
3508 316850007 320441812 324244827 328030735 331664026 335340321 339287162 343552798 347774118 351688206
3526.4 351688206 355631053 359803915 364100546 368618518 373289794 377811193 382390887 387294263
3542.7 387294263 392344385 397174329 401776463 406515360 411535352 416659474 421806425 427115738
3559 427115738 432580054 438017368 443534553 449505568 455596656 461370945 467114389 473134816 479418784
3577.4 479418784 485875398 492472440 499176413 506035626 513038039 519862771 526427746 533255756
3593.7 533255756 540475309 547790051 555164039 562548399 569776654 576961756 584486902 592184901
3610 592184901 599723876 607114375 614301205 621696949 629417360 636609137 643227339 649924934 657339036
3628.4 657339036 664831400 671390176 677771688 684274077 690570235 696684778 702661514 708454728
3644.7 708454728 714248061 720298827 725998521 730662704 734961390 739612937 744191349 748282373
3661 748282373 752021194 755620003 759189188 762795806 766238809 769179583 771813571 774173141 776281238
3679.4 776281238 778496325 780968070 783560216 786144674 788353622 789941430 791339636 792834997
3695.7 792834997 794426560 796047032 797536612 798812985 800069571 801420867 802658796 803567648
3712 803567648 804361045 805250585 806241274 807227373 808010817 808619380 809197187 809844971 810693800 811809480
3732.4 811809480 812840939 813419163 813853562 814451694 815003693 815328002 815763474 816349089 816776037
3750.7 816776037 817040622 817394853 817831218 818136632 818306386 818607807 819117963 819636703 819971144 820106983
3771.1 820106983 820236146 820543349 820987880 821336329 821579278 821848750 822018623 822110653 822347403 822733521
3791.5 822733521 823125482 823481321 823837578 824104488 824219584 824346840 824455619 824468434 824560702 824818075
3811.9 824818075 825167894 825527489 825838089 825920224 825812757 825852513 825969398 826029778 826120615 826385438
3832.3 826385438 826874793 827190578 827096581 826999307 826955259 826831102 826875508 827270031 827706218 827561677
3852.7 827561677 827106237 827143013 827326119 827445209 827666581 827948570 828107953 828020990 827811301 827724457
3873.1 827724457 827741444 827846169 828019083 828196943 828344762 828323543 828212857 828168929 828005373 827792287
3893.5 827792287 827895224 828312337 828696430 828715086 828390837 828044295 827865243 827796698 827843726 828078091
3913.9 828078091 828346431 828384519 828278005 828238130 828184247 828062057 828046978 828208923 828359365 828320384
3934.3 828320384 828192651 828172386 828262389 828304887 828301370 828403056 828557134 828573942 828494370 828510582 828599334
3956.7 828599334 828649819 828687906 828762591 828875124 828968763 829010785 829040408 829079866 829098344 829091430 829157054
3979.2 829157054 829355955 829570055 829641521 829631507 829672635 829710662 829702258 829757810 829918742
3997.5 829918742
##END=$$ End of the data block
