##TITLE=$$ Begin of the data block
##JCAMP-DX=5.00 $$ ACD/SpecManager v 10.08
##SPECTROMETER/DATA SYSTEM=Alpha
##DATE=15 Apr 2014 09:00:42
##DATA TYPE=INFRARED SPECTRUM
##DATA CLASS=XYDATA
##ORIGIN=
##OWNER=
##NPOINTS=1765
##FIRSTX=399.75695801
##LASTX=3997.56933594
##MAXX=3997.56933594
##MINX=399.75695801
##MAXY=0.86373913
##MINY=0.21570756
##XFACTOR=1.0000000000
##YFACTOR=1.000000000000000e-9
##FIRSTY=0.62358689
##DELTAX=2.03957629
##XUNITS=1/CM
##YUNITS=ARBITRARY UNITS
##XYDATA=(X++(Y..Y))
$$ plain form
399.8 623586893 619297266 618417740 618838429 616421163 613548994 613742054 614357769 612394810 610410869
418.1 610410869 611221015 611299634 608657897 606816947 607679009 607456684 604412556 602717042 603790283
436.5 603790283 603575587 601327002 600682497 601889253 601287186 599107504 599319935 601319134 600743413
454.8 600743413 598344982 598307490 599222481 597451448 594917297 595111549 596080542 594226301 591550529
473.2 591550529 591696978 592256010 590119123 588021219 588749945 589438200 587439358 585680902 586533189
491.5 586533189 586762607 584005654 581768632 582481861 582548499 579661191 577635050 578359604 578022242
509.9 578022242 575075328 573292911 573893547 573018074 569764733 567990780 568277121 566910386 563509226
528.3 563509226 561953485 562472343 561334193 558391094 557294488 558125615 557368934 554976523 554223955
$$ packed form
399.8F23586893m289627q79526M20689k417266k872169J93060O15715j962959j983941
418.1F10410869Q10146P8619k641737j840950Q62062k22325l044128j695514J073241
436.5F03790283k14696k248585o44505J206756o02067k179682K12431J999199n75721
454.8F00743413k398431l7492R14991j771033k534151J94252R68993j854241k675772
473.2E91550529J46449N59032k136887k097904P28726O88255j998842j758456Q52287
491.5E86533189K29418k756953k237022P13229O6638k887308k026141P24554l37362
509.9E78022242k946914j782417O00636q75473l253341j773953K86341j366735l401160
528.3E63509226j555741N18858j138150k943099j096606Q31127p56681k392411p52568
$$ plain form
546.6 554223955 554940939 553781688 551055670 550043464 550266683 548520923 545328319 543724298 543046057
565 543046057 540299416 536311090 534170866 533079505 529969156 525650918 523332655 522217631 519415140
583.3 519415140 515779495 513749897 512187600 508596122 504154861 501471102 499586791 496104956
599.6 496104956 492006868 489767432 488846362 487325609 485839039 485784560 486082792 485480100 485988736
618 485988736 489771187 494633019 497564942 499662846 503393233 507758915 510836244 513821363 518467903
636.3 518467903 522955596 524555922 524473071 526113212 529796839 532855153 534521878 535568476 535073996
654.7 535073996 534238517 537770450 546111524 553790212 557241559 559088886 563833654 568145573 569556534
673.1 569556534 570968211 574568510 578145802 579263210 580096424 583041489 585900187 586280465 586355627
$$ packed form
546.6E54223955P16984j159251k726018j012206K23219j745760l192604j604021o78241
565E43046057k746641l988326k140224j091361l110349m318238k318263j115024k802491
583.3E19415140l635645k029598j562297l591478m441261k683759j884311l481835
599.6D96104956m098088k239436r21070j520753j486570n4479K98232o02692N08636
618D85988736L782451M861832K931923K097904L730387M365682L077329K985119M646540
636.3E18467903M487693J600326q2851J640141L683627L058314J666725J046598m94480
654.7E35073996q35479L531933Q341074P678688L451347J847327M744768M311919J410961
673.1E69556534J411677L600299L577292J117408Q33214K945065K858698L80278P5162
$$ plain form
691.4 586355627 588414371 590271771 589749157 589267254 591188252 593306243 593412161 593762100 596456230
709.8 596456230 599129915 599602222 600045145 602634072 605345666 606219471 607559323 611310899 614883125
728.1 614883125 615963578 616895854 619837165 622454345 622733951 623238802 626075566 628739059 629160404
746.5 629160404 629816115 632771194 635597706 636267781 637293041 640676558 643775880 644584239 645754516
764.8 645754516 649280965 652396977 652963877 653546631 656069338 657784820 656656981 655512512 656586587
783.2 656586587 657350540 656006813 655616462 658428013 661874712 664026499 667505145 674068749 680543244
801.6 680543244 684539974 688676476 694822133 699972510 702094078 704211295 708422542 711538494
817.9 711538494 711194217 710361362 711134374 710443199 706359863 702167153 700154364 697621405 692797363
$$ packed form
691.4E86355627K058744J857400n22614m81903J920998K117991J05918L49939K694130
709.8E96456230K673685M72307M42923K588927K711594Q73805J339852L751576L572226
728.1F14883125J080453R32276K941311K617180K79606N04851K836764K663493M21345
746.5F29160404O55711K955079K826512O70075J025260L383517L099322Q08359J170277
764.8F45754516L526449L116012N66900N82754K522707J715482j127839j144469J074075
783.2F56586587P63953j343727l90351K811551L446699K151787L478646O563604O474495
801.6F80543244L996730M136502O145657N150377K121568K117217M211247L115952
817.9G11538494l44277q32855P73012o91175m083336m192710k012789k532959m824042
$$ plain form
836.2 692797363 688663721 687021315 684857309 680386782 676911652 677035570 678605199 680075467 684230626
854.6 684230626 692651868 701916754 709261715 716969669 726947546 736009240 741497159 746242821
870.9 746242821 752699435 757933676 759548068 760640204 763698339 765582383 763862431 761860430
887.2 761860430 762217581 762026072 759228170 757290184 758890390 761100769 761323452 762152016 765629232
905.6 765629232 768505633 768124104 767196476 767898917 767254651 763099611 758656323 756658733 754864991
923.9 754864991 751661777 750084937 752143502 754647970 754882097 755241454 757832766 759958148 759455562
942.3 759455562 758968353 760531902 761377156 759235263 756506801 755040109 752126336 745768070 738407612
960.6 738407612 731688917 722925007 710203290 695902705 682095826 667524874 651860237 637966633
$$ packed form
836.2F92797363m133642j642406k164006m470527l475130J23918J569629J470268M155159
854.6F84230626Q421242R264886P344961P707954R977877R061694N487919M745662
870.9G46242821O456614N234241J614392J092136L058135J884044j719952k002001
887.2G61860430L57151j91509k797902j937986J600206K210379K22683Q28564L477216
905.6G65629232K876401l81529r27628P02441o44266m155040m443288j997590j793742
923.9G54864991l203214j576840K058565K504468K34127L59357K591312K125382n02586
942.3G59455562m87209J563549Q45254k141893k728462j466692k913773o358266p360458
960.6G38407612o718695q763910j2721717j4300585j3806879j4570952j5664637j3893604
$$ plain form
977 637966633 627306521 617513478 607337534 599395037 594775796 590546012 584964752 579845428
993.3 579845428 576682091 574165225 571013331 568409979 567261517 565720737 561941922 556810915
1009.6 556810915 551624238 545579076 537962317 530344665 524153054 518460035 512186587 506259799
1025.9 506259799 501714230 497637987 493034571 488836288 486057609 483762771 480827361 477934718
1042.2 477934718 475942910 473903477 470724553 467274994 464943081 463622481 462762803 463017166 464871883
1060.6 464871883 466815770 466825217 464710861 461196899 456018418 448904455 440955013 433240920 425351888
1078.9 425351888 416817427 408607244 401803911 395819932 389477342 382984221 377450228 373260051
1095.2 373260051 370199263 368606240 368881017 370323569 371769369 373030871 374590605 376233041
$$ packed form
977F37966633j0660112r793043j0175944p942497m619241m229784n581260n119324
993.3E79845428l163337k516866l151894k603352j148462j540780l778815n131007
1009.6E56810915n186677o045162p616759p617652o191611n693019o273448n926788
1025.9E06259799m545569m076243m603416m198283k778679k294838k935410k892643
1042.2D77934718j991808k039433l178924l449559k331913j320600q59678K54363J854717
1060.6D64871883J943887R447k114356l513962n178481p113963p949442p714093p889032
1078.9D25351888q534461q210183o803333n983979o342590o493121n533993m190177
1095.2C73260051l060788j593023K74777J442552J445800J261502J559734J642436
$$ plain form
1111.6 376233041 377081662 376689166 374815017 370653152 364438593 359379232 358752221 361638337 364655733
1129.9 364655733 365692884 364901990 364124328 364921778 367402941 370880604 374402910 377140105 379137963
1148.3 379137963 381203890 383710802 386313796 389183581 393425256 399751067 407858908 417544335
1164.6 417544335 429159880 442361474 455667526 468077421 479978114 491619825 502116740
1178.9 502116740 510883212 518519104 525144398 529444575 530682564 530055523 528960586 527656615
1195.2 527656615 526686907 527682364 531409085 536576748 541746199 546898425 552007437 555884123 557923734
1213.5 557923734 559360981 561248660 562886953 563667178 564602911 566507638 568497896 569856286 571515381
1231.9 571515381 574216783 576999247 578994989 581031501 583819926 586294472 587505996 588325977
$$ packed form
1111.6C76233041Q48621l92496j874149m161865o214559n059361o27011K886116L017396
1129.9C64655733J037151p90894p77662P97450K481163L477663L522306K737195J997858
1148.3C79137963K065927K506912K602994K869785M241675O325811Q107841R685427
1164.6D17544335J1615545J3201594J3306052J2409895J1900693J1641711J0496915
1178.9E02116740Q766472P635892O625294M300177J237989o27041j094937j303971
1195.2E27656615r69708R95457L726721N167663N169451N152226N109012L876686K039611
1213.5E57923734J437247J887679J638293P80225R35733J904727J990258J358390J659095
1231.9E71515381K701402K782464J995742K036512K788425K474546J211524Q19981
$$ plain form
1248.2 588325977 589620173 590648293 590785444 591123343 592753112 595018268 597189486 600198448 604903817
1266.6 604903817 610317588 615341485 620664358 627131581 633799672 639527798 645060778 651489377
1282.9 651489377 658067942 663698256 669077933 675175369 681018353 685347199 688975632 693128526
1299.2 693128526 696989775 699367642 701171339 703701138 706098676 707097590 707613349 709015846 710582495
1317.6 710582495 711096644 711442947 713001609 714939237 715828538 716284215 717413068 718378305 718059003
1335.9 718059003 717371702 717664063 718252659 718034208 717809856 718713105 719825268 719720602 719099939
1354.3 719099939 719247937 719429612 718188226 715866327 714018643 712669075 710655332 708209217 706188977
1372.6 706188977 703896821 700921118 698649704 697606504 696615040 695499063 695345342 696130455 696539402
$$ packed form
1248.2E88325977J294196J028120J37151L37899J629769K265156K171218L008962M705369
1266.6F04903817N413771N023897N322873O467223O668091N728126N532980O428599
1282.9F51489377O578565N630314N379677O097436N842984M328846L628433M152894
1299.2F93128526L861249K377867J803697K529799K397538R98914N15759J402497J566649
1317.6G10582495N14149L46303J558662J937628Q89301M55677J128853R65237l19302
1335.9G18059003o87301K92361N88596k18451k24352R03249J112163j04666o20663
1354.3G19099939J47998J81675j241386k321899j847684j349568k013743k446115k020240
1372.6G06188977k292156k975703k271414j043200r91464j115977j53721P85113M08947
$$ plain form
1391 696539402 695595801 693653822 691966474 690035105 686748981 682958424 679842055 677168608 674030960
1409.3 674030960 670850754 668911219 668053746 666847408 664916277 663791835 663506627 662648559 661366224
1427.7 661366224 660697103 660469353 659987271 659459591 659717321 660576820 661076844 661297202 662354112
1446 662354112 664122820 665267527 665995061 667984009 672445178 677890837 682312071 687347710 693938553
1464.4 693938553 700953066 708696306 719415963 732866645 743559718 749901831 755044580 759831131
1480.7 759831131 763031125 764555573 765936375 767149270 766407669 764330864 762698770 761023402
1497 761023402 757841706 753898442 750930369 748330116 743111253 736609459 731595159 727559090 723435223
1515.4 723435223 719154298 716010928 713565469 710340679 706683099 703567564 701469660 699281871
$$ packed form
1391F96539402r43601j941979j687348j931369l286124l790557l116369k673447l137648
1409.3F74030960l180206j939535q57473j206338j931131j124442k85208q58068j282335
1427.7F61366224o69121k27750m82082n27680K57730Q59499N00024K20358J056910
1446F62354112J768708J144707P27534J988948M461169N445659M421234N035639O590843
1464.4F93938553P014513P743240J0719657J3450682J0693073O342113N142749M786551
1480.7G59831131L199994J524448J380802J212895p41601k076805j632094j675368
1497G61023402l181696l943264k968073k600253n218863o501794n014300m036069m123867
1515.4G23435223m280925l143370k445459l224790l657580l115535k097904k187789
$$ plain form
1531.7 699281871 696119368 693707764 692845285 691539049 688966334 687328041 686804175 686371505 685818315
1550.1 685818315 686089754 687510192 689024210 689475298 688711047 687955022 686761618 684664011 682160795
1568.4 682160795 679166973 675446510 670616806 664230824 657963336 651725292 644360244 636764109
1584.7 636764109 629481018 621720791 613174677 604795039 596965313 589033604 580735803 572715104
1601.1 572715104 565323353 557981610 550224662 542414904 535132587 528231502 520624459 512139201
1617.4 512139201 505357325 499624819 492961526 486465275 481091976 476304442 472276211 469234169
1633.7 469234169 466905028 465407044 464782894 465244055 467069566 470201075 473656774 476784885 481445432
1652 481445432 488024056 492978096 497626781 503950357 511842966 519825757 527193189 535780489 545735478
$$ packed form
1531.7F99281871l162503k411604q62479j306236k572715j638293n23866m32670n53190
1550.1F85818315K71439J420438J514018M51088p64251p56025j193404k097607k503216
1568.4F82160795k993822l720463m829704o385982o267488o238044p365048p596135
1584.7F36764109p283091p760227q546114q379638p829726p931709q297801q020699
1601.1E72715104p391751p341743p756948p809758p282317o901085p607043q485258
1617.4E12139201o781876n732506o663293o496251n373299m787534m028231l042042
1633.7D69234169k329141j497984o24150M61161J825511L131509L455699L128111M660547
1652D81445432O578624M954040M648685O323576P892609P982791P367432Q587300R954989
$$ plain form
1670.4 545735478 554647624 563717604 574090958 584154963 593656719 604082227 616975188 628713071
1686.7 628713071 638263285 647836506 657528579 668565989 680147648 691020191 702895105 712966800
1703 712966800 720885873 728274941 735262215 742108643 748214066 753557265 759236634 764460206 768069029
1721.4 768069029 771056235 774687111 778835654 782486856 785411179 788803935 792210519 794337094
1737.7 794337094 795968473 798267365 801417351 804593444 807761490 811825514 816364408 819690049
1754 819690049 821987510 824484468 827352345 829498410 830594778 832137644 834526658 836338997 836960793
1772.4 836960793 837787807 839384437 840668559 841180623 842026234 843656540 844818354 845225394 846121430
1790.7 846121430 847736537 848599613 848627806 849192321 850578487 851338923 851158440 851485848 852783501
$$ packed form
1670.4E45735478Q912146R069980J0373354J0064005R501756J0425508J2892961J1737883
1686.7F28713071R550214R573221R692073J1037410J1581659J0872543J1874914J0071695
1703G12966800P919073P389068O987274O846428O105423N343199N679369N223572L608823
1721.4G68069029K987206L630876M148543L651202K924323L392756L406584K126575
1737.7G94337094J631379K298892L149986L176093L168046M064024M538894L325641
1754H19690049K297461K496958K867877K146065J096368J542866K389014J812339O21796
1772.4H36960793Q27014J596630J284122N12064Q45611J630306J161814M07040Q96036
1790.7H46121430J615107Q63076K8193N64515J386166P60436j80483L27408J297653
$$ plain form
1809.1 852783501 853652894 853428543 853535712 854622722 855369568 855180502 855376005 856562793 857437849
1827.4 857437849 857210517 857012331 857767701 858398437 858071446 857968569 859010637 859910131 859534502
1845.8 859534502 859235108 859924912 860507548 860131860 859858751 860619545 861340225 861014247 860745430 861604095
1866.2 861604095 862403750 861832201 861218989 861815631 862536728 862203240 861733079 862272263 862943649 862683415
1886.6 862683415 862293005 862783968 863374710 862988949 862393618 862782419 863407016 863084733 862549007 862993538
1907 862993538 863688469 863346040 862679839 863027632 863739133 863438785 862806737 863108516 863673329 863299370
1927.4 863299370 862595201 862794161 863339126 862969339 862262547 862523198 863202035 862859607 861981571 861982524
1947.8 861982524 862473607 862156630 861363828 861355722 861805916 861444592 860609472 860635698 861195743 860878766
$$ packed form
1809.1H52783501Q69393k24351J07169J087010P46846j89066J95503J186788Q75056
1827.4H57437849k27332j98186P55370O30736l26991j02877J042068Q99494l75629
1845.8H59534502k99394O89804N82636l75688k73109P60794P20680l25978k68817Q58665
1866.2H61604095P99655n71549o13212N96642P21097l33488m70161N39184O71386k60234
1886.6H62683415l90410M90963N90742l85761n95331L88801O24597l22283n35726M44531
1907H62993538O94931l42429o66201L47793P11501l00348o32048L01779N64813l73959
1927.4H63299370p04169J98960N44965l69787p06792K60651O78837l42428q78036R53
1947.8H61982524M91083l16977p92802q106M50194l61324q35120K6226N60045l16977
$$ plain form
1968.2 860878766 859981656 859917402 860448062 860196292 859345138 859230995 859698653 859447241 858645141 858592212
1988.6 858592212 859133542 858874261 857920945 857702494 858151913 857920706 857039094 856842458 857317090 857103527
2009 857103527 856183171 855898738 856307209 856111288 855216563 854885936 855268300 855115414 854248226 853915930
2029.4 853915930 854299366 854144871 853278160 852975607 853455782 853401482 852486730 852038682 852425754 852376819
2049.8 852376819 851530731 851139903 851569593 851567864 850730300 850298882 850748777 850860476 850126624 849761486
2070.2 849761486 850304186 850532353 849874079 849514365 850033939 850281596 849644899 849266052 849769175 850045979
2090.5 850045979 849453211 849056542 849535584 849868774 849353731 849016130 849575520 849968731 849421680 848975420
2110.9 848975420 849437118 849815428 849332750 848956406 849479198 849988580 849645913 849299490 849791944 850290954
$$ packed form
1968.2H60878766q97110o4254N30660k51770q51154j14143M67658k51412q02100n2929
1988.6H58592212N41330k59281r53316k18451M49419k31207q81612j96636M74632k13563
2009H57103527r20356k84433M08471j95921q94725l30627L82364j52886q67188l32296
2029.4H53915930L83436j54495q66711l02553M80175n4300r14752m48048L87072m8935
2049.8H52376819q46088l90828M29690j729q37564m31418M49895J11699p33852l65138
2070.2H49761486N42700K28167o58274l59714N19574K47657o36697l78847N03123K76804
2090.5H50045979n92768l96669M79042L33190n15043l37601N59390L93211n47051m46260
2110.9H48975420M61698L78310m82678l76344N22792N09382l42667l46423M92454M99010
$$ plain form
2131.3 850290954 849944472 849583745 850089669 850640774 850318432 849907994 850342095 850900948 850647688 850260556
2151.7 850260556 850710392 851324201 851095200 850658834 851031005 851640224 851477206 851062655 851432860 852101386
2172.1 852101386 852004290 851610601 851962686 852574527 852416873 851983190 852323055 852985620 852888942 852408469
2192.5 852408469 852624595 853208065 853094637 852595627 852785945 853378773 853293180 852809966 853011906 853615046
2212.9 853615046 853528321 853013635 853150368 853707731 853626728 853116274 853197515 853687763 853591025 853048146
2233.3 853048146 853082001 853609979 853602827 853084981 853035450 853444099 853371143 852847815 852845669 853326857 853284657
2255.8 853284657 852743208 852662504 853061259 853031993 852534413 852525353 853089929 853237748 852845669 852875769
2276.1 852875769 853424072 853535116 853105903 853073597 853578150 853718698 853286624 853158355 853609860 853759646
$$ packed form
2131.3H50290954l46482l60727N05924N51105l22342m10438M34101N58853k53260l87132
2151.7H50260556M49836O13809k29001m36366L72171O09219j63018m14551L70205O68526
2172.1H52101386r7096l93689L52085O11841j57654m33683L39865O62565r6678m80473
2192.5H52408469K16126N83470j13428m99010J90318N92828q5593m83214K01940O03140
2212.9H53615046q6725n14686J36733N57363q1003n10454Q1241M90248r6738n42879
2233.3H53048146L3855N27978p152n17846m9531M08649p2956n23328k146M81188m2200
2255.8H53284657n41449q0704L98755k9266m97580r060N64576J47819l92079L0100
2276.1H52875769N48303J11044m29213l2306N04553J40548m32074j28269M51505J49786
$$ plain form
2296.5 853759646 853311539 853167057 853649676 853823185 853306234 852965832 853190064 853242576 852742434 852350891
2316.9 852350891 852439523 852335870 851672292 851246357 851496816 851615250 851059020 850627720 850896239 851142883
2337.3 851142883 850867033 850798965 851481438 852324963 852776110 852898121 852761626 852143764 851003230 850131273
2357.7 850131273 850222230 850754440 850991309 851405382 852556288 853773534 854418814 855091870 856331825
2376.1 856331825 857481778 857982576 858394980 859220862 859904587 859892786 859707892 860019982 860428989 860308588
2396.5 860308588 860073924 860358119 860773981 860679507 860443950 860703945 861086071 860964775 860710979 860931516
2416.9 860931516 861272991 861143708 860851943 860981345 861273944 861155927 860880733 861023426 861313760 861179948
2437.3 861179948 860879123 860972703 861243486 861148179 860896051 861040413 861354709 861234546 860896409 860953510
$$ packed form
2296.5H53759646m48107j44482M82619J73509n16951l40402K24232N2512n00142l91543
2316.9H52350891Q8632j03653o63578m25935K50459J18434n56230m31300K68519K46644
2337.3H51142883k75850o8068O82473Q43525M51147J22011j36495o17862j140534q71957
2357.7H50131273R0957N32210K36869M14073J150906J217246O45280O73056J239955
2376.1H56331825J149953N00798M12404Q25882O83725j1801j84894L12090M09007j20401
2396.5H60308588k34664K84195M15862r4474k35557K59995L82126j21296k53796K20537
2416.9H60931516L41475j29283k91765J29402K92599j18017k75194J42693K90334j33812
2437.3H61179948l00825R3580K70783r5307k52128J44362L14296j20163l38137N7101
$$ plain form
2457.7 860953510 861213565 861088455 860762894 860832930 861116707 861009955 860663950 860676467 860934019 860828102
2478.1 860828102 860444069 860394955 860640168 860610068 860311687 860267341 860459685 860361218 860019863 859994054
2498.5 859994054 860240877 860179186 859803379 859710753 859916985 859827518 859442174 859346449 859562695 859502852
2518.9 859502852 859152079 859086096 859283566 859191418 858819962 858727336 858927429 858862936 858508885 858377635
2539.2 858377635 858489454 858357251 857981026 857889056 858123958 858137786 857805610 857628047 857737482 857656777
2559.6 857656777 857260168 857024729 857091665 857012212 856636941 856380403 856388986 856242597 855781555 855460227
2580 855460227 855505347 855458498 855033755 854657412 854582548 854392469 853874922 853456318 853383839 853258193 852796674
2602.5 852796674 852365077 852225065 851996183 851430714 850933850 850788116 850606740 850097537 849620879 849430621
$$ packed form
2457.7H60953510K60055j25110l25561P0036K83777j06752l46005J2517K57552j05917
2478.1H60828102l84033m9114K45213l0100k98381m4346J92344r8467l41355k5809
2498.5H59994054K46823o1691l75807r2626K06232q9467l85344r5725K16246n9843
2518.9H59502852l50773o5983J97470r2148l71456r2626K00093o4493l54051j31250
2539.2H58377635J11819j32203l76225r1970K34902J3828l32176j77563J09435q0705
2559.6H57656777l96609k35439O6936p9453l75271k56538Q583j46389m61042l21328
2580H55460227M5120m6849m24743l76343p4864j90079n17547m18604p2479j25646m61519
2602.5H52796674m31597j40012k28882n65469m96864j45734j81376n09203m76658j90258
$$ plain form
2622.9 849430621 849151731 848551095 848040521 847904503 847731829 847179353 846631527 846422613 846174538 845576882
2643.3 845576882 845013559 844843030 844718635 844231248 843669951 843397737 843117237 842517316 841960549 841796637
2663.7 841796637 841671586 841188788 840611041 840298235 840033293 839538753 839059770 838867068 838704467 838239670
2684.1 838239670 837685287 837391615 837143123 836584866 835984528 835738897 835594714 835105181 834442317 834039509
2704.5 834039509 833724558 833085477 832325816 831891060 831600606 830977142 830169499 829644442 829273701 828647912
2724.8 828647912 827907801 827456832 827196836 826765776 826251209 825944304 825693846 825166345 824518800 824144065
2745.2 824144065 823914647 823419929 822727025 822210789 821821928 821187139 820383549 819840848 819479048 818841934
2765.6 818841934 817998409 817362905 816867352 816110969 815117896 814296663 813648283 812786937 811743140
$$ packed form
2622.9H49430621k78890o00636n10574j36018j72674n52476n47826k08914k48075n97656
2643.3H45576882n63323j70529j24395m87387n61297k72214k80500n99921n56767j63912
2663.7H41796637j25051m82798n77747l12806k64942m94540m78983j92702j62601m64797
2684.1H38239670n54383k93672k48492n58257o00338k45631j44183m89533o62864m02808
2704.5H34039509l14951o39081p59661m34756k90454o23464q07643n25057l70741o25789
2724.8H28647912p40111m50969k59996m31060n14567l06905k50458n27501o47545l74735
2745.2H24144065k29418m94718o92904n16236l88861o34789q03590n42701l61800o37114
2765.6H18841934q43525o35504m95553p56383r93073q21233o48380q61346j043797
$$ plain form
2784 811743140 810868382 810122848 809156358 807965934 806929111 806096733 805073678 803756118 802491546
2802.3 802491546 801368773 800071776 798577309 797220170 795966864 794433892 792622447 790872753
2818.7 790872753 789146185 787067771 784617722 782089055 779431224 776184857 772095144 767278790
2835 767278790 761562884 754318357 745259643 734629095 722440362 708739042 694868326 683511674
2851.3 683511674 677127659 676356733 679949522 685757637 691485941 695339203 696690381 696180046 695069551
2869.7 695069551 694487035 695025265 696529329 698099315 698652685 697711766 695486426 692297578 688246787
2888 688246787 683497488 678478777 673466325 668328583 662928581 657392681 651740670 645600021 638561189
2906.4 638561189 630487680 621195614 610180557 597193003 582944274 568867207 556554019 547759056
$$ packed form
2784H11743140q74758p45534r66490j190424j036823q32378j023055j317560j264572
2802.3H02491546j122773j296997j494467j357139j253306j532972j811445j749694
2818.7G90872753j726568k078414k450049k528667k657831l246367m089713m816354
2835G67278790n715906p244527r058714j0630548j2188733j3701320j3870716j1356652
2851.3F83511674o384015p70926L592789N808115N728304L853262J351178n10335j110495
2869.7F95069551n82516N38230J504064J569986N53370r40919k225340l188848m050791
2888F88246787m749299n018711n012452n137742n400002n535900n652011o140649p038832
2906.4F38561189q073509r292066j1015057j2987554j4248729j4077067j2313188q794963
$$ plain form
2922.7 547759056 543966293 545461535 551199555 559595764 569533944 580366313 591276109 601364732
2939 601364732 610022187 616761327 620994210 622463882 621788561 620185614 618746996 618392646 619963884
2957.4 619963884 623681068 629050195 635488689 642685533 650321424 657761097 664405346 670083106
2973.7 670083106 674848378 678765595 681894422 684343338 686339140 687979460 689158440 690012217
2990 690012217 690737545 691081166 690836012 690177560 689300716 688236475 686924100 685560226 684486628
3008.3 684486628 683633089 682636619 681401551 680110872 678786099 677291930 675712466 674196184 672612786
3026.7 672612786 670808852 668906689 667089045 665200174 663013101 660763085 658728957 656696498
3043 656696498 654347479 651781559 649301708 646899045 644371033 641788602 639333963 636923492 634406924
$$ packed form
2922.7E47759056l792763J495242N738020Q396209R938180J0832369J0909796J0088623
2939F01364732Q657455O739140M232883J469672o75321j602947j438618l54350J571238
2957.4F19963884L717184N369127O438494P196844P635891P439673O644249N677760
2973.7F70083106M765272L917217L128827K448916J995802J640320J178980Q53777
2990F90012217P25328L43621k45154o58452q76844j064241j312375j363874j073598
3008.3F84486628q53539r96470j235068j290679j324773j494169j579464j516282j583398
3026.7F72612786j803934j902163j817644j888871k187073k250016k034128k032459
3043F56696498k349019k565920k479851k402663k528012k582431k454639k410471k516568
$$ plain form
3061.4 634406924 631873548 629508734 627222240 624723077 622079432 619648516 617453635 615204334
3077.7 615204334 612767398 610269845 607755423 605089962 602366626 599804997 597293556 594625592
3094 594625592 591881096 589234650 586582005 583688021 580678582 577852130 575125039 572192967 569107950
3112.4 569107950 566179514 563354373 560310900 556989551 553580165 550223589 546887994 543518484
3128.7 543518484 540145040 536740661 533258021 529791951 526411593 522987187 519397438 515691817
3145 515691817 512026966 508518696 505032837 501309276 497383952 493492872 489644349 485785335 481976599
3163.4 481976599 478173375 474262089 470281959 466378868 462556571 458704442 454800099 450895071
3179.7 450895071 446974963 443016201 439087957 435267895 431539714 427791923 423943311 420096576
$$ packed form
3061.4F34406924k533376k364814k286494k499163k643645k430916k194881k249301
3077.7F15204334k436936k497553k514422k665461k723336k561629k511441k667964
3094E94625592k744496k646446k652645k893984l009439k826452k727091k932072l085017
3112.4E69107950k928436k825141l043473l321349l409386l356576l335595l369510
3128.7E43518484l373444l404379l482640l466070l380358l424406l589749l705621
3145E15691817l664851l508270l485859l723561l925324l891080l848523l859014l808736
3163.4D81976599l803224l911286l980130l903091l822297l852129l904343l905028
3179.7D50895071l920108l958762l928244l820062l728181l747791l848612l846735
$$ plain form
3196 420096576 416376948 412707895 409034073 405476630 402085096 398695141 395217597 391777694 388462394
3214.3 388462394 385187328 381866515 378596187 375436962 372322708 369246632 366243869 363360763
3230.7 363360763 360579014 357740492 354845345 352086127 349456877 346872419 344384521 341969430
3247 341969430 339516759 337074161 334767461 332577407 330379397 328119785 325861245 323673964 321535707
3265.3 321535707 319419831 317393094 315409511 313333303 311151505 308923900 306746006 304646939
3281.6 304646939 302552730 300432503 298328757 296293527 294262677 292145222 289980173 287792295
3298 287792295 285620004 283563793 281625986 279656172 277484328 275143027 272825330 270627379 268504530
3316.3 268504530 266428113 264422715 262472630 260512531 258487463 256407917 254365534 252409667
$$ packed form
3196D20096576l719628l669053l673822l557443l391534l389955l477544l439903l315300
3214.3C88462394l275066l320813l270328l159225l114254l076076l002763k883106
3230.7C63360763k781749k838522k895147k759218k629250k584458k487898k415091
3247C41969430k452671k442598k306700k190054k198010k259612k258540k187281k138257
3265.3C21535707k115876k026737j983583k076208k181798k227605k177894k099067
3281.6C04646939k094209k120227k103746k035230k030850k117455k165049k187878
3298B87792295k172291k056211j937807j969814k171844k341301k317697k197951k122849
3316.3B68504530k076417k005398j950085j960099k025068k079546k042383j955867
$$ plain form
3332.6 252409667 250553250 248820111 247093081 245260090 243397340 241557404 239802346 238225967
3348.9 238225967 236661136 234946415 233233407 231678665 230241895 228823721 227454901 226255998
3365.3 226255998 225179747 224014282 222664759 221338436 220270410 219413012 218635440 217870831 217162296
3383.6 217162296 216622010 216371372 216424838 216416836 216056928 215707555 215822920 216199532 216261193 215994656
3404 215994656 215953425 216272965 216695279 217080563 217392191 217719242 218252286 218996361 219776809 220607400
3424.4 220607400 221616134 222791865 223975793 225250587 226762295 228180781 229291543 230432346
3440.7 230432346 231859192 233516604 235299423 237092689 238939732 240913093 242996886 245226264
3457 245226264 247579992 249867097 252138555 254762739 257672071 260311157 262499690 264699757 267239898
$$ packed form
3332.6B52409667j856417j733139j727030j832991j862750j839936j755058j576379
3348.9B38225967j564831j714721j713008j554742j436770j418174j368820j198903
3365.3B26255998j076251j165465j349523j326323j068026q57398p77572p64609p08535
3383.6B17162296n40286k50638N3466q002l59908l49373J15365L76612O1661k66537
3404B15994656m1231L19540M22314L85284L11628L27051N33044P44075P80448Q30591
3424.4B20607400J008734J175731J183928J274794J511708J418486J110762J140803
3440.7B30432346J426846J657412J782819J793266J847043J973361K083793K229378
3457B45226264K353728K287105K271458K624184K909332K639086K188533K200067K540141
$$ plain form
3475.4 267239898 270092994 273015320 275725603 278415322 281376034 284433067 287433743 290499091
3491.7 290499091 293707550 297050267 300351888 303630263 307053715 310426652 313628614 316938937
3508 316938937 320539892 324366093 328164965 331789225 335477710 339447796 343717128 347931534 351845294
3526.4 351845294 355799079 359991848 364320487 368866265 373554826 378111184 382755101 387734383
3542.7 387734383 392801583 397531331 402031064 406798780 411892325 417048126 422249138 427638382
3559 427638382 433121920 438479930 443905145 449866772 456004798 461796850 467510909 473521143 479827255
3577.4 479827255 486291349 492885262 499612778 506531000 513588488 520459235 527098835 534003675
3593.7 534003675 541253924 548567772 555975139 563453257 570747912 577906549 585362971 593032479
$$ packed form
3475.4B67239898K853096K922326K710283K689719K960712L057033L000676L065348
3491.7B90499091L208459L342717L301621L278375L423452L372937L201962L310323
3508C16938937L600955L826201L798872L624260L688485L970086M269332M214406L913760
3526.4C51845294L953785M192769M328639M545778M688561M556358M643917M979282
3542.7C87734383N067200M729748M499733M767716N093545N155801N201012N389244
3559D27638382N483538N358010N425215N961627O138026N792052N714059O010234O306112
3577.4D79827255O464094O593913O727516O918222P057488O870747O639600O904840
3593.7E34003675P250249P313848P407367P478118P294655P158637P456422P669508
$$ plain form
3610 593032479 600582838 607971549 615168035 622629106 630425215 637637138 644232690 650892556 658270359
3628.4 658270359 665767252 672365606 678740621 685172498 691446900 697609961 703587234 709310293
3644.7 709310293 715046763 721100688 726821721 731500804 735810041 740429878 744935215 748967409
3661 748967409 752681017 756274939 759858251 763483584 766875625 769724071 772351623 774784803 776956201
3679.4 776956201 779192626 781636715 784194112 786784470 789033473 790687799 792149603 793621302
3695.7 793621302 795112789 796681881 798217952 799528956 800735891 801997304 803192198 804143012
3712 804143012 804972410 805843234 806751251 807636499 808431029 809150279 809806645 810446620 811263621 812418818
3732.4 812418818 813542366 814145088 814512074 815016448 815519810 815891087 816380441 816917717 817213595
$$ packed form
3610E93032479P550359P388711P196486P461071P796109P211923O595552O659866P377803
3628.4F58270359P496893O598354O375015O431877O274402O163061N977273N723059
3644.7G09310293N736470O053925N721033M679083M309237M619837M505337M032194
3661G48967409L713608L593922L583312L625333L392041K848446K627552K433180K171398
3679.4G76956201K236425K444089K557397K590358K249003J654326J461804J471699
3695.7G93621302J491487J569092J536071J311004J206935J261413J194894R50814
3712H04143012Q29398Q70824R08017Q85248P94530P19250O56366O39975Q17001J155197
3732.4H12418818J123548O02722L66986N04374N03362L71277M89354N37276K95878
$$ plain form
3750.7 817213595 817386746 817757308 818246841 818624616 818892777 819219768 819667578 820134342 820436180 820551693
3771.1 820551693 820736051 821124554 821584105 821905971 822099745 822341681 822566986 822702110 822920859 823297918
3791.5 823297918 823693454 824011683 824305296 824540317 824664295 824838936 824965596 824930489 824990153 825259089
3811.9 825259089 825587749 825917661 826285720 826415718 826275587 826285660 826398134 826440454 826551616 826883912
3832.3 826883912 827359557 827588737 827428818 827309668 827286601 827226639 827327013 827701867 828091681 827958941
3852.7 827958941 827524960 827523708 827676952 827793360 828002453 828276455 828464925 828437865 828272939 828179061
3873.1 828179061 828182697 828295827 828432262 828566253 828736246 828732967 828612387 828548670 828396916 828272820
3893.5 828272820 828433871 828793526 829081714 829070807 828796506 828491926 828274965 828169525 828233480 828450203
$$ packed form
3750.7H17213595J73151L70562M89533L77775K68161L26991M47810M66764L01838J15513
3771.1H20551693J84358L88503M59551L21866J93774K41936K25305J35124K18749L77059
3791.5H23297918L95536L18229K93613K35021J23978J74641J26660l5107N9664K68936
3811.9H25259089L28660L29912L68059J29998j40131J0073J12474M2320J11162L32296
3832.3H26883912M75645K29180j59919j19150k3067n9962J00374L74854L89814j32740
3852.7H27958941m33981j252J53244J16408K09093K74002J88470k7060j64926r3878
3873.1H28179061L636J13130J36435J33991J69993l279j20580o3717j51754j24096
3893.5H28272820J61051L59655K88188j0907k74301l04580k16961j05440O3955K16723
$$ plain form
3913.9 828450203 828671813 828740835 828715622 828721702 828660548 828483284 828422844 828591764 828761220 828738093 828618169
3936.3 828618169 828587592 828666389 828676403 828652918 828826189 829058290 829063833 828946650 828918576 828947842 828989983
3958.8 828989983 829079151 829210162 829343319 829398215 829380214 829388797 829433322 829457462 829491735 829628646 829841077
3981.2 829841077 830034494 830104411 830031931 829992771 830051839 830110550 830190241 830358982
3997.5 830358982
$$ packed form
3913.9H28450203K21610O9022k5213O080o1154j77264o0440J68920J69456k3127j19924
3936.3H28618169l0577P8797J0014k3485J73271K32101N543j17183k8074K9266M2141
3958.8H28989983Q9168J31011J33157N4896j8001Q583M4525K4140L4273J36911K12431
3981.2H29841077J93417O9917p2480l9160N9068N8711P9691J68741
3997.5H30358982
##END=$$ End of the data block
