##TITLE=$$ Begin of the data block
##JCAMP-DX=5.00 $$ ACD/SpecManager v 10.08
##SPECTROMETER/DATA SYSTEM=Alpha
##DATE=15 Apr 2014 09:00:42
##DATA TYPE=INFRARED SPECTRUM
##DATA CLASS=XYDATA
##ORIGIN=
##OWNER=
##NPOINTS=1765
##FIRSTX=399.75695801
##LASTX=3997.56933594
##MAXX=3997.56933594
##MINX=399.75695801
##MAXY=0.83473533
##MINY=0.22675078
##XFACTOR=1.0000000000
##YFACTOR=1.000000000000000e-9
##FIRSTY=0.56279284
##DELTAX=2.03957629
##XUNITS=1/CM
##YUNITS=ARBITRARY UNITS
##XYDATA=(X++(Y..Y))
$$ plain form
399.8 562792838 560411453 558888257 558494866 557283461 556162357 556365252 556012273 555106461 554759264
418.1 554759264 553781331 552953184 553107560 552321613 551153362 551170349 550982118 550255537 550085366 549585581
438.5 549585581 548851252 549060762 548906028 548081100 547973096 547807872 547306597 547433913 547035336 545742333
458.9 545742333 545210600 544591963 543236673 542359591 541514575 540175617 539227426 538215220 536840200
477.3 536840200 536302388 535981774 534980834 534698188 534685969 533541858 532687664 532279193 530956805
495.6 530956805 529928446 529637337 528535843 527290761 526679397 525534153 524457514 524082661 523057044
514 523057044 521654189 520708263 519180715 517348051 516270578 514930844 513280153 512433290 511435270
532.3 511435270 509976268 509190023 508340657 506915569 506160498 505602360 504342377 503391564 502640843
$$ packed form
399.8E62792838k381385j523196l93391j211405j121104K02895l52979r05812l47197
418.1E54759264r77933q28147J54376p85947j168251J6987j88231p26581j70171m99785
438.5E49585581p34329K09510j54734q24928j08004j65224n01275J27316l98577j293003
458.9E45742333n31733o18637j355290q77082q45016j338958r48191j012206j375020
477.3E36840200n37812l20614j000940k82646j2219j144111q54194m08471j322388
495.6E30956805j028359k91109j101494j245082o11364j145244j076639l74853j025617
514E23057044j402855r45926j527548j832664j077473j339734j650691q46863r98020
532.3E11435270j459002p86245q49366j425088p55071n58138j259983r50813p50721
$$ plain form
550.7 502640843 501197338 499968231 499045491 497363359 495726466 494403630 492256075 489991337 488119274
569 488119274 485534132 482903987 481089056 478991985 476808369 475288421 473530054 471479326 469775975
587.4 469775975 467709988 465365916 463736773 462071061 459768087 457538337 454952151 451780289
603.7 451780289 449483454 448115498 446880549 446267188 446108431 446201324 448201686 452205956 456254661
622.1 456254661 460345745 464847833 468808234 472478271 476536542 480130941 483232439 486428708
638.4 486428708 488630444 489589334 491178125 494005114 497146308 499889344 500887811 500339508 501700044
656.7 501700044 506581545 512858987 518887341 523644924 527275741 531829834 536007524 538844645
673.1 538844645 541999638 545738876 548643589 551226497 554396510 556892097 558841169 561305702
$$ packed form
550.7E02640843j443505j229107r22740j682132j636893j322836k147555k264738j872063
569D88119274k585142k630145j814931k097071k183616j519948j758367k050728j703351
587.4D69775975k065987k344072j629143j665712k302974k229750k586186l171862
603.7D51780289k296835j367956j234949o13361j58757R2893K000362M004270M048705
622.1D56254661M091084M502088L960401L670037M058271L594399L101498L196269
638.4D86428708K201736R58890J588791K826989L141194K743036R98467n48303J360536
656.7E01700044M881501O277442O028354M757583L630817M554093M177690K837121
673.1E38844645L154993L739238K904713K582908L170013K495587J949072K464533
$$ plain form
689.4 561305702 563191891 564260304 565753877 567003787 567688465 569185734 571075618 572579324 574859560
707.7 574859560 577649176 579801798 582328260 585334837 587659419 590195417 593387425 595885396
724 595885396 598238707 601190627 603541195 605524004 608060002 610052705 611473441 613560498 615485609
742.4 615485609 616886735 618962109 621087074 622604311 624681592 626872778 628356397 630420327
758.7 630420327 632867277 634514391 636445820 638916492 640515506 641840994 643352449 643708467 643402100
777.1 643402100 643414080 642687321 641438782 640974879 640605092 640414119 641903281 644511580 647719383
795.4 647719383 652662158 658622563 664395273 670624852 676670432 681348801 685639560 689577460
811.7 689577460 691868007 693401873 694777191 694609046 693194389 691293955 687892199 683448970 679278135
$$ packed form
689.4E61305702J886189J068413J493573J249910O84678J497269J889884J503706K280236
707.7E74859560K789616K152622K526462L006577K324582K535998L192008K497971
724E95885396K353311K951920K350568J982809K535998J992703J420736K087057J925111
742.4F15485609J401126K075374K124965J517237K077281K191186J483619K063930
758.7F30420327K446950J647114J931429K470672J599014J325488J511455L56018l06367
777.1F43402100J1980p26759j248539m63903l69787j90973J489162K608299L207803
795.4F47719383M942775N960405N772710O229579O045580M678369M290759L937900
811.7F89577460K290547J533866J375318j68145j414657j900434l401756m443229m170835
$$ plain form
830.1 679278135 674652755 669679821 665568233 661608279 657384932 653936684 650924265 648098290
846.4 648098290 646965563 647804558 650071442 654672682 661462128 668975949 677389503 686606228 695129812
864.8 695129812 703116059 710907221 717093468 721804559 726117730 729162872 730817854 732082307
881.1 732082307 732218742 730968058 729568481 727773249 725327611 723600924 722643793 721805215 721946299
899.4 721946299 722916663 723491371 724059939 724607110 723957896 722490668 720548809 717161417 712803781
917.8 712803781 708530664 704042017 699924588 697452843 696159005 695609033 696241617 697114766 697362483
936.2 697362483 697673440 697853029 697282970 696670473 695942640 694171667 691720307 688678801 684194386
954.5 684194386 678581536 672171295 664133251 654538393 643838167 631448090 617656350 603659093
$$ packed form
830.1F79278135m625380m972934m111588l959954m223347l448248l012419k825975
846.4F48098290j132727Q38995K266884M601240O789446P513821Q413554R216725Q523584
864.8F95129812P986247P791162O186247M711091M313171L045142J654982J264453
881.1G32082307J36435j250684j399577j795232k445638j726687r57131q38578J41084
899.4G21946299R70364N74708N68568N47171o49214j467228j941859l387392m357636
917.8G12803781m273117m488647m117429k471745j293838n49972O32584Q73149K47717
936.2F97362483L10957J79589n70059o12497p27833j770973k451360l041506m484415
954.5F84194386n612850o410241q038044r594858j0700226j2390077j3791740j3997257
$$ plain form
970.8 603659093 589791596 576667249 565350711 555565834 546836197 539507091 533120632 527023613
987.1 527023613 521665454 517168224 513120174 509824097 507401586 505290329 503454924 501847804
1003.5 501847804 499639750 496513873 492719471 488036036 482653290 477299064 472023308 466853619
1019.8 466853619 462218821 457912832 453663051 449820369 446286798 442724168 439472973 436691016
1036.1 436691016 434083581 431793362 429846942 427758127 425539523 423440814 421297550 419370830
1052.4 419370830 418307304 418140531 418687165 419861853 421007246 421321630 420545816 418434113 414960593
1070.8 414960593 410802811 406453073 402083844 398113936 394608438 391110718 387439489 383557975
1087.1 383557975 379345030 375139296 371549577 368841529 367146730 366525382 366569877 366846144 367252052
$$ packed form
970.8F03659093j3867497j3124347j1316538r784877q729637p329106o386459o097019
987.1E27023613n358159m497230m048050l296077k422511k111257j835405j607120
1003.5E01847804k208054l125877l794402m683435n382746n354226n275756n169689
1019.8D66853619m634798m305989m249781l842682l533571l562630l251195k781957
1036.1D36691016k607435k290219j946420k088815k218604k098709k143264j926720
1052.4D19370830j063526j66773N46634J174688J145393L14384p75814k111703l473520
1070.8D14960593m157782m349738m369229l969908l505498l497720l671229l881514
1087.1C83557975m212945m205734l589719k708048j694799o21348M4495K76267M05908
$$ plain form
1105.4 367252052 367512047 367277175 366533548 365126878 362659365 359040678 354408771 349351496 345386833
1123.8 345386833 343587548 343337119 343564272 343539417 342982531 342681110 343595624 345545024 347777247
1142.2 347777247 349921107 351832449 353443205 354967207 356652856 358588696 361014366 364192754
1158.5 364192754 368117720 372894585 378713757 385382622 392629892 400359571 408255577 415987581
1174.8 415987581 423543692 430801362 437518597 443663329 448983610 452986926 455677032 457362413
1191.1 457362413 458286822 459039003 460254461 462052256 464503169 467686564 471178055 474551052 477756053
1209.5 477756053 480553627 482727855 484587371 486333072 487898409 489564955 491502225 493497759
1225.8 493497759 495745361 498484552 501436412 504580498 508113682 511744857 515293121 518902659
$$ packed form
1105.4C67252052K59995k34872p43627j406670k467513l618687m631907n057275l964663
1123.8C45386833j799285k50429K27153k4855n56886l01421R14514J949400K232223
1142.2C47777247K143860J911342J610756J524002J685649J935840K425670L178388
1158.5C64192754L924966M776865N819172O668865P247270P729679P896006P732004
1174.8D15987581P556111P257670O717235O144732N320281M003316K690106J685381
1191.1D57362413R24409P52181J215458J797795K450913L183395L491491L372997L205001
1209.5D77756053K797574K174228J859516J745701J565337J666546J937270J995534
1225.8D93497759K247602K739191K951860L144086L533184L631175L548264L609538
$$ plain form
1242.1 518902659 522258043 525066555 527558684 529606521 530994773 532152116 533234417 534117937
1258.4 534117937 535317600 537112415 539192379 541769505 545032918 548552096 552351713 556678295
1274.7 556678295 561115623 565588415 570509613 575586915 580638289 586152911 591863632 597237587
1291 597237587 602624595 607964694 612749517 617301226 621679008 625316083 628564000 631765366 634303927
1309.4 634303927 636350334 638449430 640118301 641412973 642974854 644441247 645749867 647532165
1325.7 647532165 649314165 650531352 651646972 652471900 652675927 653026462 653524876 653531432 653794348
1344.1 653794348 654691756 655434430 656127751 657026350 657410145 657373428 657504976 657240927 656260490 655087233
1364.5 655087233 653641820 652022243 650953650 650064230 648611426 647147238 645614564 643182397
$$ packed form
1242.1E18902659L355384K808512K492129K047837J388252J157343J082301Q83520
1258.4E34117937J199663J794815K079964K577126L263413L519178L799617M326582
1274.7E56678295M437328M472792M921198N077302N051374N514622N710721N373955
1291E97237587N387008N340099M784823M551709M377782L637075L247917L201366K538561
1309.4F34303927K046407K099096J668871J294672J561881J466393J308620J782298
1325.7F47532165J782000J217187J115620Q24928K04027L50535M98414O556K62916
1344.1F53794348Q97408P42674O93321Q98599L83795l6717J31548k64049r80437j173257
1364.5F55087233j445413j619577j068593q89420j452804j464188j532674k432167
$$ plain form
1380.8 643182397 640535414 638728440 637415349 636197865 635115087 633715153 631918490 629881501
1397.1 629881501 626918256 623380244 620242953 616905808 613329291 610494852 608058095 605644107
1413.4 605644107 604029059 603066564 601705194 600368440 599486649 598445892 597552061 596967399 595995188
1431.8 595995188 595174015 595122874 594863415 594422042 594755173 595422268 596410394 598388731 600773335
1450.1 600773335 603307903 607176721 613649249 621370196 627752125 633942425 641044438 648624182
1466.4 648624182 656089842 664346159 674601972 684451878 691487610 697039366 702197015 706212163
1482.8 706212163 708844781 711021543 712065339 711082876 709434628 707493126 704386711 700589955
1499.1 700589955 696651220 692694545 688712597 682932258 675746500 669450939 664127946 659311175
$$ packed form
1380.8F43182397k646983j806974j313091j217484j082778j399934j796663k036989
1397.1F29881501k963245l538012l137291l337145l576517k834439k436757k413988
1413.4F05644107j615048r62495j361370j336754q81791j040757q93831n84662r72211
1431.8E95995188q21173n1141k59459m41373L33131O67095R88126J978337K384604
1450.1F00773335K534568L868818O472528P720947O381929O190300P102013P579744
1466.4F48624182P465660Q256317J0255813R849906P035732N551756N157649M015148
1482.8G06212163K632618K176762J043796r82463j648248j941502l106415l796756
1499.1G00589955l938735l956675l981948n780339p185758o295561n322993m816771
$$ plain form
1515.4 659311175 655230284 652292371 649252295 645785451 642867863 639863968 636953652 634989440
1531.7 634989440 633100986 630930126 629864812 629672945 628589749 627488732 626974583 626801968 627456367
1550.1 627456367 628884673 630419016 632304311 634998918 636057317 635228395 634598553 633811355 632298529
1568.4 632298529 629919231 626653492 622704387 617520988 611286044 604731202 597991168 590875208
1584.7 590875208 583002388 574850202 566589117 557954252 549228191 540699244 532066464 523387671
1601.1 523387671 514923334 506481767 498011053 489565909 481136262 473121852 465322077 456913412
1617.4 456913412 449470639 443342060 437175989 431125849 425861537 421420723 418059289 416093200
1633.7 416093200 415264904 414843708 415011078 416304439 418588072 422223270 426524103 429926455 434586883
$$ packed form
1515.4F59311175m080891k937913l040076l466844k917588l003895k910316j964212
1531.7F34989440j888454k170860j065314j91867j083196j101017n14149j72615O54399
1550.1F27456367J428306J534343J885295K694607J058399q28922o29842p87198j512826
1568.4F32298529k379298l265739l949105n183399o234944o554842o740034p115960
1584.7E90875208p872820q152186q261085q634865q726061q528947q632780q678793
1601.1E23387671q464337q441567q470714q445144q429647q014410p799775q408665
1617.4D56913412p442773o128579o166071o050140n264312m440814l361434j966089
1633.7D16093200q28296m21196J67370J293361K283633L635198M300833L402352M660428
$$ plain form
1652 434586883 441464484 446226358 450171828 455519170 462286115 469160855 475479811 482877880 491265446
1670.4 491265446 498754382 506715417 515360296 523132920 530841827 540015221 551229417 560876131
1686.7 560876131 568777323 577053070 585355163 594904363 605436802 616260290 628527284 638566017
1703 638566017 647205174 656136513 663729966 670440197 677124977 683812916 690440834 695892274 699922740
1721.4 699922740 703804374 708015144 712085485 715942562 719923913 724421442 728215277 731294394
1737.7 731294394 735073984 739128947 743167579 747628331 752254248 756820858 761090159 764648557
1754 764648557 768032789 771519661 774683177 777482033 779986441 782404840 784823596 787293017 789539397
1772.4 789539397 790992260 792236686 793879867 795538485 797038138 798590541 800000608 801438332
$$ packed form
1652D34586883O877601M761874L945470N347342O766945O874740O318956P398069Q387566
1670.4D91265446P488936P961035Q644879P772624P708907R173394J1214196R646714
1686.7E60876131P901192Q275747Q302093R549200J0532439J0823488J2266994J0038733
1703F38566017Q639157Q931339P593453O710231O684780O687939O627918N451440M030466
1721.4F99922740L881634M210770M070341L857077L981351M497529L793835L079117
1737.7G31294394L779590M054963M038632M460752M625917M566610M269301L558398
1754G64648557L384232L486872L163516K798856K504408K418399K418756K469421K246380
1772.4G89539397J452863J244426J643181J658618J499653J552403J410067J437724
$$ plain form
1788.7 801438332 803234398 804775536 805694938 806780100 808074117 809104443 809991479 810868144 811689436
1807 811689436 812686622 813714921 814353704 814979613 815819740 816495121 817133605 818077624 818953633 819643378
1827.4 819643378 820406318 820834994 821001887 821461797 822049022 822541535 823293805 824131370 824434459 824577749
1847.8 824577749 824927092 825220525 825532615 826038837 826449513 826745749 827183187 827663004 828169048 828713179
1868.2 828713179 828852952 828728437 828927815 829261780 829418480 829638124 829952598 830140710 830408812 830811799
1888.6 830811799 830948174 830997646 831234634 831324995 831317484 831538856 831761658 831867218 832109809 832322061
1909 832322061 832285345 832321107 832560003 832729876 832816243 832893312 832797110 832672238 832714915 832694769 832629383
1931.5 832629383 832696140 832663119 832542479 832654774 832766831 832588375 832428157 832318306 832103968 832015514
$$ packed form
1788.7H01438332J796066J541138R19402J085162J294017J030326Q87036Q76665Q21292
1807H11689436R97186J028299O38783O25909Q40127O75381O38484R44019Q76009O89745
1827.4H19643378P62940M28676J66893M59910N87225M92513P52270Q37565L03089J43290
1847.8H24577749L49343K93433L12090N06222M10676K96236M37438M79817N06044N44131
1868.2H28713179J39773j24515J99378L33965J56700K19644L14474J88112K68102M02987
1888.6H30811799J36375M9472K36988R0361p511K21372K22802J05560K42591K12252
1909H32322061l6716L5762K38896J69873Q6367P7069r6202j24872M2677k0146o5386
1931.5H32629383O6757l3021j20640J12295J12057j78456j60218j09851k14338q8454
$$ plain form
1951.9 832015514 831987619 831761718 831558764 831501424 831343651 831202567 831218004 831077874 830805719 830688238
1972.3 830688238 830556691 830352306 830307961 830248952 830051601 829959452 829884648 829680085 829592764 829521537 829209089
1994.7 829209089 828979969 828914404 828666985 828384519 828294694 828113079 827840626 827718914 827550530 827298164
2015.1 827298164 827187181 827012599 826667547 826477885 826340020 826025009 825806320 825698078 825438976 825240552
2035.5 825240552 825176716 824958086 824752927 824720562 824549317 824285686 824174821 824007988 823787689 823769510
2055.9 823769510 823742449 823571205 823524833 823484063 823250651 823148310 823145688 822951138 822848082 822910368 822785735
2078.3 822785735 822675467 822774529 822732270 822612226 822652161 822570205 822379947 822405875 822433472 822350562 822437406
2100.7 822437406 822519362 822405517 822399974 822474658 822401106 822404802 822487772 822406888 822399616 822585702 822651863 822677314
$$ packed form
1951.9H32015514k7895k25901k02954n7340j57773j41084J5437j40130k72155j17481
1972.3H30688238j31547k04385m4345n9009j97351r2149p4804k04563q7321p1227l12448
1994.7H29209089k29120o5565k47419k82466q9825j81615k72453j21712j68384k52366
2015.1H27298164j10983j74582l45052j89662j37865l15011k18689j08242k59102j98424
2035.5H25240552o3836k18630k05159l2365j71245k63631j10865j66833k20299j8179
2055.9H23769510k7061j71244m6372m0770k33412j02341k622j94550j03056O2286j24633
2078.3H22785735j10268R9062m2259j20044L9935q1956j90258K5928K7597q2910Q6844
2100.7H22437406Q1956j13845n543P4684p3552L696Q2970q0884p272J86086O6161K5451
$$ plain form
2125.2 822677314 822848260 822909355 822895229 823050499 823142052 823105276 823240340 823393583 823429286 823619366
2145.6 823619366 823817432 823824883 823945105 824131250 824127376 824216187 824476302 824586689 824684501 824924111 825019240
2168 825019240 825051904 825259626 825396955 825462401 825689137 825838506 825850606 826040864 826232314 826231539 826341569
2190.5 826341569 826506615 826495528 826555014 826699972 826692700 826762617 826962888 826947212 826889873 827034235 827090681
2212.9 827090681 827068210 827211320 827290058 827231526 827304065 827373326 827319562 827384651 827454865 827342927 827326477
2235.4 827326477 827422619 827388942 827383816 827456772 827377617 827293158 827336550 827259779 827132046 827154279 827115953
2257.8 827115953 826992869 827022791 827055693 826987445 827044249 827115059 827052355 827101946 827241123 827277243 827413917
2280.2 827413917 827625394 827613533 827572167 827673912 827651024 827549100 827586234 827595830 827548206 827611327 827621758
$$ packed form
2125.2H22677314J70946O1095j4126J55270R1553l6776J35064J53243L5703J90080
2145.6H23619366J98066P451J20222J86145l874Q8811K60115J10387R7812K39610R5129
2168H25019240L2664K07722J37329O5446K26736J49369J2100J90258J91450p75J10030
2190.5H26341569J65046j1087N9486J44958p272O9917K00271j5676n7339J44362N6446
2212.9H27090681k2471J43110P8738n8532P2539O9261n3764O5089P0214j11938j6450
2235.4H27326477R6142l3677n126P2956p9155q4459M3392p6771j27733K2233l8326
2257.8H27115953j23084K9922L2902o8248N6804P0810o2704M9591J39177L6120J36674
2280.2H27413917K11477j1861m1366J01745k2888j01924L7134R596m7624O3121J0431
$$ plain form
2302.7 827621758 827484667 827404439 827313185 827115178 827041328 827035129 826833487 826584339 826431572 826257408
2323.1 826257408 826166332 826161206 826062679 826031387 826111972 826030791 825883746 825883567 825923085 826185346 826991320
2345.5 826991320 827797055 827969253 827565610 826860547 826154113 825783014 825704336 825844526 826403201 827163458
2365.9 827163458 827801943 828527451 829397321 830147326 830869555 831682444 832397759 833004177 833571732 833931506
2386.3 833931506 834077537 834218681 834337592 834375978 834481061 834591866 834559679 834569514 834672034 834679365 834670842
2408.7 834670842 834735334 834713757 834651649 834663630 834611714 834530473 834544003 834478617 834321439 834271491 834221601
2431.2 834221601 834079325 833997428 833930612 833770692 833659530 833605289 833466530 833355427 833323061 833192289
2451.5 833192289 833024025 832948446 832846284 832719088 832631111 832460225 832239091 832123101 832018256 831828833
$$ packed form
2302.7H27621758j37091q0228r1254j98007p3850o199k01642k49148j52767j74164
2323.1H26257408r1076n126r8527l1292Q0585q1181j47045j79L9518K62261Q05974
2345.5H26991320Q05735J72198m03643p05063p06434l71099p8678J40190N58675P60257
2365.9H27163458O38485P25508Q69870P50005P22229Q12889P15315O06418N67555L59774
2386.3H33931506J46031J41144J18911L8386J05083J10805l2187R835J02520P331q523
2408.7H34670842O4492k1577o2108J1981n1916q1241J3530o5386j57178m9948m9890
2431.2H34221601j42276q1897o6816j59920j11162n4241j38759j11103l2366j30772
2451.5H33192289j68264p5579j02162j27196q7977j70886k21134j15990j04845j89423
$$ plain form
2471.9 831828833 831676960 831546009 831356764 831221342 831127346 830948114 830774784 830664754 830496013 830298781
2492.3 830298781 830155790 830018044 829891980 829791546 829624176 829410493 829262257 829120576 828942418 828809798
2512.7 828809798 828661740 828447104 828285754 828152716 827959359 827792466 827666938 827483714 827277601 827103317
2533.1 827103317 826924682 826789618 826707721 826542914 826315343 826130986 825924098 825689733 825528204 825379789
2553.5 825379789 825166643 824952126 824748874 824519157 824306965 824107349 823857963 823603988 823378026 823096156
2573.9 823096156 822766900 822467208 822159708 821844637 821553469 821210027 820832491 820504367 820136130 819672287
2594.3 819672287 819228768 818824053 818389416 817948997 817526400 817072570 816587746 816114962 815638721 815169096
2614.7 815169096 814725101 814246058 813722253 813213587 812720954 812228262 811732769 811212659 810698330 810245097
$$ packed form
2471.9H31828833j51873j30951j89245j35422r3996j79232j73330j10030j68741j97232
2492.3H30298781j42991j37746j26064j00434j67370k13683j48236j41681j78158j32620
2512.7H28809798j48058k14636j61350j33038j93357j66893j25528j83224k06113j74284
2533.1H27103317j78635j35064q1897j64807k27571j84357k06888k34365j61529j48415
2553.5H25379789k13146k14517k03252k29717k12192j99616k49386k53975k25962k81870
2573.9H23096156l29256k99692l07500l15071k91168l43442l77536l28124l68237m63843
2594.3H19672287m43519m04715m34637m40419m22597m53830m84824m72784m76241m69625
2614.7H15169096m43995m79043n23805n08666m92633m92692m95493n20110n14329m53233
$$ plain form
2635.1 810245097 809804201 809321761 808855593 808422744 807952881 807450294 806986809 806549728 806098938 805662394
2655.5 805662394 805226326 804770291 804343164 803943396 803521037 803091109 802679062 802259922 801835835 801420569
2675.9 801420569 800990880 800556839 800129473 799652517 799117327 798614681 798180461 797754645 797297716 796792746
2696.3 796792746 796238124 795670092 795098722 794515491 793940723 793378592 792787910 792162240 791539192 790938318
2716.7 790938318 790361643 789757669 789092422 788449109 787859797 787246048 786625564 786074877 785555482 785001636
2737.1 785001636 784438372 783880770 783314049 782767892 782232821 781668901 781078935 780456841 779803336 779143453
2757.5 779143453 778483391 777798355 777079582 776365161 775655270 774912834 774134457 773335516 772522569 771688521
2777.9 771688521 770824969 769944310 769059300 768165469 767250240 766296864 765306473 764286697 763244152
$$ packed form
2635.1H10245097m40896m82440m66168m32849m69863n02587m63485m37081m50790m36544
2655.5H05662394m36068m56035m27127l99768m22359m29928m12047m19140m24087m15266
2675.9H01420569m29689m34041m27366m76956n35190n02646m34220m25816m56929n04970
2696.3G96792746n54622n68032n71370n83231n74768n62131n90682o25670o23048o00874
2716.7G90938318n76675o03974o65247o43313n89312o13749o20484n50687n19395n53846
2737.1G85001636n63264n57602n66721n46157n35071n63920n89966o22094o53505o59883
2757.5G79143453o60062o85036p18773p14421p09891p42436p78377p98941q12947q34048
2777.9G71688521q63552q80659q85010q93831r15229r53376r90391j019776j042545
$$ plain form
2796.2 763244152 762168944 761012733 759800553 758596003 757365942 756086707 754782975 753426492
2812.5 753426492 752015948 750605285 749166787 747636497 746037185 744375288 742593646 740682960
2828.9 740682960 738616884 736306429 733675599 730615497 726976871 722635925 717480540 711458623
2845.2 711458623 704917789 698757768 693969071 691109419 690106034 690305591 690843642 691059768 690548003
2863.5 690548003 689185798 687191129 684951663 682876825 681234956 679970622 678866565 677788973
2879.9 677788973 676598787 675119281 673318565 671243966 668897092 666362822 663769782 661113024
2896.2 661113024 658372939 655599236 652731001 649590313 646056116 642029941 637347519 631875157
2912.5 631875157 625770330 619673908 614392757 610391915 607749104 606414258 606309593 607191980 608724535
$$ packed form
2796.2G63244152j075208j156211j212180j204550j230061j279235j303732j356483
2812.5G53426492j410544j410663j438498j530290j599312j661897j781642j910686
2828.9G40682960k066076k310455k630830l060102l638626m340946n155385o021917
2845.2G11458623o540834o160021m788697k859652j003385J99557N38051K16126n11765
2863.5F90548003j362205j994669k239466k074838j641869j264334j104057j077592
2879.9F77788973j190186j479506j800716k074599k346874k534270k593040k656758
2896.2F61113024k740085k773703k868235l140688l534197m026175m682422n472362
2912.5F31875157o104827o096422n281151m000842k642811j334846j04665Q82387J532555
$$ plain form
2930.8 608724535 610785425 613399327 616475999 619812131 623183846 626328647 628942132 630805492
2947.2 630805492 631918013 632473171 632678807 632764280 633057177 633797705 635004044 636527956 638215303
2965.5 638215303 639987111 641790092 643593371 645378947 647108555 648760974 650317550 651719391
2981.8 651719391 652960658 654082298 655079544 655925810 656513155 656716168 656609118 656254053 655641198
3000.2 655641198 654901505 654090703 653197229 652319014 651505291 650652468 649600208 648327053 646941841
3018.5 646941841 645515025 644060135 642545998 640971243 639394581 637816370 636192501 634433389
3034.9 634433389 632509947 630606234 628797770 626913607 624865234 622730017 620603204 618511200
3051.2 618511200 616430461 614322245 612121642 609881163 607738614 605717659 603779554 601837933
$$ packed form
2930.8F08724535K060890K613902L076672L336132L371715L144801K613485J863360
2947.2F30805492J112521N55158K05636Q5473K92897P40528J206339J523912J687347
2965.5F38215303J771808J802981J803279J785576J729608J652419J556576J401841
2981.8F51719391J241267J121640R97246Q46266N87345K03013j07050l55065o12855
3000.2F55641198p39693q10802q93474q78215q13723q52823j052260j273155j385212
3018.5F46941841j426816j454890j514137j574755j576662j578211j623869j759112
3034.9F34433389j923442j903713j808464j884163k048373k135217k126813k092004
3051.2F18511200k080739k108216k200603k240479k142549k020955j938105j941621
$$ plain form
3067.5 601837933 599791169 597676575 595610678 593662918 591803610 589897931 587872922 585785985
3083.8 585785985 583671808 581564963 579508185 577418447 575234175 573023498 570843041 568654716
3100.1 568654716 566363990 564007580 561710894 559412241 556960285 554446161 552060485 549719512
3116.4 549719512 547218144 544489682 541591048 538696408 535931408 533222139 530467212 527629137
3132.8 527629137 524722636 521863341 519050419 516098976 513009071 509916365 506833136 503791034
3149.1 503791034 500819027 497766912 494527459 491225392 487968564 484747976 481560647 478412658
3165.4 478412658 475267053 472050786 468772084 465505183 462262362 459043026 455864847 452695519
3181.7 452695519 449511975 446311176 443107039 439937681 436789662 433634162 430486500 427355021
$$ packed form
3067.5F01837933k046764k114594k065897j947760j859308j905679k025009k086937
3083.8E85785985k114177k106845k056778k089738k184272k210677k180457k188325
3100.1E68654716k290726k356410k296686k298653k451956k514124k385676k340973
3116.4E49719512k501368k728462k898634k894640k765000k709269k754927k838075
3132.8E27629137k906501k859295k812922k951443l089905l092706l083229l042102
3149.1E03791034k972007l052115l239453l302067l256828l220588l187329l147989
3165.4D78412658l145605l216267l278702l266901l242821l219336l178179l169328
3181.7D52695519l183544l200799l204137l169358l148019l155500l147662l131479
$$ plain form
3198 427355021 424242228 421217054 418281853 415343583 412401915 409515649 406646073 403751194 400913388
3216.4 400913388 398175120 395478338 392761528 390021503 387341529 384772450 382271767 379803896
3232.7 379803896 377340198 374859422 372405231 370023936 367739141 365549803 363393188 361203909
3249 361203909 359029710 356962323 354945689 352859497 350743562 348695546 346683443 344668150 342718720
3267.4 342718720 340866894 339017779 337120444 335187972 333189279 331192762 329315841 327495009
3283.7 327495009 325633556 323760986 321925938 320102960 318238467 316332579 314409167 312479258
3300 312479258 310572922 308727384 306878597 304900467 302780777 300634712 298559636 296546549 294544488
3318.4 294544488 292527765 290537477 288571686 286521286 284390479 282280684 280220419 278238595
$$ packed form
3198D27355021l112793l025174k935201k938270k941668k886266k869576k894879k837806
3216.4D00913388k738268k696782k716810k740025k679974k569079k500683k467871
3232.7C79803896k463698k480776k454191k381295k284795k189338k156615k189279
3249C61203909k174199k067387k016634k086192k115935k048016k012103k015293j949430
3267.4C42718720j851826j849115j897335j932472j998693j996517j876921j820832
3283.7C27495009j861453j872570j835048j822978j864493j905888j923412j929909
3300C12479258j906336j845538j848787j978130k119690k146065k075076k013087k002061
3318.4B94544488k016723j990288j965791k050400k130807k109795k060265j981824
$$ plain form
3334.7 278238595 276330858 274357706 272271276 270206451 268159658 266093791 264127940 262205899
3351 262205899 260163277 258056283 256046146 254168183 252332121 250504673 248768300 247120276 245423302
3369.3 245423302 243579715 241702944 240033343 238623649 237329125 236027375 234785676 233742803
3385.7 233742803 232943401 232357442 231767014 230930373 230065539 229555756 229291081 228853926 228156224 227564320
3406.1 227564320 227287054 227165475 227040336 226882473 226750776 226750955 226893976 227131143 227506995 228073701
3426.5 228073701 228808433 229575545 230401024 231368482 232260004 232955232 233727872 234801352 236114785
3444.8 236114785 237543032 238959417 240390286 241956845 243696809 245571688 247526258 249464035
3461.1 249464035 251415670 253630251 256083459 258322269 260128349 261929363 264068574 266488552
$$ packed form
3334.7B78238595j907737j973152k086430k064825k046793k065867j965851j922041
3351B62205899k042622k106994k010137j877963j836062j827448j736373j648024j696974
3369.3B45423302j843587j876771j669601j409694j294524j301750j241699j042873
3385.7B33742803p99402n85959n90428q36641q64834n09783k64675m37155o97702n91904
3406.1B27564320k77266j21579j25139j57863j31697J79J43021K37167L75852N66706
3426.5B28073701P34732P67112Q25479R67458Q91522O95228P72640J073480J313433
3444.8B36114785J428247J416385J430869J566559J739964J874879J954570J937777
3461.1B49464035J951635K214581K453208K238810J806080J801014K139211K419978
$$ plain form
3477.4 266488552 269004971 271405965 273741096 276230335 278810859 281321198 283880591 286650687
3493.8 286650687 289552033 292343318 295096338 298014760 300876290 303537995 306355029 309499085
3510.1 309499085 312794000 316028386 319122404 322273314 325673312 329362899 333028913 336451083
3526.4 336451083 339924037 343610644 347408175 351360708 355440140 359423697 363450736 367809951
3542.7 367809951 372413665 376816332 380926579 385211885 389842838 394533217 399269283 404215306
3559 404215306 409222037 414141774 419327348 425185293 431021601 436324775 441638857 447320789 453256816
3577.4 453256816 459356934 465598315 471912444 478454977 485312223 491967440 498266995 504888952
3593.7 504888952 511919677 518953979 525993943 532997966 539830387 546755791 554185212 561712980
$$ packed form
3477.4B66488552K516419K400994K335131K489239K580524K510339K559393K770096
3493.8B86650687K901346K791285K753020K918422K861530K661705K817034L144056
3510.1C09499085L294915L234386L094018L150910L399998L689587L666014L422170
3526.4C36451083L472954L686607L797531L952533M079432L983557M027039M359215
3542.7C67809951M603714M402667M110247M285306M630953M690379M736066M946023
3559D04215306N006731M919737N185574N857945N836308N303174N314082N681932N936027
3577.4D53256816O100118O241381O314129O542533O857246O655217O299555O621957
3593.7E04888952P030725P034302P039964P004023O832421O925404P429421P527768
$$ plain form
3610 561712980 568936050 576031208 582954407 590129673 597590625 604326725 610438526 616868615 624461114
3628.4 624461114 632017612 638072371 643812776 649742961 655587077 661386967 667069137 672586799
3644.7 672586799 678258359 684360743 689845085 693870366 697605610 701926768 706105828 709760070
3661 709760070 713247001 716745257 720275164 723958313 727493703 730461538 733278155 735675156 737455368
3679.4 737455368 739295721 741459370 743934631 746853352 749649763 751416266 752684534 754158318
3695.7 754158318 755800009 757446229 759023130 760364532 761598945 763072371 764687657 765956938
3712 765956938 766773164 767521918 768443644 769474208 770411849 771154165 771843493 772640646 773607016 774844825
3732.4 774844825 776083469 776822746 777250886 777780116 778459013 779229283 779937625 780508220 780958474
$$ packed form
3610E61712980P223070P095158O923199P175266P460952O736100O111801O430089P592499
3628.4F24461114P556498O054759N740405N930185N844116N799890N682170N517662
3644.7F72586799N671560O102384N484342M025281L735244M321158M179060L654242
3661G09760070L486931L498256L529907L683149L535390K967835K816617K397001J780212
3679.4G37455368J840353K163649K475261K918721K796411J766503J268268J473784
3695.7G54158318J641691J646220J576901J341402J234413J473426J615286J269281
3712G65956938Q16226P48754R21726J030564R37641P42316O89328P97153R66370J237809
3732.4G74844825J238644P39277M28140N29230O78897P70270P08342N70595M50254
$$ plain form
3750.7 780958474 781192720 781395018 781731904 782080889 782289982 782515705 782999754 783573449 783954501 784173310
3771.1 784173310 784371912 784708560 785278082 785780370 785904467 785935760 786092877 786281228 786592305 787053049
3791.5 787053049 787482142 787909925 788387299 788815081 789165735 789340615 789311349 789187372 789159715 789418101
3811.9 789418101 789910913 790497124 791029990 791294932 791189909 790935576 790802240 790837586 791051984 791434944
3832.3 791434944 791901410 792289793 792352915 792124748 791878402 791697800 791657746 791945636 792499840 792890728
3852.7 792890728 792807579 792535186 792357326 792421162 792650104 792806327 792894721 793021321 793069422 792896748
3873.1 792896748 792707622 792698681 792872369 793111384 793213248 793171823 793084025 793038964 793034315 792958140 792940199
3895.5 792940199 793178618 793504715 793579400 793371558 793099105 792840242 792609692 792560279 792702198 792867362
$$ packed form
3750.7G80958474K34246K02298L36886L48985K09093K25723M84049N73695L81052K18809
3771.1G84173310J98602L36648N69522N02288J24097L1293J57117J88351L11077M60744
3791.5G87053049M29093M27783M77374M27782L50654J74880k9266j23977k7657K58386
3811.9G89418101M92812N86211N32866K64942j05023k54333j33336L5346K14398L82960
3832.3G91434944M66466L88383O3122k28167k46346j80602m0054K87890N54204L90888
3852.7G92890728q3149k72393j77860O3836K28942J56223Q8394J26600M8101j72674
3873.1G92896748j89126q941J73688K39015J01864m1425q7798m5061m649p6175j7941
3895.5G92940199K38419L26097P4685k07842k72453k58863k30550m9413J41919J65164
$$ plain form
3915.9 792867362 793013215 793119729 793080211 792985260 792993963 793051004 793115497 793164968 793067157 792906344 792924941
3938.4 792924941 793077290 793169916 793215811 793317497 793453932 793510377 793436289 793358207 793386161 793451190 793526709
3960.8 793526709 793610394 793638289 793636024 793714464 793905258 794051468 794067144 794069290 794103920 794202209 794433117
3983.2 794433117 794642150 794685900 794696569 794766903 794854462 794973552 795134723
3997.5 795134723
$$ packed form
3915.9G92867362J45853J06514l9518r4951Q703N7041O4493M9471r7811j60813J8597
3938.4G92924941J52349R2626M5895J01686J36435N6445p4088p8082K7954O5029P5519
3960.8G93526709Q3685K7895k265P8440J90794J46210J5676K146L4630R8289K30908
3983.2G94433117K09033M3750J0669P0334Q7559J19090J61171
3997.5G95134723
##END=$$ End of the data block
