##TITLE=$$ Begin of the data block
##JCAMP-DX=5.00 $$ ACD/SpecManager v 10.08
##SPECTROMETER/DATA SYSTEM=Alpha
##DATE=15 Apr 2014 09:00:42
##DATA TYPE=INFRARED SPECTRUM
##DATA CLASS=XYDATA
##ORIGIN=
##OWNER=
##NPOINTS=1765
##FIRSTX=399.75695801
##LASTX=3997.56933594
##MAXX=3997.56933594
##MINX=399.75695801
##MAXY=0.83518726
##MINY=0.22731683
##XFACTOR=1.0000000000
##YFACTOR=1.000000000000000e-9
##FIRSTY=0.56689948
##DELTAX=2.03957629
##XUNITS=1/CM
##YUNITS=ARBITRARY UNITS
##XYDATA=(X++(Y..Y))
399.8 566899478 564798415 562771857 561682940 560287416 558891535 558243513 557234347 556785226 557745457
418.1 557745457 557475746 556443691 556340873 555367470 554009378 553954899 553742766 552827775 552145660 551168144
438.5 551168144 550496161 550930977 550858080 550081313 549847364 549395084 548564851 548610151 548429906 547153115
458.9 547153115 546441317 545639873 544098675 543358803 542909861 541704714 540588915 539464235 538093626
477.3 538093626 537578702 537334323 536373317 535967112 535849214 534764349 533899188 533381641 531988263
495.6 531988263 530774415 530285180 529225230 528182387 527786195 526750445 525588691 525043786 523811221
514 523811221 522189140 521145523 519650638 517969072 517114997 515836596 514016509 513065100 512135625
532.3 512135625 510747135 509965479 509108484 507727265 506979764 506277263 504946649 504127741 503404140
550.7 503404140 501942933 500820279 499864906 498026997 496320426 495065838 493108541 490972906 489132255
569 489132255 486674964 484189928 482346445 480162621 477930933 476359367 474581629 472569406 470992774
587.4 470992774 469071835 466724187 464928836 463047564 460675627 458549142 456033498 452765018
603.7 452765018 450267941 448815286 447643250 447075814 446950048 447107404 449035287 452854902 456922859
622.1 456922859 461218476 465795398 469670296 473352641 477513254 481054902 484028995 487215936
638.4 487215936 489434719 490397274 491990477 494729847 497771829 500558496 501696467 501222193 502574861
656.7 502574861 507446051 513750851 519855320 524637520 528293133 532970428 537151873 539916158
673.1 539916158 543012500 546744585 549711883 552315772 555400014 557754457 559555233 561924934
689.4 561924934 563822389 564968884 566509008 567786276 568548679 570060968 571821272 573201656 575455070
707.7 575455070 578258455 580449939 583014727 585995793 588258862 590768993 593970060 596515119
724 596515119 598938286 601876676 604198933 606239617 608763933 610641062 611995757 614077628 615986526
742.4 615986526 617383957 619513929 621714711 623222888 625201225 627334654 628811121 630886972
758.7 630886972 633427441 635176003 637097180 639528751 641111076 642385602 643862247 644260705 644030333
777.1 644030333 644071639 643323660 642034292 641503870 641114116 640961111 642433047 645006239 648259699
795.4 648259699 653279722 659255743 664990664 671234310 677334845 681984067 686186314 690090775
811.7 690090775 692418635 693995237 695314348 694992900 693455100 691493452 688119769 683800817 679699838
830.1 679699838 675046802 670067191 666013420 662112474 657911956 654481113 651500285 648719370
846.4 648719370 647631645 648469746 650690615 655248046 661987185 669453382 677892208 687175333 695695341
864.8 695695341 703590751 711301148 717487037 722248495 726601541 729644060 731297910 732566178
881.1 732566178 732632101 731288254 729890406 728143930 725703955 723948896 722963393 722133696 722320020
899.4 722320020 723302603 723826349 724357188 724915802 724278569 722803712 720847785 717467368 713148952
917.8 713148952 708905995 704406381 700275481 697793424 696475863 695923746 696528614 697310507 697492182
936.2 697492182 697811782 698009193 697450697 696888208 696202934 694417000 691920400 688836992 684335589
954.5 684335589 678749382 672371030 664327919 654709458 643972635 631542921 617735505 603741109
970.8 603741109 589901626 576839387 565586209 555839539 547093570 539699316 533308327 527276933
987.1 527276933 521944463 517437518 513381600 510064721 507611156 505445957 503570735 502002001
1003.5 502002001 499856591 496736795 492894322 488166422 482780188 477450877 472196519 467012763
1019.8 467012763 462372303 458109260 453876317 450003713 446473002 442960441 439763725 437032133
1036.1 437032133 434461117 432156026 430165023 428067356 425835341 423688442 421564698 419712394
1052.4 419712394 418650150 418435752 418987483 420191556 421325713 421620280 420847267 418740511 415238678
1070.8 415238678 411015451 406643599 402325571 398406893 394926518 391442835 387780964 383930296
1087.1 383930296 379742384 375513643 371915728 369233102 367531091 366873771 366916567 367228150 367634058
1105.4 367634058 367870957 367656469 366942048 365539521 363081306 359436929 354725868 349638253 345703155
1123.8 345703155 343938142 343724102 343959093 343906254 343330830 343038946 343975395 345921397 348119915
1142.2 348119915 350249887 352171570 353789359 355321974 357001811 358907580 361310333 364473015
1158.5 364473015 368377119 373145640 378975540 385652602 392890930 400604934 408497512 416235179
1174.8 416235179 423783511 431032836 437745899 443854779 449117422 453097075 455815256 457541853
1191.1 457541853 458484590 459233463 460446745 462243319 464680284 467872113 471411437 474805593 477999091
1209.5 477999091 480788559 482933849 484779328 486554444 488134414 489787936 491717696 493712217
1225.8 493712217 495958209 498701543 501644850 504780829 508341372 511997819 515535295 519123316
1242.1 519123316 522461414 525279343 527829111 529935420 531341255 532489896 533562303 534437776
1258.4 534437776 535627842 537403226 539428294 541948080 545220792 548794806 552614093 556917965
1274.7 556917965 561337650 565797269 570701361 575776815 580825090 586315691 592022121 597437322
1291 597437322 602856278 608174264 612915099 617449343 621850967 625559270 628885567 632104754 634631217
1309.4 634631217 636679351 638757527 640381098 641659558 643233001 644712448 646046758 647843719
1325.7 647843719 649606764 650807321 651945829 652814090 653025985 653331876 653781176 653788269 654089391
1344.1 654089391 655024290 655780435 656453907 657313168 657673895 657652915 657813013 657556951 656576455 655404449
1364.5 655404449 653927803 652255952 651168168 650297165 648869753 647419155 645892382 643469870
1380.8 643469870 640842557 639058411 637749553 636503935 635361791 633910477 632114470 630085170
1397.1 630085170 627112389 623577476 620442927 617120624 613583684 610754371 608270764 605828643
1413.4 605828643 604222000 603232145 601823986 600507259 599623382 598533452 597643077 597087383 596114099
1431.8 596114099 595273614 595208347 594981313 594567597 594878972 595522285 596507788 598493159 600890815
1450.1 600890815 603424847 607261479 613678157 621363878 627746999 633950591 641081333 648711801
1466.4 648711801 656230688 664519846 674779296 684625268 691689730 697284997 702450275 706454992
1482.8 706454992 709101021 711278498 712298274 711328149 709709048 707746208 704583526 700762153
1499.1 700762153 696817875 692856193 688858867 683046758 675894499 669678986 664397597 659568310
1515.4 659568310 655472159 652522922 649461150 645994127 643073261 640066326 637184680 635241210
1531.7 635241210 633358836 631203949 630134225 629950821 628931880 627844930 627306581 627142608 627843022
1550.1 627843022 629322648 630868554 632711649 635333955 636377454 635589242 634978294 634190381 632688940
1568.4 632688940 630346358 627115071 623160541 617928207 611665964 605133832 598425984 591304421
1584.7 591304421 583407462 575267553 567019403 558355927 549598455 541061938 532428384 523751080
1601.1 523751080 515273571 506787419 498292953 489865363 481451392 473433793 465615958 457178563
1617.4 457178563 449715704 443575352 437384784 431295127 425988913 421528548 418166012 416186720
1633.7 416186720 415352553 414969295 415162295 416441858 418718636 422360748 426664352 430081129 434766948
1652 434766948 441670626 446451575 450422823 455801517 462594151 469501138 475851446 483240783 491600871
1670.4 491600871 499078155 507025182 515673935 523474932 531196952 540336847 551503956 561146557
1686.7 561146557 569048643 577304542 585564435 595058739 605562270 616405129 628729641 638804436
1703 638804436 647430897 656345189 663957596 670705974 677409649 684110463 690765262 696235478 700275302
1721.4 700275302 704153240 708347201 712400913 716256618 720222592 724665403 728459835 731597364
1737.7 731597364 735405684 739440024 743460655 747915149 752519965 757076144 761359215 764932513
1754 764932513 768321157 771818042 774991333 777780354 780272305 782668829 785066187 787552118 789839089
1772.4 789839089 791323185 792585731 794230461 795879900 797390342 798974752 800396442 801794231
1788.7 801794231 803539932 805076122 806014717 807102919 808399796 809451938 810354054 811237633 812052369
1807 812052369 813006520 813995123 814638376 815285385 816144824 816849768 817503214 818438947 819322228 820006847
1827.4 820006847 820722997 821141720 821357787 821846664 822422922 822909892 823667765 824503541 824806094 824958146
1847.8 824958146 825315177 825616837 825942636 826432407 826798141 827083230 827542484 828023612 828508377 829051733
1868.2 829051733 829218030 829104900 829292417 829624116 829805017 830056965 830373049 830524385 830759645 831160843
1888.6 831160843 831313074 831365526 831595421 831697822 831717968 831938207 832124770 832221270 832480192 832672477
1909 832672477 832610369 832667112 832929730 833092749 833163857 833230913 833146155 833059967 833133280 833104014 833007216
1931.5 833007216 833060265 833043575 832940698 833030820 833093107 832880080 832711875 832617581 832425237 832351148 832340240
1953.9 832340240 832143843 831973851 831925809 831749201 831583321 831583500 831451654 831203938 831086338 830924273
1974.3 830924273 830698431 830640018 830554843 830343306 830275595 830239415 830049634 829958260 829877257 829554856 829322815
1996.7 829322815 829259813 829031825 828779042 828690886 828491151 828216493 828105271 827944458 827689469 827562034
2017.1 827562034 827366590 827015221 826823354 826685846 826404631 826218128 826099217 825829625 825643361 825580716
2037.5 825580716 825343251 825125873 825099051 824941635 824690044 824597776 824447989 824217737 824171305 824120402
2057.9 824120402 823940933 823891640 823839724 823610544 823542774 823568165 823374629 823269248 823341668 823233604
2078.3 823233604 823130310 823203325 823107302 822963119 823025942 822984576 822845161 822915375 822948694 822829247 822872460
2100.7 822872460 822925210 822798967 822808981 822906792 822837293 822840810 822922885 822822988 822808921 823016644 823094904
2123.2 823094904 823113739 823274374 823341250 823360384 823534191 823598802 823539317 823690534 823872268 823908925 824061871
2145.6 824061871 824227095 824222267 824339390 824552953 824593604 824713945 824985147 825079083 825134456 825323582
2166 825323582 825407624 825477242 825718582 825866044 825926185 826137066 826273620 826292515 826480687 826656997 826673210
2188.4 826673210 826807201 826960206 826921880 826984823 827170014 827190936 827235103 827400565 827423632 827426195 827554166
2210.9 827554166 827568114 827550769 827702522 827752531 827672839 827759027 827848911 827808976 827887714 827959120 827838957
2233.3 827838957 827815354 827895880 827848732 827829242 827872396 827777267 827696800 827741146 827687025 827609420 827656388
2255.8 827656388 827615023 827493012 827516556 827539861 827475190 827534795 827610135 827551484 827587664 827713788 827749610
2278.2 827749610 827879846 828101993 828140438 828147829 828249514 828181684 828052759 828105867 828120947 828060746 828123868
2300.6 828123868 828125775 827979624 827932954 827890992 827736735 827699363 827696979 827519417 827362359 827296376 827119231
2323.1 827119231 826944768 826902628 826882720 826926708 827007294 826923132 826798737 826831818 826903284 827110887 827779174
2345.5 827779174 828475773 828609943 828306019 827846825 827326477 827013493 826977789 827071965 827506602 828225195
2365.9 828225195 828810632 829419792 830233812 830940425 831582487 832321167 832963943 833501101 834030271 834373593
2386.3 834373593 834508657 834656179 834782064 834818423 834928274 835052252 835047483 835075617 835157871 835130036 835114896
2408.7 835114896 835187256 835157752 835076869 835060954 834988058 834904611 834926188 834886193 834757924 834711492 834645092
2431.2 834645092 834487557 834410727 834378958 834259748 834162474 834096551 833942115 833812356 833758056 833635151
2451.5 833635151 833517551 833482981 833357692 833176672 833078325 832929969 832722485 832608581 832493663 832299054
2471.9 832299054 832174063 832079649 831883252 831713259 831614017 831449509 831268311 831124067 830933452 830748260
2492.3 830748260 830635607 830524981 830396056 830266237 830093086 829900086 829753876 829584658 829364061 829207420
2512.7 829207420 829092145 828927815 828765213 828596652 828392982 828254044 828153849 827961326 827725470 827538252
2533.1 827538252 827368200 827233315 827129543 826929569 826693356 826545417 826384962 826171160 826005161 825841606
2553.5 825841606 825608313 825407624 825256586 825045228 824801683 824571252 824300408 824038208 823843896 823604524
2573.9 823604524 823276341 822953403 822647035 822343946 822049022 821692586 821291745 820939958 820568860 820137918
2594.3 820137918 819749534 819370031 818901658 818409503 817971051 817530513 817055285 816583574 816109419 815635383
2614.7 815635383 815178216 814708650 814216375 813727200 813228607 812705457 812193274 811702251 811230958 810796082
2635.1 810796082 810341895 809835374 809371173 808962345 808516562 808035612 807560444 807081580 806606114 806171060
2655.5 806171060 805742621 805262446 804798424 804391444 803976357 803572416 803208530 802832842 802422404 801987469
2675.9 801987469 801543295 801104665 800668597 800185978 799654365 799165964 798751831 798344910 797884822 797367692
2696.3 797367692 796824098 796265960 795686722 795108795 794560611 793992221 793360412 792740822 792156577 791547537
2716.7 791547537 790931523 790319920 789688349 789073050 788487494 787864089 787222624 786659777 786135614 785567701
2737.1 785567701 784986198 784416378 783848584 783307254 782776833 782199383 781587958 780974865 780342460 779693842
2757.5 779693842 779045939 778367460 777629375 776880145 776171625 775461555 774702787 773913443 773105860 772279978
2777.9 772279978 771431088 770562351 769707739 768844545 767895520 766889572 765902758 764893591 763826728
2796.2 763826728 762723148 761564434 760375202 759181142 757938743 756673813 755391002 754007280
2812.5 754007280 752572298 751188397 749798477 748305798 746704102 745009422 743212044 741292775
2828.9 741292775 739213884 736912012 734288275 731216252 727575421 723255277 718128443 712123752
2845.2 712123752 705600739 699489772 694752038 691870153 690771580 690900385 691447437 691686332 691172361
2863.5 691172361 689829767 687875748 685666740 683609307 681941867 680646658 679573357 678512156
2879.9 678512156 677299857 675814867 673989177 671876192 669525385 666998446 664404452 661759079
2896.2 661759079 659045696 656269908 653365195 650201559 646666467 642636836 637947321 632502139
2912.5 632502139 626456499 620387614 615069866 611001551 608340502 607051373 606981874 607859552 609367013
2930.8 609367013 611398220 614005446 617080331 620394170 623763859 626934826 629579186 631484091
2947.2 631484091 632643878 633213162 633385479 633448958 633758366 634495199 635656655 637148440 638837218
2965.5 638837218 640613675 642431080 644281864 646108508 647824645 649426103 650952876 652363896
2981.8 652363896 653616071 654740810 655735254 656573534 657174051 657411814 657331049 656977832 656355917
3000.2 656355917 655598879 654757380 653836191 652957082 652153313 651284158 650217831 648940265 647534668
3018.5 647534668 646119356 644698083 643177748 641587555 640024424 638462305 636840701 635110021
3034.9 635110021 633225977 631314754 629503012 627643406 625584602 623433411 621330261 619238138
3051.2 619238138 617095649 614933252 612746239 610550046 608446836 606448710 604486763 602516890
3067.5 602516890 600494683 598445892 596457243 594539881 592648745 590697408 588629961 586540997
3083.8 586540997 584487438 582420945 580331445 578185201 575951993 573715448 571571410 569446027
3100.1 569446027 567193151 564855814 562553465 560239911 557794213 555302024 552913249 550532818
3116.4 550532818 547993422 545249522 542371631 539506972 536743402 534037173 531278193 528384149
3132.8 528384149 525437891 522603512 519814789 516868591 513785303 510695338 507633388 504642606
3149.1 504642606 501692951 498595476 495300800 491994351 488750100 485506624 482282966 479106843
3165.4 479106843 475946397 472741544 469467640 466188192 462973058 459803492 456634730 453455269
3181.7 453455269 450273812 447093278 443909496 440723449 437546372 434399784 431285203 428183198
3198 428183198 425061047 421933889 418872654 415913701 413017273 410120934 407214254 404323399 401494592
3216.4 401494592 398746967 396043479 393349677 390663236 387997061 385370731 382814854 380366892
3232.7 380366892 377970070 375509411 373015434 370608181 368334681 366146266 363952130 361717284
3249 361717284 359508902 357411087 355405807 353387058 351319313 349268079 347248524 345238030 343286723
3267.4 343286723 341425478 339557052 337616563 335652828 333690971 331773847 329945415 328121573
3283.7 328121573 326253712 324393123 322567940 320756286 318900704 316994071 315075725 313156247
3300 313156247 311255157 309417188 307575196 305578589 303439647 301296294 299213856 297172278 295146853
3318.4 295146853 293129891 291128933 289137930 287093908 284979582 282876223 280829251 278853863
3334.7 278853863 276959687 275020808 272911996 270732433 268604279 266575277 264683276 262775958
3351 262775958 260678113 258516371 256506801 254671693 252875298 251057893 249331847 247698516 245973364
3369.3 245973364 244091153 242274821 240713790 239316151 237970859 236645326 235427976 234414905
3385.7 234414905 233591720 232947811 232300982 231435552 230584905 230095521 229827166 229382679 228706315 228142783
3406.1 228142783 227844417 227676526 227527991 227384239 227316827 227368563 227502882 227713093 228080288 228645444
3426.5 228645444 229371041 230133384 230955005 231921673 232821032 233526453 234314039 235401466 236706778
3444.8 236706778 238095731 239482209 240916967 242490858 244225442 246106848 248093337 250055552
3461.1 250055552 252003968 254202664 256637216 258868217 260703921 262538761 264671266 267088860
3477.4 267088860 269596428 271948040 274256974 276760608 279343814 281841457 284404516 287165910
3493.8 287165910 290041834 292853355 295650870 298589945 301459879 304122597 306943536 310097784
3510.1 310097784 313377023 316594720 319707036 322880715 326269507 329898328 333516419 336978793
3526.4 336978793 340513647 344211698 348027527 352024883 356091797 360022724 364078045 368510097
3542.7 368510097 373108894 377453327 381561399 385901302 390554518 395213008 399882823 404791802
3559 404791802 409859568 414856046 420046270 425898969 431742638 437038392 442378372 448089659 454030901
3577.4 454030901 460162371 466435879 472750157 479291499 486191630 492889792 499153554 505674124
3593.7 505674124 512622535 519669592 526786864 533885837 540798485 547741354 555146277 562679231
3610 562679231 569943309 577063084 583977640 591165960 598681808 605456769 611582994 618010640 625588000
3628.4 625588000 633129776 639163256 644905388 650861204 656731486 662549794 668188691 673622310
3644.7 673622310 679289997 685470104 690964937 694923937 698612094 702920079 707081795 710726738
3661 710726738 714222670 717723489 721310019 725102663 728605926 731434941 734207392 736629665 738451600
3679.4 738451600 740369856 742590189 745074987 747963727 750685811 752432048 753771663 755286515
3695.7 755286515 756880045 758467913 760063946 761477649 762765110 764256418 765836656 767019093
3712 767019093 767797768 768568456 769476950 770458281 771362841 772086620 772760034 773532152 774512231 775814235
3732.4 775814235 777063310 777767897 778191984 778733969 779423714 780206501 780933380 781482935 781873345
3750.7 781873345 782070696 782231450 782533050 782939196 783267915 783535480 783978879 784550786 784964800 785168588
3771.1 785168588 785328507 785624743 786164761 786700428 786880732 786933303 787122250 787324011 787571669 787994266
3791.5 787994266 788478494 788939118 789364815 789738953 790087163 790297389 790309846 790222526 790207148 790443838
3811.9 790443838 790893257 791421056 791889369 792137563 792062819 791804254 791666687 791742742 791966379 792291343
3832.3 792291343 792728186 793147683 793230772 793029428 792843521 792708039 792668521 792909682 793396354 793767393
3852.7 793767393 793697655 793399334 793208957 793298066 793546319 793689787 793762863 793862104 793877661 793748558
3873.1 793748558 793586373 793526053 793712378 794023514 794146955 794123232 794058979 793979645 793916523 793841839 793844938
3895.5 793844938 794046760 794317007 794373333 794169128 793900847 793655038 793429673 793386400 793580890 793763697
3915.9 793763697 793816388 793841004 793845236 793833435 793840289 793863773 793935001 794032753 794022560 793900073 793830156 793861270
3940.4 793861270 793966293 794124067 794241309 794301808 794341683 794307113 794243574 794289470 794400632 794480443 794531524
3962.9 794531524 794536650 794526875 794603407 794752955 794889271 794980705 795002520 794989347 795065880 795266509 795462310
3985.3 795462310 795544803 795552850 795576632 795616329 795693338 795868099
3997.5 795868099
##END=$$ End of the data block
